olingo-commits mailing list archives

Site index · List index
Message view « Date » · « Thread »
Top « Date » · « Thread »
From Apache Jenkins Server <jenk...@builds.apache.org>
Subject Build failed in Jenkins: olingo-odata2 #1275
Date Wed, 13 Apr 2016 11:10:07 GMT
See <https://builds.apache.org/job/olingo-odata2/1275/>

------------------------------------------
[...truncated 10231 lines...]
588/625 KB   386/636 KB   203/203 KB   202/202 KB   
592/625 KB   386/636 KB   203/203 KB   202/202 KB   
596/625 KB   386/636 KB   203/203 KB   202/202 KB   
600/625 KB   386/636 KB   203/203 KB   202/202 KB   
604/625 KB   386/636 KB   203/203 KB   202/202 KB   
608/625 KB   386/636 KB   203/203 KB   202/202 KB   
612/625 KB   386/636 KB   203/203 KB   202/202 KB   
616/625 KB   386/636 KB   203/203 KB   202/202 KB   
620/625 KB   386/636 KB   203/203 KB   202/202 KB   
624/625 KB   386/636 KB   203/203 KB   202/202 KB   
                                                    
Downloaded: http://repo.maven.apache.org/maven2/commons-beanutils/commons-beanutils-core/1.8.3/commons-beanutils-core-1.8.3.jar
(202 KB at 4485.9 KB/sec)
625/625 KB   386/636 KB   203/203 KB                
625/625 KB   390/636 KB   203/203 KB   
625/625 KB   394/636 KB   203/203 KB   
625/625 KB   398/636 KB   203/203 KB   
625/625 KB   402/636 KB   203/203 KB   
625/625 KB   406/636 KB   203/203 KB   
625/625 KB   410/636 KB   203/203 KB   
625/625 KB   414/636 KB   203/203 KB   
625/625 KB   418/636 KB   203/203 KB   
625/625 KB   422/636 KB   203/203 KB   
625/625 KB   426/636 KB   203/203 KB   
625/625 KB   430/636 KB   203/203 KB   
625/625 KB   434/636 KB   203/203 KB   
625/625 KB   438/636 KB   203/203 KB   
625/625 KB   442/636 KB   203/203 KB   
625/625 KB   446/636 KB   203/203 KB   
625/625 KB   450/636 KB   203/203 KB   
625/625 KB   454/636 KB   203/203 KB   
625/625 KB   458/636 KB   203/203 KB   
625/625 KB   462/636 KB   203/203 KB   
625/625 KB   466/636 KB   203/203 KB   
625/625 KB   470/636 KB   203/203 KB   
625/625 KB   474/636 KB   203/203 KB   
625/625 KB   478/636 KB   203/203 KB   
625/625 KB   482/636 KB   203/203 KB   
625/625 KB   486/636 KB   203/203 KB   
625/625 KB   490/636 KB   203/203 KB   
625/625 KB   494/636 KB   203/203 KB   
625/625 KB   498/636 KB   203/203 KB   
625/625 KB   502/636 KB   203/203 KB   
625/625 KB   506/636 KB   203/203 KB   
625/625 KB   510/636 KB   203/203 KB   
625/625 KB   514/636 KB   203/203 KB   
625/625 KB   518/636 KB   203/203 KB   
625/625 KB   522/636 KB   203/203 KB   
625/625 KB   526/636 KB   203/203 KB   
625/625 KB   530/636 KB   203/203 KB   
625/625 KB   534/636 KB   203/203 KB   
625/625 KB   538/636 KB   203/203 KB   
625/625 KB   540/636 KB   203/203 KB   
                                       
Downloaded: http://repo.maven.apache.org/maven2/commons-lang/commons-lang/2.1/commons-lang-2.1.jar
(203 KB at 4409.9 KB/sec)
625/625 KB   544/636 KB                
625/625 KB   548/636 KB   
625/625 KB   552/636 KB   
625/625 KB   556/636 KB   
625/625 KB   560/636 KB   
625/625 KB   564/636 KB   
625/625 KB   568/636 KB   
625/625 KB   572/636 KB   
625/625 KB   576/636 KB   
625/625 KB   580/636 KB   
625/625 KB   584/636 KB   
625/625 KB   588/636 KB   
625/625 KB   592/636 KB   
625/625 KB   596/636 KB   
625/625 KB   600/636 KB   
625/625 KB   604/636 KB   
625/625 KB   608/636 KB   
625/625 KB   612/636 KB   
625/625 KB   616/636 KB   
625/625 KB   620/636 KB   
625/625 KB   624/636 KB   
625/625 KB   628/636 KB   
625/625 KB   632/636 KB   
625/625 KB   636/636 KB   
625/625 KB   636/636 KB   
                          
Downloaded: http://repo.maven.apache.org/maven2/com/google/collections/google-collections/1.0/google-collections-1.0.jar
(625 KB at 10957.9 KB/sec)
                          
Downloaded: http://repo.maven.apache.org/maven2/com/puppycrawl/tools/checkstyle/5.6/checkstyle-5.6.jar
(636 KB at 9351.4 KB/sec)
[INFO] Starting audit...
Audit done.

[INFO] 
[INFO] --- maven-install-plugin:2.3.1:install (default-install) @ olingo-odata2-parent ---
Downloading: http://repo.maven.apache.org/maven2/org/codehaus/plexus/plexus-digest/1.0/plexus-digest-1.0.pom
2/2 KB                    
         
Downloaded: http://repo.maven.apache.org/maven2/org/codehaus/plexus/plexus-digest/1.0/plexus-digest-1.0.pom
(2 KB at 47.0 KB/sec)
Downloading: http://repo.maven.apache.org/maven2/org/codehaus/plexus/plexus-components/1.1.7/plexus-components-1.1.7.pom
4/5 KB   
5/5 KB   
         
Downloaded: http://repo.maven.apache.org/maven2/org/codehaus/plexus/plexus-components/1.1.7/plexus-components-1.1.7.pom
(5 KB at 220.8 KB/sec)
Downloading: http://repo.maven.apache.org/maven2/org/codehaus/plexus/plexus-container-default/1.0-alpha-8/plexus-container-default-1.0-alpha-8.pom
4/8 KB   
8/8 KB   
         
Downloaded: http://repo.maven.apache.org/maven2/org/codehaus/plexus/plexus-container-default/1.0-alpha-8/plexus-container-default-1.0-alpha-8.pom
(8 KB at 337.8 KB/sec)
Downloading: http://repo.maven.apache.org/maven2/org/codehaus/plexus/plexus-digest/1.0/plexus-digest-1.0.jar
4/12 KB   
8/12 KB   
12/12 KB   
           
Downloaded: http://repo.maven.apache.org/maven2/org/codehaus/plexus/plexus-digest/1.0/plexus-digest-1.0.jar
(12 KB at 551.4 KB/sec)
[INFO] Installing <https://builds.apache.org/job/olingo-odata2/ws/pom.xml> to /home/jenkins/.m2/repository/org/apache/olingo/olingo-odata2-parent/2.0.7-SNAPSHOT/olingo-odata2-parent-2.0.7-SNAPSHOT.pom
[INFO] 
[INFO] --- maven-deploy-plugin:2.7:deploy (default-deploy) @ olingo-odata2-parent ---
Downloading: http://repo.maven.apache.org/maven2/org/codehaus/plexus/plexus-utils/1.5.6/plexus-utils-1.5.6.pom
4/6 KB     
6/6 KB   
         
Downloaded: http://repo.maven.apache.org/maven2/org/codehaus/plexus/plexus-utils/1.5.6/plexus-utils-1.5.6.pom
(6 KB at 258.9 KB/sec)
Downloading: http://repo.maven.apache.org/maven2/org/codehaus/plexus/plexus/1.0.12/plexus-1.0.12.pom
4/10 KB   
8/10 KB   
10/10 KB   
           
Downloaded: http://repo.maven.apache.org/maven2/org/codehaus/plexus/plexus/1.0.12/plexus-1.0.12.pom
(10 KB at 455.7 KB/sec)
Downloading: http://repo.maven.apache.org/maven2/org/codehaus/plexus/plexus-utils/1.5.6/plexus-utils-1.5.6.jar
4/245 KB   
8/245 KB   
12/245 KB   
16/245 KB   
20/245 KB   
24/245 KB   
28/245 KB   
32/245 KB   
36/245 KB   
40/245 KB   
44/245 KB   
48/245 KB   
52/245 KB   
56/245 KB   
60/245 KB   
64/245 KB   
68/245 KB   
72/245 KB   
76/245 KB   
80/245 KB   
84/245 KB   
88/245 KB   
92/245 KB   
96/245 KB   
100/245 KB   
104/245 KB   
108/245 KB   
112/245 KB   
116/245 KB   
120/245 KB   
124/245 KB   
128/245 KB   
132/245 KB   
136/245 KB   
140/245 KB   
144/245 KB   
144/245 KB   
148/245 KB   
152/245 KB   
156/245 KB   
160/245 KB   
164/245 KB   
168/245 KB   
172/245 KB   
176/245 KB   
180/245 KB   
184/245 KB   
188/245 KB   
192/245 KB   
196/245 KB   
200/245 KB   
204/245 KB   
208/245 KB   
212/245 KB   
216/245 KB   
220/245 KB   
224/245 KB   
228/245 KB   
232/245 KB   
236/245 KB   
240/245 KB   
244/245 KB   
245/245 KB   
             
Downloaded: http://repo.maven.apache.org/maven2/org/codehaus/plexus/plexus-utils/1.5.6/plexus-utils-1.5.6.jar
(245 KB at 7646.1 KB/sec)
Downloading: https://repository.apache.org/content/repositories/snapshots/org/apache/olingo/olingo-odata2-parent/2.0.7-SNAPSHOT/maven-metadata.xml
616/616 B    
            
Downloaded: https://repository.apache.org/content/repositories/snapshots/org/apache/olingo/olingo-odata2-parent/2.0.7-SNAPSHOT/maven-metadata.xml
(616 B at 0.5 KB/sec)
Uploading: https://repository.apache.org/content/repositories/snapshots/org/apache/olingo/olingo-odata2-parent/2.0.7-SNAPSHOT/olingo-odata2-parent-2.0.7-20160413.111009-12.pom
2/15 KB     
4/15 KB   
6/15 KB   
8/15 KB   
10/15 KB   
12/15 KB   
14/15 KB   
15/15 KB   
           
[INFO] ------------------------------------------------------------------------
[INFO] Reactor Summary:
[INFO] 
[INFO] olingo-odata2-parent .............................. FAILURE [15.741s]
[INFO] olingo-odata2-lib ................................. SKIPPED
[INFO] olingo-odata2-api ................................. SKIPPED
[INFO] olingo-odata2-api-annotation ...................... SKIPPED
[INFO] olingo-odata2-testutil ............................ SKIPPED
[INFO] olingo-odata2-core ................................ SKIPPED
[INFO] olingo-odata2-ref ................................. SKIPPED
[INFO] olingo-odata2-fit ................................. SKIPPED
[INFO] olingo-odata2-ref-web ............................. SKIPPED
[INFO] olingo-odata2-jpa-processor ....................... SKIPPED
[INFO] olingo-odata2-jpa-processor-api ................... SKIPPED
[INFO] olingo-odata2-jpa-processor-core .................. SKIPPED
[INFO] olingo-odata2-jpa-processor-ref ................... SKIPPED
[INFO] olingo-odata2-jpa-processor-ref-web ............... SKIPPED
[INFO] olingo-odata2-annotation-processor ................ SKIPPED
[INFO] olingo-odata2-annotation-processor-api ............ SKIPPED
[INFO] olingo-odata2-annotation-processor-core ........... SKIPPED
[INFO] olingo-odata2-annotation-processor-ref ............ SKIPPED
[INFO] olingo-odata2-annotation-processor-ref-web ........ SKIPPED
[INFO] olingo-odata2-dist ................................ SKIPPED
[INFO] olingo-odata2-dist-lib ............................ SKIPPED
[INFO] olingo-odata2-dist-jpa ............................ SKIPPED
[INFO] olingo-odata2-dist-janos .......................... SKIPPED
[INFO] olingo-odata2-dist-ref ............................ SKIPPED
[INFO] olingo-odata2-dist-javadoc ........................ SKIPPED
[INFO] olingo-odata2-sample .............................. SKIPPED
[INFO] olingo-odata2-sample-cars-service-archetype ....... SKIPPED
[INFO] olingo-odata2-sample-cars-annotation-archetype .... SKIPPED
[INFO] olingo-odata2-sample-cars-jpa-archetype ........... SKIPPED
[INFO] ------------------------------------------------------------------------
[INFO] BUILD FAILURE
[INFO] ------------------------------------------------------------------------
[INFO] Total time: 20.796s
[INFO] Finished at: Wed Apr 13 11:10:09 UTC 2016
[INFO] Final Memory: 20M/134M
[INFO] ------------------------------------------------------------------------
[ERROR] Failed to execute goal org.apache.maven.plugins:maven-deploy-plugin:2.7:deploy (default-deploy)
on project olingo-odata2-parent: Failed to deploy artifacts: Could not transfer artifact org.apache.olingo:olingo-odata2-parent:pom:2.0.7-20160413.111009-12
from/to apache.snapshots.https (https://repository.apache.org/content/repositories/snapshots):
Failed to transfer file: https://repository.apache.org/content/repositories/snapshots/org/apache/olingo/olingo-odata2-parent/2.0.7-SNAPSHOT/olingo-odata2-parent-2.0.7-20160413.111009-12.pom.
Return code is: 401, ReasonPhrase:Unauthorized. -> [Help 1]
[ERROR] 
[ERROR] To see the full stack trace of the errors, re-run Maven with the -e switch.
[ERROR] Re-run Maven using the -X switch to enable full debug logging.
[ERROR] 
[ERROR] For more information about the errors and possible solutions, please read the following
articles:
[ERROR] [Help 1] http://cwiki.apache.org/confluence/display/MAVEN/MojoExecutionException
Build step 'Invoke top-level Maven targets' marked build as failure

Mime
View raw message