olingo-commits mailing list archives

Site index · List index
Message view « Date » · « Thread »
Top « Date » · « Thread »
From Apache Jenkins Server <jenk...@builds.apache.org>
Subject Build failed in Jenkins: olingo-odata4 #1283
Date Mon, 18 Jan 2016 13:35:56 GMT
See <https://builds.apache.org/job/olingo-odata4/1283/changes>

Changes:

[christian.amend] [OLINGO-834] better debug output

[christian.amend] [OLINGO-834] clean-up exceptions

[christian.amend] reduced usage of org.slf4j and org.apache.commons.lang3

[christian.amend] [OLINGO-575] removal of some test V3 code

[christian.amend] [OLINGO-834] parsing of most geo literals in URI parser

[christian.amend] [OLINGO-???] less use of reflection in equals() and hashCode()

------------------------------------------
[...truncated 43978 lines...]
11934/12408 KB   
11938/12408 KB   
11942/12408 KB   
11946/12408 KB   
11950/12408 KB   
11952/12408 KB   
11956/12408 KB   
11960/12408 KB   
11964/12408 KB   
11965/12408 KB   
11969/12408 KB   
11973/12408 KB   
11977/12408 KB   
11981/12408 KB   
11985/12408 KB   
11989/12408 KB   
11991/12408 KB   
11995/12408 KB   
11999/12408 KB   
12003/12408 KB   
12003/12408 KB   
12007/12408 KB   
12011/12408 KB   
12015/12408 KB   
12016/12408 KB   
12020/12408 KB   
12024/12408 KB   
12028/12408 KB   
12032/12408 KB   
12036/12408 KB   
12040/12408 KB   
12044/12408 KB   
12048/12408 KB   
12052/12408 KB   
12054/12408 KB   
12058/12408 KB   
12062/12408 KB   
12066/12408 KB   
12067/12408 KB   
12071/12408 KB   
12075/12408 KB   
12079/12408 KB   
12083/12408 KB   
12087/12408 KB   
12091/12408 KB   
12092/12408 KB   
12096/12408 KB   
12100/12408 KB   
12104/12408 KB   
12105/12408 KB   
12109/12408 KB   
12113/12408 KB   
12117/12408 KB   
12118/12408 KB   
12122/12408 KB   
12126/12408 KB   
12130/12408 KB   
12134/12408 KB   
12138/12408 KB   
12142/12408 KB   
12146/12408 KB   
12150/12408 KB   
12154/12408 KB   
12156/12408 KB   
12160/12408 KB   
12164/12408 KB   
12168/12408 KB   
12169/12408 KB   
12173/12408 KB   
12177/12408 KB   
12181/12408 KB   
12185/12408 KB   
12189/12408 KB   
12193/12408 KB   
12194/12408 KB   
12198/12408 KB   
12202/12408 KB   
12206/12408 KB   
12207/12408 KB   
12211/12408 KB   
12215/12408 KB   
12219/12408 KB   
12220/12408 KB   
12224/12408 KB   
12228/12408 KB   
12232/12408 KB   
12236/12408 KB   
12240/12408 KB   
12244/12408 KB   
12248/12408 KB   
12252/12408 KB   
12256/12408 KB   
12258/12408 KB   
12262/12408 KB   
12266/12408 KB   
12270/12408 KB   
12271/12408 KB   
12275/12408 KB   
12279/12408 KB   
12283/12408 KB   
12287/12408 KB   
12291/12408 KB   
12295/12408 KB   
12296/12408 KB   
12300/12408 KB   
12304/12408 KB   
12308/12408 KB   
12309/12408 KB   
12313/12408 KB   
12317/12408 KB   
12321/12408 KB   
12322/12408 KB   
12326/12408 KB   
12330/12408 KB   
12334/12408 KB   
12338/12408 KB   
12342/12408 KB   
12346/12408 KB   
12347/12408 KB   
12351/12408 KB   
12355/12408 KB   
12359/12408 KB   
12360/12408 KB   
12364/12408 KB   
12368/12408 KB   
12372/12408 KB   
12372/12408 KB   
12376/12408 KB   
12380/12408 KB   
12384/12408 KB   
12385/12408 KB   
12389/12408 KB   
12393/12408 KB   
12397/12408 KB   
12401/12408 KB   
12405/12408 KB   
12408/12408 KB   
                 
Downloaded: http://repo.maven.apache.org/maven2/org/apache/karaf/features/framework/3.0.3/framework-3.0.3.kar
(12408 KB at 13988.5 KB/sec)
[INFO] 
[INFO] --- maven-clean-plugin:2.5:clean (default-clean) @ odata-karaf-fit ---
[INFO] 
[INFO] --- maven-remote-resources-plugin:1.5:process (default) @ odata-karaf-fit ---
[INFO] 
[INFO] --- depends-maven-plugin:1.2:generate-depends-file (generate-depends-file) @ odata-karaf-fit
---
[INFO] Created: <https://builds.apache.org/job/olingo-odata4/ws/ext/karaf/karaf-fit/target/classes/META-INF/maven/dependencies.properties>
[INFO] 
[INFO] --- maven-resources-plugin:2.6:resources (default-resources) @ odata-karaf-fit ---
[INFO] Using 'UTF-8' encoding to copy filtered resources.
[INFO] skip non existing resourceDirectory <https://builds.apache.org/job/olingo-odata4/ws/ext/karaf/karaf-fit/src/main/resources>
[INFO] Copying 3 resources
[INFO] 
[INFO] --- maven-compiler-plugin:2.3.2:compile (default-compile) @ odata-karaf-fit ---
[INFO] No sources to compile
[INFO] 
[INFO] --- maven-resources-plugin:2.6:testResources (default-testResources) @ odata-karaf-fit
---
[INFO] Using 'UTF-8' encoding to copy filtered resources.
[INFO] skip non existing resourceDirectory <https://builds.apache.org/job/olingo-odata4/ws/ext/karaf/karaf-fit/src/test/resources>
[INFO] Copying 3 resources
[INFO] 
[INFO] --- maven-compiler-plugin:2.3.2:testCompile (default-testCompile) @ odata-karaf-fit
---
[INFO] Compiling 3 source files to <https://builds.apache.org/job/olingo-odata4/ws/ext/karaf/karaf-fit/target/test-classes>
[INFO] 
[INFO] --- maven-surefire-plugin:2.17:test (default-test) @ odata-karaf-fit ---
[INFO] Surefire report directory: <https://builds.apache.org/job/olingo-odata4/ws/ext/karaf/karaf-fit/target/surefire-reports>

-------------------------------------------------------
 T E S T S
-------------------------------------------------------
Running org.apache.olingo.osgi.itests.BundlesTest
Tests run: 1, Failures: 1, Errors: 0, Skipped: 0, Time elapsed: 10 sec <<< FAILURE!
- in org.apache.olingo.osgi.itests.BundlesTest
test(org.apache.olingo.osgi.itests.BundlesTest)  Time elapsed: 0.132 sec  <<< FAILURE!
java.lang.AssertionError: Bundle org.apache.olingo.odata-server-api should be installed
	at org.junit.Assert.fail(Assert.java:88)
	at org.junit.Assert.assertTrue(Assert.java:41)
	at org.junit.Assert.assertNotNull(Assert.java:621)
	at org.apache.olingo.osgi.itests.OlingoOSGiTestSupport.assertBundleStarted(OlingoOSGiTestSupport.java:122)
	at org.apache.olingo.osgi.itests.BundlesTest.test(BundlesTest.java:40)

Running org.apache.olingo.osgi.itests.server.CarServiceTest
Tests run: 1, Failures: 1, Errors: 0, Skipped: 0, Time elapsed: 9.043 sec <<< FAILURE!
- in org.apache.olingo.osgi.itests.server.CarServiceTest
testServiceStarted(org.apache.olingo.osgi.itests.server.CarServiceTest)  Time elapsed: 9.042
sec  <<< FAILURE!
java.lang.AssertionError: Bundle org.apache.olingo.odata-server-osgi-sample should be installed
	at org.junit.Assert.fail(Assert.java:88)
	at org.junit.Assert.assertTrue(Assert.java:41)
	at org.junit.Assert.assertNotNull(Assert.java:621)
	at org.apache.olingo.osgi.itests.OlingoOSGiTestSupport.assertBundleStarted(OlingoOSGiTestSupport.java:122)
	at org.apache.olingo.osgi.itests.server.CarServiceTest.testServiceStarted(CarServiceTest.java:52)


Results :

Failed tests: 
  BundlesTest.test:40->OlingoOSGiTestSupport.assertBundleStarted:122 Bundle org.apache.olingo.odata-server-api
should be installed
  CarServiceTest.testServiceStarted:52->OlingoOSGiTestSupport.assertBundleStarted:122 Bundle
org.apache.olingo.odata-server-osgi-sample should be installed

Tests run: 2, Failures: 2, Errors: 0, Skipped: 0

[INFO] ------------------------------------------------------------------------
[INFO] Reactor Summary:
[INFO] 
[INFO] Olingo-OData ...................................... SUCCESS [22.922s]
[INFO] odata-lib ......................................... SUCCESS [8.160s]
[INFO] odata-commons-api ................................. SUCCESS [26.872s]
[INFO] odata-commons-core ................................ SUCCESS [22.124s]
[INFO] odata-client-api .................................. SUCCESS [24.877s]
[INFO] odata-client-core ................................. SUCCESS [26.050s]
[INFO] odata-server-api .................................. SUCCESS [21.446s]
[INFO] odata-server-core ................................. SUCCESS [21.748s]
[INFO] odata-server-core-ext ............................. SUCCESS [36.002s]
[INFO] odata-server-tecsvc ............................... SUCCESS [6.390s]
[INFO] odata-server-test ................................. SUCCESS [8.392s]
[INFO] odata-ext ......................................... SUCCESS [14.997s]
[INFO] odata-client-proxy ................................ SUCCESS [19.867s]
[INFO] pojogen-maven-plugin .............................. SUCCESS [45.446s]
[INFO] odata-client-android .............................. SUCCESS [17.053s]
[INFO] odata-karaf ....................................... SUCCESS [8.706s]
[INFO] odata-karaf-features .............................. SUCCESS [20.793s]
[INFO] odata-samples ..................................... SUCCESS [0.247s]
[INFO] odata-server-osgi-sample .......................... SUCCESS [3.361s]
[INFO] odata-karaf-fit ................................... FAILURE [26.655s]
[INFO] odata-fit ......................................... SKIPPED
[INFO] odata-dist ........................................ SKIPPED
[INFO] Olingo-OData-Client-for-Android ................... SKIPPED
[INFO] Olingo-OData-Client-for-Java ...................... SKIPPED
[INFO] Olingo-OData-Server-for-Java ...................... SKIPPED
[INFO] Olingo-OData-JavaDoc .............................. SKIPPED
[INFO] odata-server-sample ............................... SKIPPED
[INFO] ------------------------------------------------------------------------
[INFO] BUILD FAILURE
[INFO] ------------------------------------------------------------------------
[INFO] Total time: 6:29.001s
[INFO] Finished at: Mon Jan 18 13:36:03 UTC 2016
[INFO] Final Memory: 179M/848M
[INFO] ------------------------------------------------------------------------
[ERROR] Failed to execute goal org.apache.maven.plugins:maven-surefire-plugin:2.17:test (default-test)
on project odata-karaf-fit: There are test failures.
[ERROR] 
[ERROR] Please refer to <https://builds.apache.org/job/olingo-odata4/ws/ext/karaf/karaf-fit/target/surefire-reports>
for the individual test results.
[ERROR] -> [Help 1]
[ERROR] 
[ERROR] To see the full stack trace of the errors, re-run Maven with the -e switch.
[ERROR] Re-run Maven using the -X switch to enable full debug logging.
[ERROR] 
[ERROR] For more information about the errors and possible solutions, please read the following
articles:
[ERROR] [Help 1] http://cwiki.apache.org/confluence/display/MAVEN/MojoFailureException
[ERROR] 
[ERROR] After correcting the problems, you can resume the build with the command
[ERROR]   mvn <goals> -rf :odata-karaf-fit
Build step 'Invoke top-level Maven targets' marked build as failure

Mime
View raw message