olingo-commits mailing list archives

Site index · List index
Message view « Date » · « Thread »
Top « Date » · « Thread »
From Apache Jenkins Server <jenk...@builds.apache.org>
Subject Build failed in Jenkins: olingo-odata4 #1030
Date Wed, 03 Jun 2015 23:22:40 GMT
See <https://builds.apache.org/job/olingo-odata4/1030/>

------------------------------------------
[...truncated 10688 lines...]
[INFO] Deleting <https://builds.apache.org/job/olingo-odata4/ws/fit/target>
[INFO] 
[INFO] --- maven-remote-resources-plugin:1.5:process (default) @ odata-fit ---
[INFO] 
[INFO] --- maven-resources-plugin:2.6:resources (default-resources) @ odata-fit ---
[INFO] Using 'UTF-8' encoding to copy filtered resources.
[INFO] Copying 118 resources
[INFO] Copying 3 resources
[INFO] Copying 3 resources
[INFO] 
[INFO] --- maven-compiler-plugin:2.3.2:compile (default-compile) @ odata-fit ---
[INFO] Compiling 46 source files to <https://builds.apache.org/job/olingo-odata4/ws/fit/target/classes>
[INFO] 
[INFO] --- maven-dependency-plugin:2.8:unpack-dependencies (unpack-dependencies) @ odata-fit
---
[INFO] Unpacking <https://builds.apache.org/job/olingo-odata4/ws/lib/server-core/target/odata-server-core-4.0.0-SNAPSHOT.jar>
to <https://builds.apache.org/job/olingo-odata4/ws/fit/target/classes> with includes
"" and excludes ""
[INFO] Unpacking <https://builds.apache.org/job/olingo-odata4/ws/ext/client-proxy/target/odata-client-proxy-4.0.0-SNAPSHOT.jar>
to <https://builds.apache.org/job/olingo-odata4/ws/fit/target/classes> with includes
"" and excludes ""
[INFO] Unpacking <https://builds.apache.org/job/olingo-odata4/ws/lib/commons-api/target/odata-commons-api-4.0.0-SNAPSHOT.jar>
to <https://builds.apache.org/job/olingo-odata4/ws/fit/target/classes> with includes
"" and excludes ""
[INFO] Unpacking <https://builds.apache.org/job/olingo-odata4/ws/lib/client-core/target/odata-client-core-4.0.0-SNAPSHOT.jar>
to <https://builds.apache.org/job/olingo-odata4/ws/fit/target/classes> with includes
"" and excludes ""
[INFO] Unpacking <https://builds.apache.org/job/olingo-odata4/ws/lib/client-api/target/odata-client-api-4.0.0-SNAPSHOT.jar>
to <https://builds.apache.org/job/olingo-odata4/ws/fit/target/classes> with includes
"" and excludes ""
[INFO] Unpacking <https://builds.apache.org/job/olingo-odata4/ws/lib/server-api/target/odata-server-api-4.0.0-SNAPSHOT.jar>
to <https://builds.apache.org/job/olingo-odata4/ws/fit/target/classes> with includes
"" and excludes ""
[INFO] Unpacking <https://builds.apache.org/job/olingo-odata4/ws/lib/commons-core/target/odata-commons-core-4.0.0-SNAPSHOT.jar>
to <https://builds.apache.org/job/olingo-odata4/ws/fit/target/classes> with includes
"" and excludes ""
[INFO] Unpacking /home/jenkins/.m2/repository/org/apache/olingo/odata-server-tecsvc/4.0.0-SNAPSHOT/odata-server-tecsvc-4.0.0-SNAPSHOT.jar
to <https://builds.apache.org/job/olingo-odata4/ws/fit/target/classes> with includes
"" and excludes ""
[INFO] 
[INFO] --- maven-war-plugin:2.4:exploded (compile) @ odata-fit ---
[INFO] Exploding webapp
[INFO] Assembling webapp [odata-fit] in [<https://builds.apache.org/job/olingo-odata4/ws/fit/target/odata-fit-4.0.0-SNAPSHOT]>
[INFO] Processing war project
[INFO] Copying webapp webResources [<https://builds.apache.org/job/olingo-odata4/ws/fit/target/classes]>
to [<https://builds.apache.org/job/olingo-odata4/ws/fit/target/odata-fit-4.0.0-SNAPSHOT]>
[INFO] Copying webapp resources [<https://builds.apache.org/job/olingo-odata4/ws/fit/src/main/webapp]>
[INFO] Webapp assembled in [730 msecs]
[INFO] 
[INFO] --- maven-resources-plugin:2.6:testResources (default-testResources) @ odata-fit ---
[INFO] Using 'UTF-8' encoding to copy filtered resources.
[INFO] Copying 2 resources
[INFO] Copying 3 resources
[INFO] 
[INFO] --- maven-compiler-plugin:2.3.2:testCompile (default-testCompile) @ odata-fit ---
[INFO] Compiling 284 source files to <https://builds.apache.org/job/olingo-odata4/ws/fit/target/test-classes>
[INFO] 
[INFO] --- maven-surefire-plugin:2.17:test (default-test) @ odata-fit ---
[INFO] Surefire report directory: <https://builds.apache.org/job/olingo-odata4/ws/fit/target/surefire-reports>

-------------------------------------------------------
 T E S T S
-------------------------------------------------------
Running org.apache.olingo.fit.proxy.v4.APIBasicDesignTestITCase
Tests run: 25, Failures: 0, Errors: 0, Skipped: 0, Time elapsed: 9.943 sec - in org.apache.olingo.fit.proxy.v4.APIBasicDesignTestITCase
Running org.apache.olingo.fit.proxy.v4.AsyncTestITCase
Tests run: 3, Failures: 0, Errors: 0, Skipped: 0, Time elapsed: 4.023 sec - in org.apache.olingo.fit.proxy.v4.AsyncTestITCase
Running org.apache.olingo.fit.proxy.v4.AuthEntityCreateTestITCase
Tests run: 7, Failures: 0, Errors: 0, Skipped: 0, Time elapsed: 1.383 sec - in org.apache.olingo.fit.proxy.v4.AuthEntityCreateTestITCase
Running org.apache.olingo.fit.proxy.v4.AuthEntityRetrieveTestITCase
Tests run: 10, Failures: 0, Errors: 0, Skipped: 0, Time elapsed: 0.28 sec - in org.apache.olingo.fit.proxy.v4.AuthEntityRetrieveTestITCase
Running org.apache.olingo.fit.proxy.v4.BoundOperationInvokeTestITCase
Tests run: 10, Failures: 0, Errors: 0, Skipped: 0, Time elapsed: 0.136 sec - in org.apache.olingo.fit.proxy.v4.BoundOperationInvokeTestITCase
Running org.apache.olingo.fit.proxy.v4.ContextTestITCase
Tests run: 2, Failures: 0, Errors: 0, Skipped: 0, Time elapsed: 0.087 sec - in org.apache.olingo.fit.proxy.v4.ContextTestITCase
Running org.apache.olingo.fit.proxy.v4.DerivedTypeTestITCase
Tests run: 2, Failures: 0, Errors: 0, Skipped: 0, Time elapsed: 0.104 sec - in org.apache.olingo.fit.proxy.v4.DerivedTypeTestITCase
Running org.apache.olingo.fit.proxy.v4.EntityCreateTestITCase
Tests run: 7, Failures: 0, Errors: 0, Skipped: 0, Time elapsed: 0.719 sec - in org.apache.olingo.fit.proxy.v4.EntityCreateTestITCase
Running org.apache.olingo.fit.proxy.v4.EntityRetrieveTestITCase
Tests run: 10, Failures: 0, Errors: 0, Skipped: 0, Time elapsed: 0.187 sec - in org.apache.olingo.fit.proxy.v4.EntityRetrieveTestITCase
Running org.apache.olingo.fit.proxy.v4.EntitySetTestITCase
Tests run: 4, Failures: 0, Errors: 0, Skipped: 0, Time elapsed: 0.095 sec - in org.apache.olingo.fit.proxy.v4.EntitySetTestITCase
Running org.apache.olingo.fit.proxy.v4.EntityUpdateTestITCase
Tests run: 5, Failures: 0, Errors: 0, Skipped: 0, Time elapsed: 0.265 sec - in org.apache.olingo.fit.proxy.v4.EntityUpdateTestITCase
Running org.apache.olingo.fit.proxy.v4.FilterTestITCase
Tests run: 3, Failures: 0, Errors: 0, Skipped: 0, Time elapsed: 0.072 sec - in org.apache.olingo.fit.proxy.v4.FilterTestITCase
Running org.apache.olingo.fit.proxy.v4.KeyAsSegmentTestITCase
Tests run: 3, Failures: 0, Errors: 0, Skipped: 0, Time elapsed: 0.168 sec - in org.apache.olingo.fit.proxy.v4.KeyAsSegmentTestITCase
Running org.apache.olingo.fit.proxy.v4.MediaEntityTestITCase
Tests run: 3, Failures: 0, Errors: 0, Skipped: 0, Time elapsed: 0.151 sec - in org.apache.olingo.fit.proxy.v4.MediaEntityTestITCase
Running org.apache.olingo.fit.proxy.v4.NonTransactionalAuthEntityCreateTestITCase
Tests run: 7, Failures: 0, Errors: 0, Skipped: 0, Time elapsed: 0.838 sec - in org.apache.olingo.fit.proxy.v4.NonTransactionalAuthEntityCreateTestITCase
Running org.apache.olingo.fit.proxy.v4.NonTransactionalEntityCreateTestITCase
Tests run: 7, Failures: 0, Errors: 0, Skipped: 0, Time elapsed: 0.534 sec - in org.apache.olingo.fit.proxy.v4.NonTransactionalEntityCreateTestITCase
Running org.apache.olingo.fit.proxy.v4.NonTransactionalEntityUpdateTestITCase
Tests run: 5, Failures: 0, Errors: 0, Skipped: 0, Time elapsed: 0.251 sec - in org.apache.olingo.fit.proxy.v4.NonTransactionalEntityUpdateTestITCase
Running org.apache.olingo.fit.proxy.v4.NonTransactionalMediaEntityTestITCase
Tests run: 3, Failures: 0, Errors: 0, Skipped: 0, Time elapsed: 0.076 sec - in org.apache.olingo.fit.proxy.v4.NonTransactionalMediaEntityTestITCase
Running org.apache.olingo.fit.proxy.v4.OpenTypeTestITCase
Tests run: 3, Failures: 0, Errors: 0, Skipped: 0, Time elapsed: 0.13 sec - in org.apache.olingo.fit.proxy.v4.OpenTypeTestITCase
Running org.apache.olingo.fit.proxy.v4.OperationImportInvokeTestITCase
Tests run: 8, Failures: 0, Errors: 0, Skipped: 0, Time elapsed: 0.077 sec - in org.apache.olingo.fit.proxy.v4.OperationImportInvokeTestITCase
Running org.apache.olingo.fit.proxy.v4.PropertyTestITCase
Tests run: 2, Failures: 0, Errors: 0, Skipped: 0, Time elapsed: 0.046 sec - in org.apache.olingo.fit.proxy.v4.PropertyTestITCase
Running org.apache.olingo.fit.proxy.v4.SingletonTestITCase
Tests run: 3, Failures: 0, Errors: 0, Skipped: 0, Time elapsed: 0.06 sec - in org.apache.olingo.fit.proxy.v4.SingletonTestITCase
Running org.apache.olingo.fit.proxy.v4.UnauthorizedEntityCreateTestITCase
Tests run: 1, Failures: 0, Errors: 0, Skipped: 0, Time elapsed: 0.008 sec - in org.apache.olingo.fit.proxy.v4.UnauthorizedEntityCreateTestITCase
Running org.apache.olingo.fit.tecsvc.client.ActionImportITCase
Tests run: 14, Failures: 0, Errors: 0, Skipped: 0, Time elapsed: 0.402 sec - in org.apache.olingo.fit.tecsvc.client.ActionImportITCase
Running org.apache.olingo.fit.tecsvc.client.BasicHttpExceptionHandlingITCase
Tests run: 1, Failures: 0, Errors: 0, Skipped: 0, Time elapsed: 0.007 sec - in org.apache.olingo.fit.tecsvc.client.BasicHttpExceptionHandlingITCase
Running org.apache.olingo.fit.tecsvc.client.BasicITCase
Tests run: 21, Failures: 0, Errors: 0, Skipped: 0, Time elapsed: 0.787 sec - in org.apache.olingo.fit.tecsvc.client.BasicITCase
Running org.apache.olingo.fit.tecsvc.client.BatchClientITCase
Tests run: 11, Failures: 0, Errors: 0, Skipped: 0, Time elapsed: 0.137 sec - in org.apache.olingo.fit.tecsvc.client.BatchClientITCase
Running org.apache.olingo.fit.tecsvc.client.BindingITCase
Tests run: 6, Failures: 0, Errors: 0, Skipped: 0, Time elapsed: 0.183 sec - in org.apache.olingo.fit.tecsvc.client.BindingITCase
Running org.apache.olingo.fit.tecsvc.client.ConditionalITCase
Tests run: 13, Failures: 0, Errors: 0, Skipped: 0, Time elapsed: 0.551 sec - in org.apache.olingo.fit.tecsvc.client.ConditionalITCase
Running org.apache.olingo.fit.tecsvc.client.DeepInsertITCase
Tests run: 7, Failures: 0, Errors: 0, Skipped: 1, Time elapsed: 0.466 sec - in org.apache.olingo.fit.tecsvc.client.DeepInsertITCase
Running org.apache.olingo.fit.tecsvc.client.EdmEnabledClientITCase
Tests run: 1, Failures: 0, Errors: 0, Skipped: 0, Time elapsed: 0.071 sec - in org.apache.olingo.fit.tecsvc.client.EdmEnabledClientITCase
Running org.apache.olingo.fit.tecsvc.client.EntityReferencesITCase
Tests run: 37, Failures: 0, Errors: 0, Skipped: 0, Time elapsed: 1.803 sec - in org.apache.olingo.fit.tecsvc.client.EntityReferencesITCase
Running org.apache.olingo.fit.tecsvc.client.ExpandSelectITCase
Tests run: 3, Failures: 0, Errors: 0, Skipped: 0, Time elapsed: 0.12 sec - in org.apache.olingo.fit.tecsvc.client.ExpandSelectITCase
Running org.apache.olingo.fit.tecsvc.client.ExpandWithSystemQueryOptionsITCase
Tests run: 10, Failures: 0, Errors: 0, Skipped: 1, Time elapsed: 1.232 sec - in org.apache.olingo.fit.tecsvc.client.ExpandWithSystemQueryOptionsITCase
Running org.apache.olingo.fit.tecsvc.client.FilterSystemQueryITCase
Tests run: 69, Failures: 0, Errors: 0, Skipped: 0, Time elapsed: 0.875 sec - in org.apache.olingo.fit.tecsvc.client.FilterSystemQueryITCase
Running org.apache.olingo.fit.tecsvc.client.FunctionImportITCase
Tests run: 10, Failures: 0, Errors: 0, Skipped: 0, Time elapsed: 0.05 sec - in org.apache.olingo.fit.tecsvc.client.FunctionImportITCase
Running org.apache.olingo.fit.tecsvc.client.MediaITCase
Tests run: 4, Failures: 0, Errors: 0, Skipped: 0, Time elapsed: 0.028 sec - in org.apache.olingo.fit.tecsvc.client.MediaITCase
Running org.apache.olingo.fit.tecsvc.client.NavigationITCase
Tests run: 5, Failures: 0, Errors: 0, Skipped: 0, Time elapsed: 0.025 sec - in org.apache.olingo.fit.tecsvc.client.NavigationITCase
Running org.apache.olingo.fit.tecsvc.client.OrderBySystemQueryITCase
Tests run: 6, Failures: 0, Errors: 0, Skipped: 0, Time elapsed: 0.038 sec - in org.apache.olingo.fit.tecsvc.client.OrderBySystemQueryITCase
Running org.apache.olingo.fit.tecsvc.client.PrimitiveComplexITCase
Tests run: 14, Failures: 0, Errors: 0, Skipped: 0, Time elapsed: 0.093 sec - in org.apache.olingo.fit.tecsvc.client.PrimitiveComplexITCase
Running org.apache.olingo.fit.tecsvc.client.SystemQueryOptionITCase
Tests run: 11, Failures: 0, Errors: 0, Skipped: 0, Time elapsed: 2.156 sec - in org.apache.olingo.fit.tecsvc.client.SystemQueryOptionITCase
Running org.apache.olingo.fit.tecsvc.http.BasicBatchITCase
Tests run: 5, Failures: 0, Errors: 0, Skipped: 0, Time elapsed: 0.021 sec - in org.apache.olingo.fit.tecsvc.http.BasicBatchITCase
Running org.apache.olingo.fit.tecsvc.http.BasicHttpITCase
Tests run: 5, Failures: 0, Errors: 0, Skipped: 0, Time elapsed: 0.02 sec - in org.apache.olingo.fit.tecsvc.http.BasicHttpITCase
Running org.apache.olingo.fit.tecsvc.http.EntityReferenceITCase
Tests run: 2, Failures: 0, Errors: 0, Skipped: 0, Time elapsed: 0.006 sec - in org.apache.olingo.fit.tecsvc.http.EntityReferenceITCase
Running org.apache.olingo.fit.tecsvc.http.PingITCase
Tests run: 2, Failures: 0, Errors: 0, Skipped: 0, Time elapsed: 0.01 sec - in org.apache.olingo.fit.tecsvc.http.PingITCase
Running org.apache.olingo.fit.v4.AsyncTestITCase
Tests run: 5, Failures: 0, Errors: 0, Skipped: 0, Time elapsed: 1.076 sec - in org.apache.olingo.fit.v4.AsyncTestITCase
Running org.apache.olingo.fit.v4.AuthBatchTestITCase
Tests run: 3, Failures: 0, Errors: 0, Skipped: 0, Time elapsed: 0.084 sec - in org.apache.olingo.fit.v4.AuthBatchTestITCase
Running org.apache.olingo.fit.v4.BatchTestITCase
Tests run: 9, Failures: 1, Errors: 0, Skipped: 0, Time elapsed: 1.518 sec <<< FAILURE!
- in org.apache.olingo.fit.v4.BatchTestITCase
changesetWithReference(org.apache.olingo.fit.v4.BatchTestITCase)  Time elapsed: 1.312 sec
 <<< FAILURE!
java.lang.AssertionError: expected:<201> but was:<400>
	at org.junit.Assert.fail(Assert.java:88)
	at org.junit.Assert.failNotEquals(Assert.java:743)
	at org.junit.Assert.assertEquals(Assert.java:118)
	at org.junit.Assert.assertEquals(Assert.java:555)
	at org.junit.Assert.assertEquals(Assert.java:542)
	at org.apache.olingo.fit.v4.BatchTestITCase.changesetWithReference(BatchTestITCase.java:295)

Running org.apache.olingo.fit.v4.BoundOperationInvokeTestITCase
Tests run: 6, Failures: 0, Errors: 0, Skipped: 0, Time elapsed: 0.328 sec - in org.apache.olingo.fit.v4.BoundOperationInvokeTestITCase
Running org.apache.olingo.fit.v4.ConformanceTestITCase
Tests run: 11, Failures: 0, Errors: 0, Skipped: 0, Time elapsed: 0.227 sec - in org.apache.olingo.fit.v4.ConformanceTestITCase
Running org.apache.olingo.fit.v4.DeltaTestITCase
Tests run: 2, Failures: 0, Errors: 0, Skipped: 0, Time elapsed: 0.044 sec - in org.apache.olingo.fit.v4.DeltaTestITCase
Running org.apache.olingo.fit.v4.DerivedTypeTestITCase
Tests run: 4, Failures: 0, Errors: 0, Skipped: 0, Time elapsed: 0.088 sec - in org.apache.olingo.fit.v4.DerivedTypeTestITCase
Running org.apache.olingo.fit.v4.EntityCreateTestITCase
Tests run: 6, Failures: 0, Errors: 0, Skipped: 0, Time elapsed: 0.236 sec - in org.apache.olingo.fit.v4.EntityCreateTestITCase
Running org.apache.olingo.fit.v4.EntityRetrieveTestITCase
Tests run: 21, Failures: 0, Errors: 0, Skipped: 0, Time elapsed: 0.213 sec - in org.apache.olingo.fit.v4.EntityRetrieveTestITCase
Running org.apache.olingo.fit.v4.EntitySetTestITCase
Tests run: 11, Failures: 0, Errors: 0, Skipped: 0, Time elapsed: 0.23 sec - in org.apache.olingo.fit.v4.EntitySetTestITCase
Running org.apache.olingo.fit.v4.EntityUpdateTestITCase
Tests run: 7, Failures: 0, Errors: 0, Skipped: 1, Time elapsed: 0.192 sec - in org.apache.olingo.fit.v4.EntityUpdateTestITCase
Running org.apache.olingo.fit.v4.ErrorResponseTestITCase
Tests run: 1, Failures: 0, Errors: 0, Skipped: 0, Time elapsed: 0.007 sec - in org.apache.olingo.fit.v4.ErrorResponseTestITCase
Running org.apache.olingo.fit.v4.FilterFactoryTestITCase
Tests run: 1, Failures: 0, Errors: 0, Skipped: 0, Time elapsed: 0.005 sec - in org.apache.olingo.fit.v4.FilterFactoryTestITCase
Running org.apache.olingo.fit.v4.JSONFormatConformanceTestITCase
Tests run: 6, Failures: 0, Errors: 0, Skipped: 0, Time elapsed: 0.041 sec - in org.apache.olingo.fit.v4.JSONFormatConformanceTestITCase
Running org.apache.olingo.fit.v4.KeyAsSegmentTestITCase
Tests run: 6, Failures: 0, Errors: 0, Skipped: 0, Time elapsed: 0.101 sec - in org.apache.olingo.fit.v4.KeyAsSegmentTestITCase
Running org.apache.olingo.fit.v4.MediaEntityTestITCase
Tests run: 7, Failures: 0, Errors: 0, Skipped: 0, Time elapsed: 0.14 sec - in org.apache.olingo.fit.v4.MediaEntityTestITCase
Running org.apache.olingo.fit.v4.MetadataTestITCase
Tests run: 3, Failures: 0, Errors: 0, Skipped: 0, Time elapsed: 0.071 sec - in org.apache.olingo.fit.v4.MetadataTestITCase
Running org.apache.olingo.fit.v4.OAuth2TestITCase
Tests run: 1, Failures: 0, Errors: 0, Skipped: 0, Time elapsed: 0.525 sec - in org.apache.olingo.fit.v4.OAuth2TestITCase
Running org.apache.olingo.fit.v4.OpenTypeTestITCase
Tests run: 5, Failures: 0, Errors: 0, Skipped: 0, Time elapsed: 0.116 sec - in org.apache.olingo.fit.v4.OpenTypeTestITCase
Running org.apache.olingo.fit.v4.OperationImportInvokeTestITCase
Tests run: 8, Failures: 0, Errors: 0, Skipped: 0, Time elapsed: 0.211 sec - in org.apache.olingo.fit.v4.OperationImportInvokeTestITCase
Running org.apache.olingo.fit.v4.PropertyTestITCase
Tests run: 11, Failures: 0, Errors: 0, Skipped: 0, Time elapsed: 0.123 sec - in org.apache.olingo.fit.v4.PropertyTestITCase
Running org.apache.olingo.fit.v4.PropertyValueTestITCase
Tests run: 10, Failures: 0, Errors: 0, Skipped: 0, Time elapsed: 0.061 sec - in org.apache.olingo.fit.v4.PropertyValueTestITCase
Running org.apache.olingo.fit.v4.QueryOptionsTestITCase
Tests run: 8, Failures: 0, Errors: 0, Skipped: 0, Time elapsed: 0.077 sec - in org.apache.olingo.fit.v4.QueryOptionsTestITCase
Running org.apache.olingo.fit.v4.ServiceDocumentTestITCase
Tests run: 2, Failures: 0, Errors: 0, Skipped: 0, Time elapsed: 0.011 sec - in org.apache.olingo.fit.v4.ServiceDocumentTestITCase
Running org.apache.olingo.fit.v4.SingletonTestITCase
Tests run: 8, Failures: 0, Errors: 0, Skipped: 0, Time elapsed: 0.081 sec - in org.apache.olingo.fit.v4.SingletonTestITCase

Results :

Failed tests: 
  BatchTestITCase.changesetWithReference:295 expected:<201> but was:<400>

Tests run: 552, Failures: 1, Errors: 0, Skipped: 3

[INFO] ------------------------------------------------------------------------
[INFO] Reactor Summary:
[INFO] 
[INFO] Olingo-OData ...................................... SUCCESS [9.072s]
[INFO] odata-lib ......................................... SUCCESS [1.047s]
[INFO] odata-commons-api ................................. SUCCESS [16.896s]
[INFO] odata-commons-core ................................ SUCCESS [14.700s]
[INFO] odata-client-api .................................. SUCCESS [8.507s]
[INFO] odata-client-core ................................. SUCCESS [16.940s]
[INFO] odata-server-api .................................. SUCCESS [8.048s]
[INFO] odata-server-core ................................. SUCCESS [48.889s]
[INFO] odata-server-core-ext ............................. SUCCESS [11.697s]
[INFO] odata-server-tecsvc ............................... SUCCESS [7.672s]
[INFO] odata-server-test ................................. SUCCESS [8.004s]
[INFO] odata-ext ......................................... SUCCESS [1.064s]
[INFO] odata-client-proxy ................................ SUCCESS [4.401s]
[INFO] pojogen-maven-plugin .............................. SUCCESS [32.705s]
[INFO] odata-client-android .............................. SUCCESS [6.295s]
[INFO] odata-fit ......................................... FAILURE [45.045s]
[INFO] odata-dist ........................................ SKIPPED
[INFO] Olingo-OData-Client-for-Android ................... SKIPPED
[INFO] Olingo-OData-Client-for-Java ...................... SKIPPED
[INFO] Olingo-OData-Server-for-Java ...................... SKIPPED
[INFO] Olingo-OData-JavaDoc .............................. SKIPPED
[INFO] odata-samples ..................................... SKIPPED
[INFO] odata-server-sample ............................... SKIPPED
[INFO] ------------------------------------------------------------------------
[INFO] BUILD FAILURE
[INFO] ------------------------------------------------------------------------
[INFO] Total time: 4:02.377s
[INFO] Finished at: Wed Jun 03 23:22:40 UTC 2015
[INFO] Final Memory: 68M/610M
[INFO] ------------------------------------------------------------------------
[ERROR] Failed to execute goal org.apache.maven.plugins:maven-surefire-plugin:2.17:test (default-test)
on project odata-fit: There are test failures.
[ERROR] 
[ERROR] Please refer to <https://builds.apache.org/job/olingo-odata4/ws/fit/target/surefire-reports>
for the individual test results.
[ERROR] -> [Help 1]
[ERROR] 
[ERROR] To see the full stack trace of the errors, re-run Maven with the -e switch.
[ERROR] Re-run Maven using the -X switch to enable full debug logging.
[ERROR] 
[ERROR] For more information about the errors and possible solutions, please read the following
articles:
[ERROR] [Help 1] http://cwiki.apache.org/confluence/display/MAVEN/MojoFailureException
[ERROR] 
[ERROR] After correcting the problems, you can resume the build with the command
[ERROR]   mvn <goals> -rf :odata-fit
Build step 'Invoke top-level Maven targets' marked build as failure

Mime
View raw message