olingo-commits mailing list archives

Site index · List index
Message view « Date » · « Thread »
Top « Date » · « Thread »
From Apache Jenkins Server <jenk...@builds.apache.org>
Subject Build failed in Jenkins: olingo-odata4 #1035
Date Mon, 08 Jun 2015 08:15:30 GMT
See <https://builds.apache.org/job/olingo-odata4/1035/changes>

Changes:

[christian.amend] [OLINGO-663] metadata ETag

------------------------------------------
[...truncated 5588 lines...]
[INFO] Assembling webapp [odata-fit] in [/x1/jenkins/jenkins-slave/workspace/olingo-odata4/fit/target/odata-fit-4.0.0-SNAPSHOT]
[INFO] Processing war project
[INFO] Copying webapp webResources [/x1/jenkins/jenkins-slave/workspace/olingo-odata4/fit/target/classes]
to [/x1/jenkins/jenkins-slave/workspace/olingo-odata4/fit/target/odata-fit-4.0.0-SNAPSHOT]
[INFO] Copying webapp resources [/x1/jenkins/jenkins-slave/workspace/olingo-odata4/fit/src/main/webapp]
[INFO] Webapp assembled in [1015 msecs]
[INFO] 
[INFO] --- maven-resources-plugin:2.6:testResources (default-testResources) @ odata-fit ---
[INFO] Using 'UTF-8' encoding to copy filtered resources.
[INFO] Copying 2 resources
[INFO] Copying 3 resources
[INFO] 
[INFO] --- maven-compiler-plugin:2.3.2:testCompile (default-testCompile) @ odata-fit ---
[INFO] Compiling 284 source files to /x1/jenkins/jenkins-slave/workspace/olingo-odata4/fit/target/test-classes
[INFO] 
[INFO] --- maven-surefire-plugin:2.17:test (default-test) @ odata-fit ---
[INFO] Surefire report directory: /x1/jenkins/jenkins-slave/workspace/olingo-odata4/fit/target/surefire-reports

-------------------------------------------------------
 T E S T S
-------------------------------------------------------
Running org.apache.olingo.fit.proxy.v4.APIBasicDesignTestITCase
Tests run: 25, Failures: 0, Errors: 0, Skipped: 0, Time elapsed: 8.279 sec - in org.apache.olingo.fit.proxy.v4.APIBasicDesignTestITCase
Running org.apache.olingo.fit.proxy.v4.AsyncTestITCase
Tests run: 3, Failures: 0, Errors: 0, Skipped: 0, Time elapsed: 4.017 sec - in org.apache.olingo.fit.proxy.v4.AsyncTestITCase
Running org.apache.olingo.fit.proxy.v4.AuthEntityCreateTestITCase
Tests run: 7, Failures: 0, Errors: 0, Skipped: 0, Time elapsed: 1.269 sec - in org.apache.olingo.fit.proxy.v4.AuthEntityCreateTestITCase
Running org.apache.olingo.fit.proxy.v4.AuthEntityRetrieveTestITCase
Tests run: 10, Failures: 0, Errors: 0, Skipped: 0, Time elapsed: 0.235 sec - in org.apache.olingo.fit.proxy.v4.AuthEntityRetrieveTestITCase
Running org.apache.olingo.fit.proxy.v4.BoundOperationInvokeTestITCase
Tests run: 10, Failures: 0, Errors: 0, Skipped: 0, Time elapsed: 0.111 sec - in org.apache.olingo.fit.proxy.v4.BoundOperationInvokeTestITCase
Running org.apache.olingo.fit.proxy.v4.ContextTestITCase
Tests run: 2, Failures: 0, Errors: 0, Skipped: 0, Time elapsed: 0.079 sec - in org.apache.olingo.fit.proxy.v4.ContextTestITCase
Running org.apache.olingo.fit.proxy.v4.DerivedTypeTestITCase
Tests run: 2, Failures: 0, Errors: 0, Skipped: 0, Time elapsed: 0.093 sec - in org.apache.olingo.fit.proxy.v4.DerivedTypeTestITCase
Running org.apache.olingo.fit.proxy.v4.EntityCreateTestITCase
Tests run: 7, Failures: 0, Errors: 0, Skipped: 0, Time elapsed: 0.801 sec - in org.apache.olingo.fit.proxy.v4.EntityCreateTestITCase
Running org.apache.olingo.fit.proxy.v4.EntityRetrieveTestITCase
Tests run: 10, Failures: 0, Errors: 0, Skipped: 0, Time elapsed: 0.221 sec - in org.apache.olingo.fit.proxy.v4.EntityRetrieveTestITCase
Running org.apache.olingo.fit.proxy.v4.EntitySetTestITCase
Tests run: 4, Failures: 0, Errors: 0, Skipped: 0, Time elapsed: 0.11 sec - in org.apache.olingo.fit.proxy.v4.EntitySetTestITCase
Running org.apache.olingo.fit.proxy.v4.EntityUpdateTestITCase
Tests run: 5, Failures: 0, Errors: 0, Skipped: 0, Time elapsed: 0.295 sec - in org.apache.olingo.fit.proxy.v4.EntityUpdateTestITCase
Running org.apache.olingo.fit.proxy.v4.FilterTestITCase
Tests run: 3, Failures: 0, Errors: 0, Skipped: 0, Time elapsed: 0.081 sec - in org.apache.olingo.fit.proxy.v4.FilterTestITCase
Running org.apache.olingo.fit.proxy.v4.KeyAsSegmentTestITCase
Tests run: 3, Failures: 0, Errors: 0, Skipped: 0, Time elapsed: 0.196 sec - in org.apache.olingo.fit.proxy.v4.KeyAsSegmentTestITCase
Running org.apache.olingo.fit.proxy.v4.MediaEntityTestITCase
Tests run: 3, Failures: 0, Errors: 0, Skipped: 0, Time elapsed: 0.118 sec - in org.apache.olingo.fit.proxy.v4.MediaEntityTestITCase
Running org.apache.olingo.fit.proxy.v4.NonTransactionalAuthEntityCreateTestITCase
Tests run: 7, Failures: 0, Errors: 0, Skipped: 0, Time elapsed: 0.824 sec - in org.apache.olingo.fit.proxy.v4.NonTransactionalAuthEntityCreateTestITCase
Running org.apache.olingo.fit.proxy.v4.NonTransactionalEntityCreateTestITCase
Tests run: 7, Failures: 0, Errors: 0, Skipped: 0, Time elapsed: 0.616 sec - in org.apache.olingo.fit.proxy.v4.NonTransactionalEntityCreateTestITCase
Running org.apache.olingo.fit.proxy.v4.NonTransactionalEntityUpdateTestITCase
Tests run: 5, Failures: 0, Errors: 0, Skipped: 0, Time elapsed: 0.284 sec - in org.apache.olingo.fit.proxy.v4.NonTransactionalEntityUpdateTestITCase
Running org.apache.olingo.fit.proxy.v4.NonTransactionalMediaEntityTestITCase
Tests run: 3, Failures: 0, Errors: 0, Skipped: 0, Time elapsed: 0.1 sec - in org.apache.olingo.fit.proxy.v4.NonTransactionalMediaEntityTestITCase
Running org.apache.olingo.fit.proxy.v4.OpenTypeTestITCase
Tests run: 3, Failures: 0, Errors: 0, Skipped: 0, Time elapsed: 0.178 sec - in org.apache.olingo.fit.proxy.v4.OpenTypeTestITCase
Running org.apache.olingo.fit.proxy.v4.OperationImportInvokeTestITCase
Tests run: 8, Failures: 0, Errors: 0, Skipped: 0, Time elapsed: 0.081 sec - in org.apache.olingo.fit.proxy.v4.OperationImportInvokeTestITCase
Running org.apache.olingo.fit.proxy.v4.PropertyTestITCase
Tests run: 2, Failures: 0, Errors: 0, Skipped: 0, Time elapsed: 0.054 sec - in org.apache.olingo.fit.proxy.v4.PropertyTestITCase
Running org.apache.olingo.fit.proxy.v4.SingletonTestITCase
Tests run: 3, Failures: 0, Errors: 0, Skipped: 0, Time elapsed: 0.08 sec - in org.apache.olingo.fit.proxy.v4.SingletonTestITCase
Running org.apache.olingo.fit.proxy.v4.UnauthorizedEntityCreateTestITCase
Tests run: 1, Failures: 0, Errors: 0, Skipped: 0, Time elapsed: 0.008 sec - in org.apache.olingo.fit.proxy.v4.UnauthorizedEntityCreateTestITCase
Running org.apache.olingo.fit.tecsvc.client.ActionImportITCase
Tests run: 14, Failures: 0, Errors: 0, Skipped: 0, Time elapsed: 0.444 sec - in org.apache.olingo.fit.tecsvc.client.ActionImportITCase
Running org.apache.olingo.fit.tecsvc.client.BasicHttpExceptionHandlingITCase
Tests run: 1, Failures: 0, Errors: 0, Skipped: 0, Time elapsed: 0.007 sec - in org.apache.olingo.fit.tecsvc.client.BasicHttpExceptionHandlingITCase
Running org.apache.olingo.fit.tecsvc.client.BasicITCase
Tests run: 21, Failures: 0, Errors: 0, Skipped: 0, Time elapsed: 1.017 sec - in org.apache.olingo.fit.tecsvc.client.BasicITCase
Running org.apache.olingo.fit.tecsvc.client.BatchClientITCase
Tests run: 11, Failures: 4, Errors: 0, Skipped: 0, Time elapsed: 0.172 sec <<< FAILURE!
- in org.apache.olingo.fit.tecsvc.client.BatchClientITCase
testErrorWithContinueOnErrorPreferHeader(org.apache.olingo.fit.tecsvc.client.BatchClientITCase)
 Time elapsed: 0.026 sec  <<< FAILURE!
org.junit.ComparisonFailure: expected:<58[2]> but was:<58[5]>
	at org.junit.Assert.assertEquals(Assert.java:115)
	at org.junit.Assert.assertEquals(Assert.java:144)
	at org.apache.olingo.fit.tecsvc.client.BatchClientITCase.testErrorWithContinueOnErrorPreferHeader(BatchClientITCase.java:337)

getBatchRequestWithRelativeUris(org.apache.olingo.fit.tecsvc.client.BatchClientITCase)  Time
elapsed: 0.012 sec  <<< FAILURE!
org.junit.ComparisonFailure: expected:<58[2]> but was:<58[5]>
	at org.junit.Assert.assertEquals(Assert.java:115)
	at org.junit.Assert.assertEquals(Assert.java:144)
	at org.apache.olingo.fit.tecsvc.client.BatchClientITCase.getBatchRequestWithRelativeUris(BatchClientITCase.java:173)

getBatchRequest(org.apache.olingo.fit.tecsvc.client.BatchClientITCase)  Time elapsed: 0.008
sec  <<< FAILURE!
org.junit.ComparisonFailure: expected:<58[2]> but was:<58[5]>
	at org.junit.Assert.assertEquals(Assert.java:115)
	at org.junit.Assert.assertEquals(Assert.java:144)
	at org.apache.olingo.fit.tecsvc.client.BatchClientITCase.getBatchRequest(BatchClientITCase.java:205)

testErrorWithoutContinueOnErrorPreferHeader(org.apache.olingo.fit.tecsvc.client.BatchClientITCase)
 Time elapsed: 0.011 sec  <<< FAILURE!
org.junit.ComparisonFailure: expected:<58[2]> but was:<58[5]>
	at org.junit.Assert.assertEquals(Assert.java:115)
	at org.junit.Assert.assertEquals(Assert.java:144)
	at org.apache.olingo.fit.tecsvc.client.BatchClientITCase.testErrorWithoutContinueOnErrorPreferHeader(BatchClientITCase.java:237)

Running org.apache.olingo.fit.tecsvc.client.BindingITCase
Tests run: 6, Failures: 0, Errors: 0, Skipped: 0, Time elapsed: 0.22 sec - in org.apache.olingo.fit.tecsvc.client.BindingITCase
Running org.apache.olingo.fit.tecsvc.client.ConditionalITCase
Tests run: 15, Failures: 0, Errors: 0, Skipped: 0, Time elapsed: 0.479 sec - in org.apache.olingo.fit.tecsvc.client.ConditionalITCase
Running org.apache.olingo.fit.tecsvc.client.DeepInsertITCase
Tests run: 7, Failures: 0, Errors: 0, Skipped: 1, Time elapsed: 0.467 sec - in org.apache.olingo.fit.tecsvc.client.DeepInsertITCase
Running org.apache.olingo.fit.tecsvc.client.EdmEnabledClientITCase
Tests run: 1, Failures: 0, Errors: 0, Skipped: 0, Time elapsed: 0.061 sec - in org.apache.olingo.fit.tecsvc.client.EdmEnabledClientITCase
Running org.apache.olingo.fit.tecsvc.client.EntityReferencesITCase
Tests run: 37, Failures: 0, Errors: 0, Skipped: 0, Time elapsed: 2.05 sec - in org.apache.olingo.fit.tecsvc.client.EntityReferencesITCase
Running org.apache.olingo.fit.tecsvc.client.ExpandSelectITCase
Tests run: 3, Failures: 0, Errors: 0, Skipped: 0, Time elapsed: 0.958 sec - in org.apache.olingo.fit.tecsvc.client.ExpandSelectITCase
Running org.apache.olingo.fit.tecsvc.client.ExpandWithSystemQueryOptionsITCase
Tests run: 10, Failures: 0, Errors: 0, Skipped: 1, Time elapsed: 0.535 sec - in org.apache.olingo.fit.tecsvc.client.ExpandWithSystemQueryOptionsITCase
Running org.apache.olingo.fit.tecsvc.client.FilterSystemQueryITCase
Tests run: 69, Failures: 0, Errors: 0, Skipped: 0, Time elapsed: 0.832 sec - in org.apache.olingo.fit.tecsvc.client.FilterSystemQueryITCase
Running org.apache.olingo.fit.tecsvc.client.FunctionImportITCase
Tests run: 10, Failures: 0, Errors: 0, Skipped: 0, Time elapsed: 0.068 sec - in org.apache.olingo.fit.tecsvc.client.FunctionImportITCase
Running org.apache.olingo.fit.tecsvc.client.MediaITCase
Tests run: 4, Failures: 0, Errors: 0, Skipped: 0, Time elapsed: 0.029 sec - in org.apache.olingo.fit.tecsvc.client.MediaITCase
Running org.apache.olingo.fit.tecsvc.client.NavigationITCase
Tests run: 5, Failures: 0, Errors: 0, Skipped: 0, Time elapsed: 0.021 sec - in org.apache.olingo.fit.tecsvc.client.NavigationITCase
Running org.apache.olingo.fit.tecsvc.client.OrderBySystemQueryITCase
Tests run: 6, Failures: 0, Errors: 0, Skipped: 0, Time elapsed: 0.028 sec - in org.apache.olingo.fit.tecsvc.client.OrderBySystemQueryITCase
Running org.apache.olingo.fit.tecsvc.client.PrimitiveComplexITCase
Tests run: 14, Failures: 0, Errors: 0, Skipped: 0, Time elapsed: 0.071 sec - in org.apache.olingo.fit.tecsvc.client.PrimitiveComplexITCase
Running org.apache.olingo.fit.tecsvc.client.SystemQueryOptionITCase
Tests run: 11, Failures: 0, Errors: 0, Skipped: 0, Time elapsed: 1.862 sec - in org.apache.olingo.fit.tecsvc.client.SystemQueryOptionITCase
Running org.apache.olingo.fit.tecsvc.http.BasicBatchITCase
Tests run: 5, Failures: 1, Errors: 0, Skipped: 0, Time elapsed: 0.015 sec <<< FAILURE!
- in org.apache.olingo.fit.tecsvc.http.BasicBatchITCase
test(org.apache.olingo.fit.tecsvc.http.BasicBatchITCase)  Time elapsed: 0.004 sec  <<<
FAILURE!
org.junit.ComparisonFailure: expected:<Content-Length: 58[2]> but was:<Content-Length:
58[5]>
	at org.junit.Assert.assertEquals(Assert.java:115)
	at org.junit.Assert.assertEquals(Assert.java:144)
	at org.apache.olingo.fit.tecsvc.http.BasicBatchITCase.test(BasicBatchITCase.java:63)

Running org.apache.olingo.fit.tecsvc.http.BasicHttpITCase
Tests run: 5, Failures: 0, Errors: 0, Skipped: 0, Time elapsed: 0.018 sec - in org.apache.olingo.fit.tecsvc.http.BasicHttpITCase
Running org.apache.olingo.fit.tecsvc.http.EntityReferenceITCase
Tests run: 2, Failures: 0, Errors: 0, Skipped: 0, Time elapsed: 0.006 sec - in org.apache.olingo.fit.tecsvc.http.EntityReferenceITCase
Running org.apache.olingo.fit.tecsvc.http.PingITCase
Tests run: 2, Failures: 0, Errors: 0, Skipped: 0, Time elapsed: 0.008 sec - in org.apache.olingo.fit.tecsvc.http.PingITCase
Running org.apache.olingo.fit.v4.AsyncTestITCase
Tests run: 5, Failures: 0, Errors: 0, Skipped: 0, Time elapsed: 1.066 sec - in org.apache.olingo.fit.v4.AsyncTestITCase
Running org.apache.olingo.fit.v4.AuthBatchTestITCase
Tests run: 3, Failures: 0, Errors: 0, Skipped: 0, Time elapsed: 0.097 sec - in org.apache.olingo.fit.v4.AuthBatchTestITCase
Running org.apache.olingo.fit.v4.BatchTestITCase
Tests run: 9, Failures: 0, Errors: 0, Skipped: 0, Time elapsed: 0.815 sec - in org.apache.olingo.fit.v4.BatchTestITCase
Running org.apache.olingo.fit.v4.BoundOperationInvokeTestITCase
Tests run: 6, Failures: 0, Errors: 0, Skipped: 0, Time elapsed: 0.395 sec - in org.apache.olingo.fit.v4.BoundOperationInvokeTestITCase
Running org.apache.olingo.fit.v4.ConformanceTestITCase
Tests run: 11, Failures: 0, Errors: 0, Skipped: 0, Time elapsed: 0.001 sec - in org.apache.olingo.fit.v4.ConformanceTestITCase
Running org.apache.olingo.fit.v4.DeltaTestITCase
Tests run: 2, Failures: 0, Errors: 0, Skipped: 0, Time elapsed: 0.001 sec - in org.apache.olingo.fit.v4.DeltaTestITCase
Running org.apache.olingo.fit.v4.DerivedTypeTestITCase
Tests run: 4, Failures: 0, Errors: 0, Skipped: 0, Time elapsed: 0 sec - in org.apache.olingo.fit.v4.DerivedTypeTestITCase
Running org.apache.olingo.fit.v4.EntityCreateTestITCase
Tests run: 6, Failures: 0, Errors: 0, Skipped: 0, Time elapsed: 0 sec - in org.apache.olingo.fit.v4.EntityCreateTestITCase
Running org.apache.olingo.fit.v4.EntityRetrieveTestITCase
Tests run: 21, Failures: 0, Errors: 0, Skipped: 0, Time elapsed: 0.001 sec - in org.apache.olingo.fit.v4.EntityRetrieveTestITCase
Running org.apache.olingo.fit.v4.EntitySetTestITCase
Tests run: 11, Failures: 0, Errors: 0, Skipped: 0, Time elapsed: 0.046 sec - in org.apache.olingo.fit.v4.EntitySetTestITCase
Running org.apache.olingo.fit.v4.EntityUpdateTestITCase
Tests run: 7, Failures: 0, Errors: 0, Skipped: 1, Time elapsed: 0.119 sec - in org.apache.olingo.fit.v4.EntityUpdateTestITCase
Running org.apache.olingo.fit.v4.ErrorResponseTestITCase
Tests run: 1, Failures: 0, Errors: 0, Skipped: 0, Time elapsed: 0.004 sec - in org.apache.olingo.fit.v4.ErrorResponseTestITCase
Running org.apache.olingo.fit.v4.FilterFactoryTestITCase
Tests run: 1, Failures: 0, Errors: 0, Skipped: 0, Time elapsed: 0.003 sec - in org.apache.olingo.fit.v4.FilterFactoryTestITCase
Running org.apache.olingo.fit.v4.JSONFormatConformanceTestITCase
Tests run: 6, Failures: 0, Errors: 0, Skipped: 0, Time elapsed: 0.027 sec - in org.apache.olingo.fit.v4.JSONFormatConformanceTestITCase
Running org.apache.olingo.fit.v4.KeyAsSegmentTestITCase
Tests run: 6, Failures: 0, Errors: 0, Skipped: 0, Time elapsed: 0.062 sec - in org.apache.olingo.fit.v4.KeyAsSegmentTestITCase
Running org.apache.olingo.fit.v4.MediaEntityTestITCase
Tests run: 7, Failures: 0, Errors: 0, Skipped: 0, Time elapsed: 0.089 sec - in org.apache.olingo.fit.v4.MediaEntityTestITCase
Running org.apache.olingo.fit.v4.MetadataTestITCase
Tests run: 3, Failures: 0, Errors: 0, Skipped: 0, Time elapsed: 0.063 sec - in org.apache.olingo.fit.v4.MetadataTestITCase
Running org.apache.olingo.fit.v4.OAuth2TestITCase
Tests run: 1, Failures: 0, Errors: 0, Skipped: 0, Time elapsed: 0.548 sec - in org.apache.olingo.fit.v4.OAuth2TestITCase
Running org.apache.olingo.fit.v4.OpenTypeTestITCase
Tests run: 5, Failures: 0, Errors: 0, Skipped: 0, Time elapsed: 0.1 sec - in org.apache.olingo.fit.v4.OpenTypeTestITCase
Running org.apache.olingo.fit.v4.OperationImportInvokeTestITCase
Tests run: 8, Failures: 0, Errors: 0, Skipped: 0, Time elapsed: 0.161 sec - in org.apache.olingo.fit.v4.OperationImportInvokeTestITCase
Running org.apache.olingo.fit.v4.PropertyTestITCase
Tests run: 11, Failures: 0, Errors: 0, Skipped: 0, Time elapsed: 0.07 sec - in org.apache.olingo.fit.v4.PropertyTestITCase
Running org.apache.olingo.fit.v4.PropertyValueTestITCase
Tests run: 10, Failures: 0, Errors: 0, Skipped: 0, Time elapsed: 0.037 sec - in org.apache.olingo.fit.v4.PropertyValueTestITCase
Running org.apache.olingo.fit.v4.QueryOptionsTestITCase
Tests run: 8, Failures: 0, Errors: 0, Skipped: 0, Time elapsed: 0.056 sec - in org.apache.olingo.fit.v4.QueryOptionsTestITCase
Running org.apache.olingo.fit.v4.ServiceDocumentTestITCase
Tests run: 2, Failures: 0, Errors: 0, Skipped: 0, Time elapsed: 0.012 sec - in org.apache.olingo.fit.v4.ServiceDocumentTestITCase
Running org.apache.olingo.fit.v4.SingletonTestITCase
Tests run: 8, Failures: 0, Errors: 0, Skipped: 0, Time elapsed: 0.095 sec - in org.apache.olingo.fit.v4.SingletonTestITCase

Results :

Failed tests: 
  BatchClientITCase.testErrorWithContinueOnErrorPreferHeader:337 expected:<58[2]> but
was:<58[5]>
  BatchClientITCase.getBatchRequestWithRelativeUris:173 expected:<58[2]> but was:<58[5]>
  BatchClientITCase.getBatchRequest:205 expected:<58[2]> but was:<58[5]>
  BatchClientITCase.testErrorWithoutContinueOnErrorPreferHeader:237 expected:<58[2]>
but was:<58[5]>
  BasicBatchITCase.test:63 expected:<Content-Length: 58[2]> but was:<Content-Length:
58[5]>

Tests run: 554, Failures: 5, Errors: 0, Skipped: 3

[INFO] ------------------------------------------------------------------------
[INFO] Reactor Summary:
[INFO] 
[INFO] Olingo-OData ...................................... SUCCESS [9.400s]
[INFO] odata-lib ......................................... SUCCESS [0.769s]
[INFO] odata-commons-api ................................. SUCCESS [10.159s]
[INFO] odata-commons-core ................................ SUCCESS [8.969s]
[INFO] odata-client-api .................................. SUCCESS [6.786s]
[INFO] odata-client-core ................................. SUCCESS [9.605s]
[INFO] odata-server-api .................................. SUCCESS [13.559s]
[INFO] odata-server-core ................................. SUCCESS [20.703s]
[INFO] odata-server-core-ext ............................. SUCCESS [10.858s]
[INFO] odata-server-tecsvc ............................... SUCCESS [6.359s]
[INFO] odata-server-test ................................. SUCCESS [7.198s]
[INFO] odata-ext ......................................... SUCCESS [2.703s]
[INFO] odata-client-proxy ................................ SUCCESS [4.610s]
[INFO] pojogen-maven-plugin .............................. SUCCESS [28.490s]
[INFO] odata-client-android .............................. SUCCESS [5.972s]
[INFO] odata-fit ......................................... FAILURE [43.170s]
[INFO] odata-dist ........................................ SKIPPED
[INFO] Olingo-OData-Client-for-Android ................... SKIPPED
[INFO] Olingo-OData-Client-for-Java ...................... SKIPPED
[INFO] Olingo-OData-Server-for-Java ...................... SKIPPED
[INFO] Olingo-OData-JavaDoc .............................. SKIPPED
[INFO] odata-samples ..................................... SKIPPED
[INFO] odata-server-sample ............................... SKIPPED
[INFO] ------------------------------------------------------------------------
[INFO] BUILD FAILURE
[INFO] ------------------------------------------------------------------------
[INFO] Total time: 3:10.835s
[INFO] Finished at: Mon Jun 08 08:15:30 UTC 2015
[INFO] Final Memory: 70M/774M
[INFO] ------------------------------------------------------------------------
[ERROR] Failed to execute goal org.apache.maven.plugins:maven-surefire-plugin:2.17:test (default-test)
on project odata-fit: There are test failures.
[ERROR] 
[ERROR] Please refer to /x1/jenkins/jenkins-slave/workspace/olingo-odata4/fit/target/surefire-reports
for the individual test results.
[ERROR] -> [Help 1]
[ERROR] 
[ERROR] To see the full stack trace of the errors, re-run Maven with the -e switch.
[ERROR] Re-run Maven using the -X switch to enable full debug logging.
[ERROR] 
[ERROR] For more information about the errors and possible solutions, please read the following
articles:
[ERROR] [Help 1] http://cwiki.apache.org/confluence/display/MAVEN/MojoFailureException
[ERROR] 
[ERROR] After correcting the problems, you can resume the build with the command
[ERROR]   mvn <goals> -rf :odata-fit
Build step 'Invoke top-level Maven targets' marked build as failure

Mime
View raw message