olingo-commits mailing list archives

Site index · List index
Message view « Date » · « Thread »
Top « Date » · « Thread »
From Apache Jenkins Server <jenk...@builds.apache.org>
Subject Build failed in Jenkins: olingo-odata4 #991
Date Tue, 19 May 2015 09:15:13 GMT
See <https://builds.apache.org/job/olingo-odata4/991/changes>

Changes:

[chrisam] [OLINGO-652] Rename to Server Error

[chrisam] [OLINGO-663] Set ETags in technical service

------------------------------------------
[...truncated 5505 lines...]
Running org.apache.olingo.fit.proxy.v4.EntityUpdateTestITCase
Tests run: 5, Failures: 0, Errors: 0, Skipped: 0, Time elapsed: 0.32 sec - in org.apache.olingo.fit.proxy.v4.EntityUpdateTestITCase
Running org.apache.olingo.fit.proxy.v4.FilterTestITCase
Tests run: 3, Failures: 0, Errors: 0, Skipped: 0, Time elapsed: 0.081 sec - in org.apache.olingo.fit.proxy.v4.FilterTestITCase
Running org.apache.olingo.fit.proxy.v4.KeyAsSegmentTestITCase
Tests run: 3, Failures: 0, Errors: 0, Skipped: 0, Time elapsed: 0.273 sec - in org.apache.olingo.fit.proxy.v4.KeyAsSegmentTestITCase
Running org.apache.olingo.fit.proxy.v4.MediaEntityTestITCase
Tests run: 3, Failures: 0, Errors: 0, Skipped: 0, Time elapsed: 0.152 sec - in org.apache.olingo.fit.proxy.v4.MediaEntityTestITCase
Running org.apache.olingo.fit.proxy.v4.NonTransactionalAuthEntityCreateTestITCase
Tests run: 7, Failures: 0, Errors: 0, Skipped: 0, Time elapsed: 0.993 sec - in org.apache.olingo.fit.proxy.v4.NonTransactionalAuthEntityCreateTestITCase
Running org.apache.olingo.fit.proxy.v4.NonTransactionalEntityCreateTestITCase
Tests run: 7, Failures: 0, Errors: 0, Skipped: 0, Time elapsed: 0.645 sec - in org.apache.olingo.fit.proxy.v4.NonTransactionalEntityCreateTestITCase
Running org.apache.olingo.fit.proxy.v4.NonTransactionalEntityUpdateTestITCase
Tests run: 5, Failures: 0, Errors: 0, Skipped: 0, Time elapsed: 0.28 sec - in org.apache.olingo.fit.proxy.v4.NonTransactionalEntityUpdateTestITCase
Running org.apache.olingo.fit.proxy.v4.NonTransactionalMediaEntityTestITCase
Tests run: 3, Failures: 0, Errors: 0, Skipped: 0, Time elapsed: 0.096 sec - in org.apache.olingo.fit.proxy.v4.NonTransactionalMediaEntityTestITCase
Running org.apache.olingo.fit.proxy.v4.OpenTypeTestITCase
Tests run: 3, Failures: 0, Errors: 0, Skipped: 0, Time elapsed: 0.175 sec - in org.apache.olingo.fit.proxy.v4.OpenTypeTestITCase
Running org.apache.olingo.fit.proxy.v4.OperationImportInvokeTestITCase
Tests run: 8, Failures: 0, Errors: 0, Skipped: 0, Time elapsed: 0.085 sec - in org.apache.olingo.fit.proxy.v4.OperationImportInvokeTestITCase
Running org.apache.olingo.fit.proxy.v4.PropertyTestITCase
Tests run: 2, Failures: 0, Errors: 0, Skipped: 0, Time elapsed: 0.053 sec - in org.apache.olingo.fit.proxy.v4.PropertyTestITCase
Running org.apache.olingo.fit.proxy.v4.SingletonTestITCase
Tests run: 3, Failures: 0, Errors: 0, Skipped: 0, Time elapsed: 0.085 sec - in org.apache.olingo.fit.proxy.v4.SingletonTestITCase
Running org.apache.olingo.fit.proxy.v4.UnauthorizedEntityCreateTestITCase
Tests run: 1, Failures: 0, Errors: 0, Skipped: 0, Time elapsed: 0.01 sec - in org.apache.olingo.fit.proxy.v4.UnauthorizedEntityCreateTestITCase
Running org.apache.olingo.fit.tecsvc.client.ActionImportITCase
Tests run: 14, Failures: 0, Errors: 0, Skipped: 0, Time elapsed: 0.404 sec - in org.apache.olingo.fit.tecsvc.client.ActionImportITCase
Running org.apache.olingo.fit.tecsvc.client.BasicHttpExceptionHandlingITCase
Tests run: 1, Failures: 0, Errors: 0, Skipped: 0, Time elapsed: 0.008 sec - in org.apache.olingo.fit.tecsvc.client.BasicHttpExceptionHandlingITCase
Running org.apache.olingo.fit.tecsvc.client.BasicITCase
Tests run: 21, Failures: 0, Errors: 0, Skipped: 0, Time elapsed: 0.981 sec - in org.apache.olingo.fit.tecsvc.client.BasicITCase
Running org.apache.olingo.fit.tecsvc.client.BatchClientITCase
Tests run: 11, Failures: 0, Errors: 0, Skipped: 0, Time elapsed: 0.147 sec - in org.apache.olingo.fit.tecsvc.client.BatchClientITCase
Running org.apache.olingo.fit.tecsvc.client.BindingITCase
Tests run: 6, Failures: 0, Errors: 0, Skipped: 0, Time elapsed: 0.582 sec - in org.apache.olingo.fit.tecsvc.client.BindingITCase
Running org.apache.olingo.fit.tecsvc.client.DeepInsertITCase
Tests run: 7, Failures: 0, Errors: 0, Skipped: 1, Time elapsed: 0.56 sec - in org.apache.olingo.fit.tecsvc.client.DeepInsertITCase
Running org.apache.olingo.fit.tecsvc.client.ExpandSelectITCase
Tests run: 3, Failures: 0, Errors: 0, Skipped: 0, Time elapsed: 0.126 sec - in org.apache.olingo.fit.tecsvc.client.ExpandSelectITCase
Running org.apache.olingo.fit.tecsvc.client.ExpandWithSystemQueryOptionsITCase
Tests run: 10, Failures: 0, Errors: 0, Skipped: 1, Time elapsed: 0.514 sec - in org.apache.olingo.fit.tecsvc.client.ExpandWithSystemQueryOptionsITCase
Running org.apache.olingo.fit.tecsvc.client.FilterSystemQueryITCase
Tests run: 69, Failures: 0, Errors: 0, Skipped: 0, Time elapsed: 0.644 sec - in org.apache.olingo.fit.tecsvc.client.FilterSystemQueryITCase
Running org.apache.olingo.fit.tecsvc.client.FunctionImportITCase
Tests run: 10, Failures: 0, Errors: 0, Skipped: 0, Time elapsed: 0.042 sec - in org.apache.olingo.fit.tecsvc.client.FunctionImportITCase
Running org.apache.olingo.fit.tecsvc.client.MediaITCase
Tests run: 4, Failures: 0, Errors: 0, Skipped: 0, Time elapsed: 0.024 sec - in org.apache.olingo.fit.tecsvc.client.MediaITCase
Running org.apache.olingo.fit.tecsvc.client.NavigationITCase
Tests run: 5, Failures: 0, Errors: 0, Skipped: 0, Time elapsed: 0.018 sec - in org.apache.olingo.fit.tecsvc.client.NavigationITCase
Running org.apache.olingo.fit.tecsvc.client.OrderBySystemQueryITCase
Tests run: 6, Failures: 0, Errors: 0, Skipped: 0, Time elapsed: 0.027 sec - in org.apache.olingo.fit.tecsvc.client.OrderBySystemQueryITCase
Running org.apache.olingo.fit.tecsvc.client.PrimitiveComplexITCase
Tests run: 10, Failures: 0, Errors: 0, Skipped: 0, Time elapsed: 0.044 sec - in org.apache.olingo.fit.tecsvc.client.PrimitiveComplexITCase
Running org.apache.olingo.fit.tecsvc.client.SystemQueryOptionITCase
Tests run: 11, Failures: 0, Errors: 0, Skipped: 0, Time elapsed: 1.43 sec - in org.apache.olingo.fit.tecsvc.client.SystemQueryOptionITCase
Running org.apache.olingo.fit.tecsvc.http.BasicBatchITCase
Tests run: 5, Failures: 0, Errors: 0, Skipped: 0, Time elapsed: 0.012 sec - in org.apache.olingo.fit.tecsvc.http.BasicBatchITCase
Running org.apache.olingo.fit.tecsvc.http.BasicHttpITCase
Tests run: 5, Failures: 0, Errors: 0, Skipped: 0, Time elapsed: 0.011 sec - in org.apache.olingo.fit.tecsvc.http.BasicHttpITCase
Running org.apache.olingo.fit.tecsvc.http.PingITCase
Tests run: 2, Failures: 0, Errors: 0, Skipped: 0, Time elapsed: 0.005 sec - in org.apache.olingo.fit.tecsvc.http.PingITCase
Running org.apache.olingo.fit.v4.AsyncTestITCase
Tests run: 5, Failures: 0, Errors: 0, Skipped: 0, Time elapsed: 1.048 sec - in org.apache.olingo.fit.v4.AsyncTestITCase
Running org.apache.olingo.fit.v4.AuthBatchTestITCase
Tests run: 3, Failures: 0, Errors: 0, Skipped: 0, Time elapsed: 0.094 sec - in org.apache.olingo.fit.v4.AuthBatchTestITCase
Running org.apache.olingo.fit.v4.BatchTestITCase
Tests run: 9, Failures: 0, Errors: 0, Skipped: 0, Time elapsed: 0.318 sec - in org.apache.olingo.fit.v4.BatchTestITCase
Running org.apache.olingo.fit.v4.BoundOperationInvokeTestITCase
Tests run: 6, Failures: 0, Errors: 0, Skipped: 0, Time elapsed: 0.348 sec - in org.apache.olingo.fit.v4.BoundOperationInvokeTestITCase
Running org.apache.olingo.fit.v4.ConformanceTestITCase
Tests run: 11, Failures: 0, Errors: 0, Skipped: 0, Time elapsed: 0.276 sec - in org.apache.olingo.fit.v4.ConformanceTestITCase
Running org.apache.olingo.fit.v4.DeltaTestITCase
Tests run: 2, Failures: 0, Errors: 0, Skipped: 0, Time elapsed: 0.293 sec - in org.apache.olingo.fit.v4.DeltaTestITCase
Running org.apache.olingo.fit.v4.DerivedTypeTestITCase
Tests run: 4, Failures: 0, Errors: 0, Skipped: 0, Time elapsed: 0.084 sec - in org.apache.olingo.fit.v4.DerivedTypeTestITCase
Running org.apache.olingo.fit.v4.EntityCreateTestITCase
Tests run: 6, Failures: 0, Errors: 0, Skipped: 0, Time elapsed: 0.213 sec - in org.apache.olingo.fit.v4.EntityCreateTestITCase
Running org.apache.olingo.fit.v4.EntityRetrieveTestITCase
Tests run: 21, Failures: 0, Errors: 0, Skipped: 0, Time elapsed: 0.209 sec - in org.apache.olingo.fit.v4.EntityRetrieveTestITCase
Running org.apache.olingo.fit.v4.EntitySetTestITCase
Tests run: 11, Failures: 0, Errors: 0, Skipped: 0, Time elapsed: 0.197 sec - in org.apache.olingo.fit.v4.EntitySetTestITCase
Running org.apache.olingo.fit.v4.EntityUpdateTestITCase
Tests run: 7, Failures: 0, Errors: 0, Skipped: 1, Time elapsed: 0.178 sec - in org.apache.olingo.fit.v4.EntityUpdateTestITCase
Running org.apache.olingo.fit.v4.ErrorResponseTestITCase
Tests run: 1, Failures: 0, Errors: 0, Skipped: 0, Time elapsed: 0.006 sec - in org.apache.olingo.fit.v4.ErrorResponseTestITCase
Running org.apache.olingo.fit.v4.FilterFactoryTestITCase
Tests run: 1, Failures: 0, Errors: 0, Skipped: 0, Time elapsed: 0.006 sec - in org.apache.olingo.fit.v4.FilterFactoryTestITCase
Running org.apache.olingo.fit.v4.JSONFormatConformanceTestITCase
Tests run: 6, Failures: 0, Errors: 0, Skipped: 0, Time elapsed: 0.049 sec - in org.apache.olingo.fit.v4.JSONFormatConformanceTestITCase
Running org.apache.olingo.fit.v4.KeyAsSegmentTestITCase
Tests run: 6, Failures: 0, Errors: 0, Skipped: 0, Time elapsed: 0.104 sec - in org.apache.olingo.fit.v4.KeyAsSegmentTestITCase
Running org.apache.olingo.fit.v4.MediaEntityTestITCase
Tests run: 7, Failures: 0, Errors: 0, Skipped: 0, Time elapsed: 0.135 sec - in org.apache.olingo.fit.v4.MediaEntityTestITCase
Running org.apache.olingo.fit.v4.MetadataTestITCase
Tests run: 3, Failures: 0, Errors: 0, Skipped: 0, Time elapsed: 0.085 sec - in org.apache.olingo.fit.v4.MetadataTestITCase
Running org.apache.olingo.fit.v4.OAuth2TestITCase
Tests run: 4, Failures: 0, Errors: 2, Skipped: 0, Time elapsed: 0.874 sec <<< FAILURE!
- in org.apache.olingo.fit.v4.OAuth2TestITCase
createAndDelete(org.apache.olingo.fit.v4.OAuth2TestITCase)  Time elapsed: 0.78 sec  <<<
ERROR!
javax.ws.rs.ProcessingException: java.net.SocketException: SocketException invoking http://localhost:9080/stub/StaticService/oauth2/token:
Socket Closed
	at java.net.PlainSocketImpl.getOption(PlainSocketImpl.java:286)
	at java.net.Socket.getSoTimeout(Socket.java:1032)
	at sun.net.www.http.HttpClient.available(HttpClient.java:356)
	at sun.net.www.http.HttpClient.New(HttpClient.java:273)
	at sun.net.www.http.HttpClient.New(HttpClient.java:310)
	at sun.net.www.protocol.http.HttpURLConnection.getNewHttpClient(HttpURLConnection.java:987)
	at sun.net.www.protocol.http.HttpURLConnection.plainConnect(HttpURLConnection.java:923)
	at sun.net.www.protocol.http.HttpURLConnection.connect(HttpURLConnection.java:841)
	at org.apache.cxf.transport.http.URLConnectionHTTPConduit$URLConnectionWrappedOutputStream.setupWrappedStream(URLConnectionHTTPConduit.java:177)
	at org.apache.cxf.transport.http.HTTPConduit$WrappedOutputStream.handleHeadersTrustCaching(HTTPConduit.java:1302)
	at org.apache.cxf.transport.http.HTTPConduit$WrappedOutputStream.onFirstWrite(HTTPConduit.java:1258)
	at org.apache.cxf.transport.http.URLConnectionHTTPConduit$URLConnectionWrappedOutputStream.onFirstWrite(URLConnectionHTTPConduit.java:201)
	at org.apache.cxf.io.AbstractWrappedOutputStream.write(AbstractWrappedOutputStream.java:47)
	at org.apache.cxf.io.AbstractThresholdOutputStream.write(AbstractThresholdOutputStream.java:69)
	at org.apache.cxf.transport.http.HTTPConduit$WrappedOutputStream.close(HTTPConduit.java:1315)
	at org.apache.cxf.transport.AbstractConduit.close(AbstractConduit.java:56)
	at org.apache.cxf.transport.http.HTTPConduit.close(HTTPConduit.java:638)
	at org.apache.cxf.interceptor.MessageSenderInterceptor$MessageSenderEndingInterceptor.handleMessage(MessageSenderInterceptor.java:62)
	at org.apache.cxf.phase.PhaseInterceptorChain.doIntercept(PhaseInterceptorChain.java:307)
	at org.apache.cxf.jaxrs.client.AbstractClient.doRunInterceptorChain(AbstractClient.java:620)
	at org.apache.cxf.jaxrs.client.WebClient.doChainedInvocation(WebClient.java:1087)
	at org.apache.cxf.jaxrs.client.WebClient.doInvoke(WebClient.java:882)
	at org.apache.cxf.jaxrs.client.WebClient.doInvoke(WebClient.java:853)
	at org.apache.cxf.jaxrs.client.WebClient.form(WebClient.java:390)
	at org.apache.cxf.rs.security.oauth2.client.OAuthClientUtils.getAccessToken(OAuthClientUtils.java:263)
	at org.apache.cxf.rs.security.oauth2.client.OAuthClientUtils.getAccessToken(OAuthClientUtils.java:209)
	at org.apache.cxf.rs.security.oauth2.client.OAuthClientUtils.getAccessToken(OAuthClientUtils.java:156)
	at org.apache.cxf.rs.security.oauth2.client.OAuthClientUtils.getAccessToken(OAuthClientUtils.java:114)
	at org.apache.olingo.fit.CXFOAuth2HttpClientFactory.init(CXFOAuth2HttpClientFactory.java:145)
	at org.apache.olingo.client.core.http.AbstractOAuth2HttpClientFactory.create(AbstractOAuth2HttpClientFactory.java:78)
	at org.apache.olingo.client.core.communication.request.AbstractODataRequest.getHttpClient(AbstractODataRequest.java:352)
	at org.apache.olingo.client.core.communication.request.AbstractODataRequest.<init>(AbstractODataRequest.java:101)
	at org.apache.olingo.client.core.communication.request.AbstractODataBasicRequest.<init>(AbstractODataBasicRequest.java:54)
	at org.apache.olingo.client.core.communication.request.cud.ODataEntityCreateRequestImpl.<init>(ODataEntityCreateRequestImpl.java:64)
	at org.apache.olingo.client.core.communication.request.cud.CUDRequestFactoryImpl.getEntityCreateRequest(CUDRequestFactoryImpl.java:59)
	at org.apache.olingo.fit.v4.AbstractTestITCase.createAndDeleteOrder(AbstractTestITCase.java:147)
	at org.apache.olingo.fit.v4.OAuth2TestITCase.createAndDelete(OAuth2TestITCase.java:112)

readAsFullJSON(org.apache.olingo.fit.v4.OAuth2TestITCase)  Time elapsed: 0.011 sec  <<<
ERROR!
javax.ws.rs.ProcessingException: java.net.SocketException: SocketException invoking http://localhost:9080/stub/StaticService/oauth2/token:
Socket Closed
	at java.net.PlainSocketImpl.getOption(PlainSocketImpl.java:286)
	at java.net.Socket.getSoTimeout(Socket.java:1032)
	at sun.net.www.http.HttpClient.available(HttpClient.java:356)
	at sun.net.www.http.HttpClient.New(HttpClient.java:273)
	at sun.net.www.http.HttpClient.New(HttpClient.java:310)
	at sun.net.www.protocol.http.HttpURLConnection.getNewHttpClient(HttpURLConnection.java:987)
	at sun.net.www.protocol.http.HttpURLConnection.plainConnect(HttpURLConnection.java:923)
	at sun.net.www.protocol.http.HttpURLConnection.connect(HttpURLConnection.java:841)
	at org.apache.cxf.transport.http.URLConnectionHTTPConduit$URLConnectionWrappedOutputStream.setupWrappedStream(URLConnectionHTTPConduit.java:177)
	at org.apache.cxf.transport.http.HTTPConduit$WrappedOutputStream.handleHeadersTrustCaching(HTTPConduit.java:1302)
	at org.apache.cxf.transport.http.HTTPConduit$WrappedOutputStream.onFirstWrite(HTTPConduit.java:1258)
	at org.apache.cxf.transport.http.URLConnectionHTTPConduit$URLConnectionWrappedOutputStream.onFirstWrite(URLConnectionHTTPConduit.java:201)
	at org.apache.cxf.io.AbstractWrappedOutputStream.write(AbstractWrappedOutputStream.java:47)
	at org.apache.cxf.io.AbstractThresholdOutputStream.write(AbstractThresholdOutputStream.java:69)
	at org.apache.cxf.transport.http.HTTPConduit$WrappedOutputStream.close(HTTPConduit.java:1315)
	at org.apache.cxf.transport.AbstractConduit.close(AbstractConduit.java:56)
	at org.apache.cxf.transport.http.HTTPConduit.close(HTTPConduit.java:638)
	at org.apache.cxf.interceptor.MessageSenderInterceptor$MessageSenderEndingInterceptor.handleMessage(MessageSenderInterceptor.java:62)
	at org.apache.cxf.phase.PhaseInterceptorChain.doIntercept(PhaseInterceptorChain.java:307)
	at org.apache.cxf.jaxrs.client.AbstractClient.doRunInterceptorChain(AbstractClient.java:620)
	at org.apache.cxf.jaxrs.client.WebClient.doChainedInvocation(WebClient.java:1087)
	at org.apache.cxf.jaxrs.client.WebClient.doInvoke(WebClient.java:882)
	at org.apache.cxf.jaxrs.client.WebClient.doInvoke(WebClient.java:853)
	at org.apache.cxf.jaxrs.client.WebClient.form(WebClient.java:390)
	at org.apache.cxf.rs.security.oauth2.client.OAuthClientUtils.getAccessToken(OAuthClientUtils.java:263)
	at org.apache.cxf.rs.security.oauth2.client.OAuthClientUtils.getAccessToken(OAuthClientUtils.java:209)
	at org.apache.cxf.rs.security.oauth2.client.OAuthClientUtils.getAccessToken(OAuthClientUtils.java:156)
	at org.apache.cxf.rs.security.oauth2.client.OAuthClientUtils.getAccessToken(OAuthClientUtils.java:114)
	at org.apache.olingo.fit.CXFOAuth2HttpClientFactory.init(CXFOAuth2HttpClientFactory.java:145)
	at org.apache.olingo.client.core.http.AbstractOAuth2HttpClientFactory.create(AbstractOAuth2HttpClientFactory.java:78)
	at org.apache.olingo.client.core.communication.request.AbstractODataRequest.getHttpClient(AbstractODataRequest.java:352)
	at org.apache.olingo.client.core.communication.request.AbstractODataRequest.<init>(AbstractODataRequest.java:101)
	at org.apache.olingo.client.core.communication.request.AbstractODataBasicRequest.<init>(AbstractODataBasicRequest.java:54)
	at org.apache.olingo.client.core.communication.request.retrieve.AbstractODataRetrieveRequest.<init>(AbstractODataRetrieveRequest.java:47)
	at org.apache.olingo.client.core.communication.request.retrieve.ODataEntityRequestImpl.<init>(ODataEntityRequestImpl.java:47)
	at org.apache.olingo.client.core.communication.request.retrieve.RetrieveRequestFactoryImpl.getEntityRequest(RetrieveRequestFactoryImpl.java:112)
	at org.apache.olingo.fit.v4.OAuth2TestITCase.read(OAuth2TestITCase.java:76)
	at org.apache.olingo.fit.v4.OAuth2TestITCase.readAsFullJSON(OAuth2TestITCase.java:102)

Running org.apache.olingo.fit.v4.OpenTypeTestITCase
Tests run: 5, Failures: 0, Errors: 0, Skipped: 0, Time elapsed: 0.093 sec - in org.apache.olingo.fit.v4.OpenTypeTestITCase
Running org.apache.olingo.fit.v4.OperationImportInvokeTestITCase
Tests run: 8, Failures: 0, Errors: 0, Skipped: 0, Time elapsed: 0.191 sec - in org.apache.olingo.fit.v4.OperationImportInvokeTestITCase
Running org.apache.olingo.fit.v4.PropertyTestITCase
Tests run: 11, Failures: 0, Errors: 0, Skipped: 0, Time elapsed: 0.112 sec - in org.apache.olingo.fit.v4.PropertyTestITCase
Running org.apache.olingo.fit.v4.PropertyValueTestITCase
Tests run: 10, Failures: 0, Errors: 0, Skipped: 0, Time elapsed: 0.061 sec - in org.apache.olingo.fit.v4.PropertyValueTestITCase
Running org.apache.olingo.fit.v4.QueryOptionsTestITCase
Tests run: 8, Failures: 0, Errors: 0, Skipped: 0, Time elapsed: 0.087 sec - in org.apache.olingo.fit.v4.QueryOptionsTestITCase
Running org.apache.olingo.fit.v4.ServiceDocumentTestITCase
Tests run: 2, Failures: 0, Errors: 0, Skipped: 0, Time elapsed: 0.013 sec - in org.apache.olingo.fit.v4.ServiceDocumentTestITCase
Running org.apache.olingo.fit.v4.SingletonTestITCase
Tests run: 8, Failures: 0, Errors: 0, Skipped: 0, Time elapsed: 0.104 sec - in org.apache.olingo.fit.v4.SingletonTestITCase

Results :

Tests in error: 
  OAuth2TestITCase.createAndDelete:112->AbstractTestITCase.createAndDeleteOrder:147 ? Processing
  OAuth2TestITCase.readAsFullJSON:102->read:76 ? Processing java.net.SocketExcep...

Tests run: 498, Failures: 0, Errors: 2, Skipped: 3

[INFO] ------------------------------------------------------------------------
[INFO] Reactor Summary:
[INFO] 
[INFO] Olingo-OData ...................................... SUCCESS [10.077s]
[INFO] odata-lib ......................................... SUCCESS [2.328s]
[INFO] odata-commons-api ................................. SUCCESS [7.187s]
[INFO] odata-commons-core ................................ SUCCESS [11.849s]
[INFO] odata-client-api .................................. SUCCESS [8.212s]
[INFO] odata-client-core ................................. SUCCESS [10.521s]
[INFO] odata-server-api .................................. SUCCESS [3.171s]
[INFO] odata-server-core ................................. SUCCESS [13.844s]
[INFO] odata-server-core-ext ............................. SUCCESS [11.431s]
[INFO] odata-server-tecsvc ............................... SUCCESS [5.435s]
[INFO] odata-server-test ................................. SUCCESS [7.005s]
[INFO] odata-ext ......................................... SUCCESS [2.790s]
[INFO] odata-client-proxy ................................ SUCCESS [5.308s]
[INFO] pojogen-maven-plugin .............................. SUCCESS [31.456s]
[INFO] odata-client-android .............................. SUCCESS [5.610s]
[INFO] odata-fit ......................................... FAILURE [40.596s]
[INFO] odata-dist ........................................ SKIPPED
[INFO] Olingo-OData-Client-for-Android ................... SKIPPED
[INFO] Olingo-OData-Client-for-Java ...................... SKIPPED
[INFO] Olingo-OData-Server-for-Java ...................... SKIPPED
[INFO] Olingo-OData-JavaDoc .............................. SKIPPED
[INFO] odata-samples ..................................... SKIPPED
[INFO] odata-server-sample ............................... SKIPPED
[INFO] ------------------------------------------------------------------------
[INFO] BUILD FAILURE
[INFO] ------------------------------------------------------------------------
[INFO] Total time: 2:57.688s
[INFO] Finished at: Tue May 19 09:15:12 UTC 2015
[INFO] Final Memory: 64M/390M
[INFO] ------------------------------------------------------------------------
[ERROR] Failed to execute goal org.apache.maven.plugins:maven-surefire-plugin:2.17:test (default-test)
on project odata-fit: There are test failures.
[ERROR] 
[ERROR] Please refer to /x1/jenkins/jenkins-slave/workspace/olingo-odata4/fit/target/surefire-reports
for the individual test results.
[ERROR] -> [Help 1]
[ERROR] 
[ERROR] To see the full stack trace of the errors, re-run Maven with the -e switch.
[ERROR] Re-run Maven using the -X switch to enable full debug logging.
[ERROR] 
[ERROR] For more information about the errors and possible solutions, please read the following
articles:
[ERROR] [Help 1] http://cwiki.apache.org/confluence/display/MAVEN/MojoFailureException
[ERROR] 
[ERROR] After correcting the problems, you can resume the build with the command
[ERROR]   mvn <goals> -rf :odata-fit
Build step 'Invoke top-level Maven targets' marked build as failure

Mime
View raw message