olingo-commits mailing list archives

Site index · List index
Message view « Date » · « Thread »
Top « Date » · « Thread »
From Apache Jenkins Server <jenk...@builds.apache.org>
Subject Build failed in Jenkins: olingo-odata2 #1047
Date Mon, 30 Mar 2015 00:48:00 GMT
See <https://builds.apache.org/job/olingo-odata2/1047/>

------------------------------------------
[...truncated 1821 lines...]
Tests run: 6, Failures: 0, Errors: 0, Skipped: 0, Time elapsed: 3.281 sec
Running org.apache.olingo.odata2.fit.ref.LinksXmlChangeTest
Tests run: 4, Failures: 0, Errors: 0, Skipped: 0, Time elapsed: 2.285 sec
Running org.apache.olingo.odata2.fit.ref.MiscReadOnlyTest
Tests run: 6, Failures: 0, Errors: 0, Skipped: 0, Time elapsed: 3.588 sec
Running org.apache.olingo.odata2.fit.ref.AbstractRefXmlTest
Tests run: 1, Failures: 0, Errors: 0, Skipped: 1, Time elapsed: 0.001 sec
Running org.apache.olingo.odata2.fit.ref.DataServiceVersionTest
Tests run: 18, Failures: 0, Errors: 0, Skipped: 0, Time elapsed: 10.136 sec
Running org.apache.olingo.odata2.fit.ref.LinksXmlReadOnlyTest
Tests run: 4, Failures: 0, Errors: 0, Skipped: 0, Time elapsed: 2.289 sec
Running org.apache.olingo.odata2.fit.ref.FeedJsonReadOnlyTest
Tests run: 10, Failures: 0, Errors: 0, Skipped: 0, Time elapsed: 5.618 sec
Running org.apache.olingo.odata2.fit.ref.EntryJsonCreateInlineTest
Tests run: 18, Failures: 0, Errors: 0, Skipped: 0, Time elapsed: 10.139 sec
Running org.apache.olingo.odata2.fit.ref.LinksJsonChangeTest
Tests run: 4, Failures: 0, Errors: 0, Skipped: 0, Time elapsed: 2.262 sec
Running org.apache.olingo.odata2.fit.ref.EntryXmlReadOnlyTest
Tests run: 12, Failures: 0, Errors: 0, Skipped: 0, Time elapsed: 7.141 sec
Running org.apache.olingo.odata2.fit.ref.ServiceXmlTest
Tests run: 16, Failures: 0, Errors: 0, Skipped: 0, Time elapsed: 9.244 sec
Running org.apache.olingo.odata2.fit.ref.PropertyJsonChangeTest
ERROR FitErrorCallback - Internal Server Error
org.apache.olingo.odata2.api.exception.ODataInternalServerErrorException: Service unavailable.
	at org.apache.olingo.odata2.core.servlet.ODataServlet.createServiceUnavailableResponse(ODataServlet.java:307)
	at org.apache.olingo.odata2.core.servlet.ODataServlet.handleRequest(ODataServlet.java:172)
	at org.apache.olingo.odata2.core.servlet.ODataServlet.handle(ODataServlet.java:108)
	at org.apache.olingo.odata2.core.servlet.ODataServlet.service(ODataServlet.java:79)
	at javax.servlet.http.HttpServlet.service(HttpServlet.java:820)
	at org.eclipse.jetty.servlet.ServletHolder.handle(ServletHolder.java:547)
	at org.eclipse.jetty.servlet.ServletHandler.doHandle(ServletHandler.java:480)
	at org.eclipse.jetty.server.session.SessionHandler.doHandle(SessionHandler.java:225)
	at org.eclipse.jetty.server.handler.ContextHandler.doHandle(ContextHandler.java:941)
	at org.eclipse.jetty.servlet.ServletHandler.doScope(ServletHandler.java:409)
	at org.eclipse.jetty.server.session.SessionHandler.doScope(SessionHandler.java:186)
	at org.eclipse.jetty.server.handler.ContextHandler.doScope(ContextHandler.java:875)
	at org.eclipse.jetty.server.handler.ScopedHandler.handle(ScopedHandler.java:117)
	at org.eclipse.jetty.server.handler.HandlerWrapper.handle(HandlerWrapper.java:110)
	at org.eclipse.jetty.server.Server.handle(Server.java:349)
	at org.eclipse.jetty.server.HttpConnection.handleRequest(HttpConnection.java:441)
	at org.eclipse.jetty.server.HttpConnection$RequestHandler.content(HttpConnection.java:936)
	at org.eclipse.jetty.http.HttpParser.parseNext(HttpParser.java:801)
	at org.eclipse.jetty.http.HttpParser.parseAvailable(HttpParser.java:224)
	at org.eclipse.jetty.server.AsyncHttpConnection.handle(AsyncHttpConnection.java:51)
	at org.eclipse.jetty.io.nio.SelectChannelEndPoint.handle(SelectChannelEndPoint.java:586)
	at org.eclipse.jetty.io.nio.SelectChannelEndPoint$1.run(SelectChannelEndPoint.java:44)
	at org.eclipse.jetty.util.thread.QueuedThreadPool.runJob(QueuedThreadPool.java:598)
	at org.eclipse.jetty.util.thread.QueuedThreadPool$3.run(QueuedThreadPool.java:533)
	at java.lang.Thread.run(Thread.java:662)
ERROR FitErrorCallback - Internal Server Error
java.io.IOException: Closed
	at org.eclipse.jetty.server.HttpOutput.write(HttpOutput.java:122)
	at org.apache.olingo.odata2.core.servlet.ODataServlet.createResponse(ODataServlet.java:252)
	at org.apache.olingo.odata2.core.servlet.ODataServlet.createServiceUnavailableResponse(ODataServlet.java:309)
	at org.apache.olingo.odata2.core.servlet.ODataServlet.handleRequest(ODataServlet.java:172)
	at org.apache.olingo.odata2.core.servlet.ODataServlet.handle(ODataServlet.java:108)
	at org.apache.olingo.odata2.core.servlet.ODataServlet.service(ODataServlet.java:79)
	at javax.servlet.http.HttpServlet.service(HttpServlet.java:820)
	at org.eclipse.jetty.servlet.ServletHolder.handle(ServletHolder.java:547)
	at org.eclipse.jetty.servlet.ServletHandler.doHandle(ServletHandler.java:480)
	at org.eclipse.jetty.server.session.SessionHandler.doHandle(SessionHandler.java:225)
	at org.eclipse.jetty.server.handler.ContextHandler.doHandle(ContextHandler.java:941)
	at org.eclipse.jetty.servlet.ServletHandler.doScope(ServletHandler.java:409)
	at org.eclipse.jetty.server.session.SessionHandler.doScope(SessionHandler.java:186)
	at org.eclipse.jetty.server.handler.ContextHandler.doScope(ContextHandler.java:875)
	at org.eclipse.jetty.server.handler.ScopedHandler.handle(ScopedHandler.java:117)
	at org.eclipse.jetty.server.handler.HandlerWrapper.handle(HandlerWrapper.java:110)
	at org.eclipse.jetty.server.Server.handle(Server.java:349)
	at org.eclipse.jetty.server.HttpConnection.handleRequest(HttpConnection.java:441)
	at org.eclipse.jetty.server.HttpConnection$RequestHandler.content(HttpConnection.java:936)
	at org.eclipse.jetty.http.HttpParser.parseNext(HttpParser.java:801)
	at org.eclipse.jetty.http.HttpParser.parseAvailable(HttpParser.java:224)
	at org.eclipse.jetty.server.AsyncHttpConnection.handle(AsyncHttpConnection.java:51)
	at org.eclipse.jetty.io.nio.SelectChannelEndPoint.handle(SelectChannelEndPoint.java:586)
	at org.eclipse.jetty.io.nio.SelectChannelEndPoint$1.run(SelectChannelEndPoint.java:44)
	at org.eclipse.jetty.util.thread.QueuedThreadPool.runJob(QueuedThreadPool.java:598)
	at org.eclipse.jetty.util.thread.QueuedThreadPool$3.run(QueuedThreadPool.java:533)
	at java.lang.Thread.run(Thread.java:662)
Tests run: 8, Failures: 0, Errors: 0, Skipped: 0, Time elapsed: 4.623 sec
Running org.apache.olingo.odata2.fit.ref.PropertyXmlChangeTest
Tests run: 4, Failures: 0, Errors: 0, Skipped: 0, Time elapsed: 2.371 sec
Running org.apache.olingo.odata2.fit.ref.MetadataTest
Tests run: 14, Failures: 0, Errors: 0, Skipped: 0, Time elapsed: 8.229 sec
Running org.apache.olingo.odata2.fit.ref.PropertyJsonReadOnlyTest
Tests run: 4, Failures: 0, Errors: 0, Skipped: 0, Time elapsed: 2.26 sec
Running org.apache.olingo.odata2.fit.mapping.MappingTest
Tests run: 10, Failures: 0, Errors: 0, Skipped: 0, Time elapsed: 5.397 sec

Results :

Tests run: 540, Failures: 0, Errors: 0, Skipped: 16

[INFO] 
[INFO] --- maven-jar-plugin:2.3.2:jar (default-jar) @ olingo-odata2-fit ---
[INFO] Building jar: /x1/jenkins/jenkins-slave/workspace/olingo-odata2/odata2-lib/odata-fit/target/olingo-odata2-fit-2.0.4-SNAPSHOT.jar
[INFO] 
[INFO] --- maven-site-plugin:3.2:attach-descriptor (attach-descriptor) @ olingo-odata2-fit
---
[INFO] 
[INFO] --- maven-source-plugin:2.2.1:jar-no-fork (attach-sources) @ olingo-odata2-fit ---
[INFO] Building jar: /x1/jenkins/jenkins-slave/workspace/olingo-odata2/odata2-lib/odata-fit/target/olingo-odata2-fit-2.0.4-SNAPSHOT-sources.jar
[INFO] 
[INFO] --- maven-checkstyle-plugin:2.10:check (checkstyle) @ olingo-odata2-fit ---
[INFO] Starting audit...
Audit done.

[INFO] 
[INFO] --- maven-install-plugin:2.3.1:install (default-install) @ olingo-odata2-fit ---
[INFO] Installing /x1/jenkins/jenkins-slave/workspace/olingo-odata2/odata2-lib/odata-fit/target/olingo-odata2-fit-2.0.4-SNAPSHOT.jar
to /home/jenkins/.m2/repository/org/apache/olingo/olingo-odata2-fit/2.0.4-SNAPSHOT/olingo-odata2-fit-2.0.4-SNAPSHOT.jar
[INFO] Installing /x1/jenkins/jenkins-slave/workspace/olingo-odata2/odata2-lib/odata-fit/pom.xml
to /home/jenkins/.m2/repository/org/apache/olingo/olingo-odata2-fit/2.0.4-SNAPSHOT/olingo-odata2-fit-2.0.4-SNAPSHOT.pom
[INFO] Installing /x1/jenkins/jenkins-slave/workspace/olingo-odata2/odata2-lib/odata-fit/target/olingo-odata2-fit-2.0.4-SNAPSHOT-sources.jar
to /home/jenkins/.m2/repository/org/apache/olingo/olingo-odata2-fit/2.0.4-SNAPSHOT/olingo-odata2-fit-2.0.4-SNAPSHOT-sources.jar
[INFO] 
[INFO] --- maven-deploy-plugin:2.7:deploy (default-deploy) @ olingo-odata2-fit ---
[INFO] Skipping artifact deployment
[INFO]                                                                         
[INFO] ------------------------------------------------------------------------
[INFO] Building olingo-odata2-ref-web 2.0.4-SNAPSHOT
[INFO] ------------------------------------------------------------------------
[INFO] 
[INFO] --- maven-clean-plugin:2.5:clean (default-clean) @ olingo-odata2-ref-web ---
[INFO] Deleting /x1/jenkins/jenkins-slave/workspace/olingo-odata2/odata2-lib/odata-web/target
[INFO] 
[INFO] --- buildnumber-maven-plugin:1.2:create (default) @ olingo-odata2-ref-web ---
[INFO] 
[INFO] --- maven-remote-resources-plugin:1.4:process (default) @ olingo-odata2-ref-web ---
[INFO] 
[INFO] --- maven-resources-plugin:2.6:resources (default-resources) @ olingo-odata2-ref-web
---
[INFO] Using 'UTF-8' encoding to copy filtered resources.
[INFO] Copying 1 resource to ../olingo-odata2-ref-web-2.0.4-SNAPSHOT/gen
[INFO] Copying 1 resource
[INFO] Copying 3 resources
[INFO] Copying 3 resources
[INFO] 
[INFO] --- maven-compiler-plugin:2.3.2:compile (default-compile) @ olingo-odata2-ref-web ---
[INFO] No sources to compile
[INFO] 
[INFO] --- maven-resources-plugin:2.6:testResources (default-testResources) @ olingo-odata2-ref-web
---
[INFO] Using 'UTF-8' encoding to copy filtered resources.
[INFO] skip non existing resourceDirectory /x1/jenkins/jenkins-slave/workspace/olingo-odata2/odata2-lib/odata-web/src/test/resources
[INFO] Copying 3 resources
[INFO] 
[INFO] --- maven-compiler-plugin:2.3.2:testCompile (default-testCompile) @ olingo-odata2-ref-web
---
[INFO] No sources to compile
[INFO] 
[INFO] --- maven-surefire-plugin:2.12.4:test (default-test) @ olingo-odata2-ref-web ---
[INFO] 
[INFO] --- maven-war-plugin:2.4:war (default-war) @ olingo-odata2-ref-web ---
[INFO] Packaging webapp
[INFO] Assembling webapp [olingo-odata2-ref-web] in [/x1/jenkins/jenkins-slave/workspace/olingo-odata2/odata2-lib/odata-web/target/olingo-odata2-ref-web-2.0.4-SNAPSHOT]
[INFO] Processing war project
[INFO] Copying webapp webResources [/x1/jenkins/jenkins-slave/workspace/olingo-odata2/odata2-lib/odata-web/target/maven-shared-archive-resources]
to [/x1/jenkins/jenkins-slave/workspace/olingo-odata2/odata2-lib/odata-web/target/olingo-odata2-ref-web-2.0.4-SNAPSHOT]
[INFO] Copying webapp resources [/x1/jenkins/jenkins-slave/workspace/olingo-odata2/odata2-lib/odata-web/src/main/webapp]
[INFO] Webapp assembled in [86 msecs]
[INFO] Building war: /x1/jenkins/jenkins-slave/workspace/olingo-odata2/odata2-lib/odata-web/target/olingo-odata2-ref-web-2.0.4-SNAPSHOT.war
[INFO] 
[INFO] --- maven-site-plugin:3.2:attach-descriptor (attach-descriptor) @ olingo-odata2-ref-web
---
[INFO] 
[INFO] --- maven-source-plugin:2.2.1:jar-no-fork (attach-sources) @ olingo-odata2-ref-web
---
[INFO] Building jar: /x1/jenkins/jenkins-slave/workspace/olingo-odata2/odata2-lib/odata-web/target/olingo-odata2-ref-web-2.0.4-SNAPSHOT-sources.jar
[INFO] 
[INFO] --- maven-checkstyle-plugin:2.10:check (checkstyle) @ olingo-odata2-ref-web ---
[INFO] Starting audit...
Audit done.

[INFO] 
[INFO] --- maven-install-plugin:2.3.1:install (default-install) @ olingo-odata2-ref-web ---
[INFO] Installing /x1/jenkins/jenkins-slave/workspace/olingo-odata2/odata2-lib/odata-web/target/olingo-odata2-ref-web-2.0.4-SNAPSHOT.war
to /home/jenkins/.m2/repository/org/apache/olingo/olingo-odata2-ref-web/2.0.4-SNAPSHOT/olingo-odata2-ref-web-2.0.4-SNAPSHOT.war
[INFO] Installing /x1/jenkins/jenkins-slave/workspace/olingo-odata2/odata2-lib/odata-web/pom.xml
to /home/jenkins/.m2/repository/org/apache/olingo/olingo-odata2-ref-web/2.0.4-SNAPSHOT/olingo-odata2-ref-web-2.0.4-SNAPSHOT.pom
[INFO] Installing /x1/jenkins/jenkins-slave/workspace/olingo-odata2/odata2-lib/odata-web/target/olingo-odata2-ref-web-2.0.4-SNAPSHOT-sources.jar
to /home/jenkins/.m2/repository/org/apache/olingo/olingo-odata2-ref-web/2.0.4-SNAPSHOT/olingo-odata2-ref-web-2.0.4-SNAPSHOT-sources.jar
[INFO] 
[INFO] --- maven-deploy-plugin:2.7:deploy (default-deploy) @ olingo-odata2-ref-web ---
[INFO] Skipping artifact deployment
[INFO]                                                                         
[INFO] ------------------------------------------------------------------------
[INFO] Building olingo-odata2-jpa-processor 2.0.4-SNAPSHOT
[INFO] ------------------------------------------------------------------------
[INFO] 
[INFO] --- maven-clean-plugin:2.5:clean (default-clean) @ olingo-odata2-jpa-processor ---
[INFO] Deleting /x1/jenkins/jenkins-slave/workspace/olingo-odata2/odata2-jpa-processor/target
[INFO] 
[INFO] --- buildnumber-maven-plugin:1.2:create (default) @ olingo-odata2-jpa-processor ---
[INFO] 
[INFO] --- maven-remote-resources-plugin:1.4:process (default) @ olingo-odata2-jpa-processor
---
[INFO] 
[INFO] --- maven-site-plugin:3.2:attach-descriptor (attach-descriptor) @ olingo-odata2-jpa-processor
---
[INFO] 
[INFO] --- maven-source-plugin:2.2.1:jar-no-fork (attach-sources) @ olingo-odata2-jpa-processor
---
[INFO] 
[INFO] --- maven-checkstyle-plugin:2.10:check (checkstyle) @ olingo-odata2-jpa-processor ---
[INFO] Starting audit...
Audit done.

[INFO] 
[INFO] --- maven-install-plugin:2.3.1:install (default-install) @ olingo-odata2-jpa-processor
---
[INFO] Installing /x1/jenkins/jenkins-slave/workspace/olingo-odata2/odata2-jpa-processor/pom.xml
to /home/jenkins/.m2/repository/org/apache/olingo/olingo-odata2-jpa-processor/2.0.4-SNAPSHOT/olingo-odata2-jpa-processor-2.0.4-SNAPSHOT.pom
[INFO] 
[INFO] --- maven-deploy-plugin:2.7:deploy (default-deploy) @ olingo-odata2-jpa-processor ---
Downloading: https://repository.apache.org/content/repositories/snapshots/org/apache/olingo/olingo-odata2-jpa-processor/2.0.4-SNAPSHOT/maven-metadata.xml
              
[WARNING] Could not transfer metadata org.apache.olingo:olingo-odata2-jpa-processor:2.0.4-SNAPSHOT/maven-metadata.xml
from/to apache.snapshots.https (https://repository.apache.org/content/repositories/snapshots):
java.lang.RuntimeException: Could not generate DH keypair
[INFO] ------------------------------------------------------------------------
[INFO] Reactor Summary:
[INFO] 
[INFO] olingo-odata2-parent .............................. SUCCESS [5.956s]
[INFO] olingo-odata2-lib ................................. SUCCESS [0.744s]
[INFO] olingo-odata2-api ................................. SUCCESS [7.376s]
[INFO] olingo-odata2-api-annotation ...................... SUCCESS [3.130s]
[INFO] olingo-odata2-testutil ............................ SUCCESS [3.220s]
[INFO] olingo-odata2-core ................................ SUCCESS [28.714s]
[INFO] olingo-odata2-ref ................................. SUCCESS [4.464s]
[INFO] olingo-odata2-fit ................................. SUCCESS [4:59.021s]
[INFO] olingo-odata2-ref-web ............................. SUCCESS [1.453s]
[INFO] olingo-odata2-jpa-processor ....................... FAILURE [0.345s]
[INFO] olingo-odata2-jpa-processor-api ................... SKIPPED
[INFO] olingo-odata2-jpa-processor-core .................. SKIPPED
[INFO] olingo-odata2-jpa-processor-ref ................... SKIPPED
[INFO] olingo-odata2-jpa-processor-ref-web ............... SKIPPED
[INFO] olingo-odata2-annotation-processor ................ SKIPPED
[INFO] olingo-odata2-annotation-processor-api ............ SKIPPED
[INFO] olingo-odata2-annotation-processor-core ........... SKIPPED
[INFO] olingo-odata2-annotation-processor-ref ............ SKIPPED
[INFO] olingo-odata2-annotation-processor-ref-web ........ SKIPPED
[INFO] olingo-odata2-dist ................................ SKIPPED
[INFO] olingo-odata2-dist-lib ............................ SKIPPED
[INFO] olingo-odata2-dist-jpa ............................ SKIPPED
[INFO] olingo-odata2-dist-janos .......................... SKIPPED
[INFO] olingo-odata2-dist-ref ............................ SKIPPED
[INFO] olingo-odata2-dist-javadoc ........................ SKIPPED
[INFO] olingo-odata2-sample .............................. SKIPPED
[INFO] olingo-odata2-sample-cars-service-archetype ....... SKIPPED
[INFO] olingo-odata2-sample-cars-annotation-archetype .... SKIPPED
[INFO] olingo-odata2-sample-cars-jpa-archetype ........... SKIPPED
[INFO] ------------------------------------------------------------------------
[INFO] BUILD FAILURE
[INFO] ------------------------------------------------------------------------
[INFO] Total time: 5:55.366s
[INFO] Finished at: Mon Mar 30 00:47:59 UTC 2015
[INFO] Final Memory: 57M/271M
[INFO] ------------------------------------------------------------------------
[ERROR] Failed to execute goal org.apache.maven.plugins:maven-deploy-plugin:2.7:deploy (default-deploy)
on project olingo-odata2-jpa-processor: Failed to retrieve remote metadata org.apache.olingo:olingo-odata2-jpa-processor:2.0.4-SNAPSHOT/maven-metadata.xml:
Could not transfer metadata org.apache.olingo:olingo-odata2-jpa-processor:2.0.4-SNAPSHOT/maven-metadata.xml
from/to apache.snapshots.https (https://repository.apache.org/content/repositories/snapshots):
java.lang.RuntimeException: Could not generate DH keypair: Prime size must be multiple of
64, and can only range from 512 to 1024 (inclusive) -> [Help 1]
[ERROR] 
[ERROR] To see the full stack trace of the errors, re-run Maven with the -e switch.
[ERROR] Re-run Maven using the -X switch to enable full debug logging.
[ERROR] 
[ERROR] For more information about the errors and possible solutions, please read the following
articles:
[ERROR] [Help 1] http://cwiki.apache.org/confluence/display/MAVEN/MojoExecutionException
[ERROR] 
[ERROR] After correcting the problems, you can resume the build with the command
[ERROR]   mvn <goals> -rf :olingo-odata2-jpa-processor
Build step 'Invoke top-level Maven targets' marked build as failure

Mime
View raw message