olingo-commits mailing list archives

Site index · List index
Message view « Date » · « Thread »
Top « Date » · « Thread »
From Apache Jenkins Server <jenk...@builds.apache.org>
Subject Build failed in Jenkins: olingo-odata4 #814
Date Mon, 23 Feb 2015 13:30:12 GMT
See <https://builds.apache.org/job/olingo-odata4/814/changes>

Changes:

[michael.bolz] [OLINGO-575] Merge common with specific api in commons module

------------------------------------------
[...truncated 15495 lines...]
  FilterSystemQueryITCase.testSimpleEq:109->sendRequest:940->sendRequest:957 » ODataClientError
  FilterSystemQueryITCase.testAddNullLiteral:387->sendRequest:940->sendRequest:957 »
ODataClientError
  FilterSystemQueryITCase.testStringPropertyEqualsNull:381->sendRequest:940->sendRequest:957
» ODataClientError
  FilterSystemQueryITCase.testDurrationSubDuration:813->sendRequest:940->sendRequest:957
» ODataClientError
  FilterSystemQueryITCase.testIndexOf:689->sendRequest:940->sendRequest:957 » ODataClientError
  FilterSystemQueryITCase.testUnaryMinusOperator:353->sendRequest:940->sendRequest:957
» ODataClientError
  FilterSystemQueryITCase.testSecondFunctionDateTimeOffset:551->sendRequest:940->sendRequest:957
» ODataClientError
  FilterSystemQueryITCase.testDayFunctionDate:503->sendRequest:940->sendRequest:957
» ODataClientError
  FilterSystemQueryITCase.testDecimalDiv:738->sendRequest:940->sendRequest:957 » ODataClientError
  FilterSystemQueryITCase.testDayFunctionDateTimeOffset:488->sendRequest:940->sendRequest:957
» ODataClientError
  FilterSystemQueryITCase.testTimeOfDayLiteral:58->sendRequest:940->sendRequest:957
» ODataClientError
  FilterSystemQueryITCase.testBinaryOperationIntegerDecimalWithPromotion:312->sendRequest:940->sendRequest:957
» ODataClientError
  FilterSystemQueryITCase.testDateTimeOffsetSubDateTimeOffset:843->sendRequest:940->sendRequest:957
» ODataClientError
  FilterSystemQueryITCase.testDateAddDuration:793->sendRequest:940->sendRequest:957
» ODataClientError
  FilterSystemQueryITCase.testMonthFunctionDate:479->sendRequest:940->sendRequest:957
» ODataClientError
  FilterSystemQueryITCase.testSubstringStartGiven:410->sendRequest:940->sendRequest:957
» ODataClientError
  FilterSystemQueryITCase.testYearFunctionDateTimeOffset:455->sendRequest:940->sendRequest:957
» ODataClientError
  FilterSystemQueryITCase.testStartsWith:699->sendRequest:940->sendRequest:957 » ODataClientError
  FilterSystemQueryITCase.testDoubleLiteral:99->sendRequest:940->sendRequest:957 »
ODataClientError
  FilterSystemQueryITCase.testDateTimeFunctionsNull:591->sendRequest:940->sendRequest:957
» ODataClientError
  MediaITCase.create:129 » HttpClient java.util.concurrent.ExecutionException: o...
  MediaITCase.delete:80 » ODataClientError (400) Bad Request [HTTP/1.0 400 Bad R...
  MediaITCase.update:106 » HttpClient java.util.concurrent.ExecutionException: o...
  MediaITCase.read:63 » ODataClientError (404) Not Found [HTTP/1.0 404 Not Found...
  NavigationITCase.twoLevelsToEntityWithKey:79 » ODataClientError (404) Not Foun...
  NavigationITCase.twoLevelsToProperty:120 » ODataClientError (404) Not Found [H...
  NavigationITCase.oneLevelToEntityWithKey:61 » ODataClientError (404) Not Found...
  NavigationITCase.twoLevelsToEntitySet:98 » ODataClientError (404) Not Found [H...
  NavigationITCase.oneLevelToEntity:43 » ODataClientError (404) Not Found [HTTP/...
  OrderBySystemQueryITCase.testSimpleOrderBy:55->sendRequest:150 » ODataClientError
  OrderBySystemQueryITCase.testSimpleOrderByDecending:72->sendRequest:150 » ODataClientError
  OrderBySystemQueryITCase.testOrderByWithNull:117->sendRequest:150 » ODataClientError
  OrderBySystemQueryITCase.testMultipleOrderByDecending:102->sendRequest:150 » ODataClientError
  OrderBySystemQueryITCase.testMultipleOrderBy:87->sendRequest:150 » ODataClientError
  PrimitiveComplexITCase.readComplexProperty:145 » ODataClientError (404) Not Fo...
  PrimitiveComplexITCase.readSimpleProperty:65 » ODataClientError (404) Not Foun...
  PrimitiveComplexITCase.deletePrimitive:96 » ODataClientError (400) Bad Request...
  PrimitiveComplexITCase.deletePrimitiveCollection:121 » ODataClientError (400) ...
  PrimitiveComplexITCase.readPropertyValue:224 » ODataClientError (404) Not Foun...
  PrimitiveComplexITCase.readSimplePropertyContextURL:83 » ODataClientError (404...
  PrimitiveComplexITCase.deleteComplex:176 » ODataClientError (400) Bad Request ...
  PrimitiveComplexITCase.readNoContentProperty:211 » ODataClientError (404) Not ...
  PrimitiveComplexITCase.readComplexPropertyContextURL:163 » ODataClientError (4...
  AsyncTestITCase.asyncOrdersAsAtom:157->asyncOrders:144 » ODataClientError (404...
  AsyncTestITCase.asyncOrdersAsJSON:162->asyncOrders:144 » ODataClientError (404...
  AsyncTestITCase.withInlineEntryAsAtom:123->withInlineEntry:75 » ODataClientError
  AsyncTestITCase.withInlineEntryAsJSON:129->withInlineEntry:75 » ODataClientError
  AsyncTestITCase.clientAsync:59 » Execution org.apache.olingo.client.api.commun...
  AuthBatchTestITCase.authorized:59->batchRequest:116 » HttpClient java.util.con...
  AuthBatchTestITCase.clean:52->batchRequest:116 » HttpClient java.util.concurre...
  BatchTestITCase.continueOnError:169->continueOnError:213 » HttpClient java.uti...
  BatchTestITCase.emptyBatchRequest:106 » HttpClient java.util.concurrent.Execut...
  BatchTestITCase.doNotContinueOnError:174->continueOnError:213 » HttpClient jav...
  BatchTestITCase.async:551 » HttpClient java.util.concurrent.ExecutionException...
  BatchTestITCase.batchRequest:459 » HttpClient java.util.concurrent.ExecutionEx...
  BatchTestITCase.batchRequestWithOutsideUpdates:360 » HttpClient java.util.conc...
  BatchTestITCase.changesetWithError:148 » HttpClient java.util.concurrent.Execu...
  BatchTestITCase.changesetWithReference:282 » HttpClient java.util.concurrent.E...
  BoundOperationInvokeTestITCase.edmEnabledActions:385 » ODataClientError (404) ...
  BoundOperationInvokeTestITCase.atomActions:373->actions:273 » ODataClientError
  BoundOperationInvokeTestITCase.atomFunctions:173->functions:59 » ODataClientError
  BoundOperationInvokeTestITCase.jsonFunctions:178->functions:59 » ODataClientError
  BoundOperationInvokeTestITCase.edmEnabledFunctions:184 » ODataClientError (404...
  BoundOperationInvokeTestITCase.jsonActions:378->actions:273 » ODataClientError
  ConformanceTestITCase.item10:339 » ODataClientError (404) Not Found [HTTP/1.0 ...
  ConformanceTestITCase.item11:392 » ODataClientError (404) Not Found [HTTP/1.0 ...
  ConformanceTestITCase.item12:419 » ODataClientError (404) Not Found [HTTP/1.0 ...
  ConformanceTestITCase.item1:84 » ODataClientError (404) Not Found [HTTP/1.0 40...
  ConformanceTestITCase.item2:141 » ODataClientError (400) Bad Request [HTTP/1.0...
  ConformanceTestITCase.item4:167 » ODataClientError (404) Not Found [HTTP/1.0 4...
  ConformanceTestITCase.item5:188 » ODataClientError (404) Not Found [HTTP/1.0 4...
  ConformanceTestITCase.item6:236 » ODataClientError (400) Bad Request [HTTP/1.0...
  ConformanceTestITCase.item7:272 » ODataClientError (400) Bad Request [HTTP/1.0...
  ConformanceTestITCase.item8:295 » ODataClientError (404) Not Found [HTTP/1.0 4...
  ConformanceTestITCase.item9:312 » ODataClientError (404) Not Found [HTTP/1.0 4...
  DeltaTestITCase.jsonParse:84->parse:40 » ODataClientError (404) Not Found [HTT...
  DeltaTestITCase.atomParse:79->parse:40 » ODataClientError (404) Not Found [HTT...
  DerivedTypeTestITCase.createDeleteAsAtom:144->createDelete:125 » ODataClientError
  DerivedTypeTestITCase.createDeleteAsJSON:149->createDelete:125 » HttpClient ja...
  DerivedTypeTestITCase.readfromAtom:73->read:54 » ODataClientError (404) Not Fo...
  DerivedTypeTestITCase.readfromJSON:78->read:54 » ODataClientError (404) Not Fo...
  EntityCreateTestITCase.jsonOnContained:111->onContained:61 » ODataClientError ...
  EntityCreateTestITCase.jsonCreateAndDelete:50->AbstractTestITCase.createAndDeleteOrder:151
» HttpClient
  EntityCreateTestITCase.jsonDeepInsert:190->deepInsert:166 » HttpClient java.ne...
  EntityCreateTestITCase.atomOnContained:106->onContained:61 » ODataClientError ...
  EntityCreateTestITCase.atomCreateAndDelete:45->AbstractTestITCase.createAndDeleteOrder:151
» HttpClient
  EntityCreateTestITCase.atomDeepInsert:185->deepInsert:166 » ODataClientError (...
  EntityRetrieveTestITCase.containedFromFullJSON:333->contained:317 » ODataClientError
  EntityRetrieveTestITCase.atomReference:302->reference:282 » ODataClientError (...
  EntityRetrieveTestITCase.withInlineEntitySetFromFullJSON:161->withInlineEntitySet:134
» ODataClientError
  EntityRetrieveTestITCase.entitySetNavigationLinkFromAtom:359->entitySetNavigationLink:347
» ODataClientError
  EntityRetrieveTestITCase.entitySetNavigationLinkFromJSON:365->entitySetNavigationLink:347
» ODataClientError
  EntityRetrieveTestITCase.withInlineEntityFromAtom:113->withInlineEntity:64 » ODataClientError
  EntityRetrieveTestITCase.withInlineEntityFromJSON:123->withInlineEntity:64 » ODataClientError
  EntityRetrieveTestITCase.rawRequestAsAtom:188->rawRequest:176 » ODataClientError
  EntityRetrieveTestITCase.rawRequestAsJSON:194->rawRequest:176 » ODataClientError
  EntityRetrieveTestITCase.withInlineEntityFromFullJSON:118->withInlineEntity:64 » ODataClientError
  EntityRetrieveTestITCase.multiKeyAsAtom:217->multiKey:208 » ODataClientError (...
  EntityRetrieveTestITCase.multiKeyAsJSON:222->multiKey:208 » ODataClientError (...
  EntityRetrieveTestITCase.jsonReference:307->reference:282 » ODataClientError (...
  EntityRetrieveTestITCase.checkForETagAsFullJSON:254->checkForETag:232 » ODataClientError
  EntityRetrieveTestITCase.withInlineEntitySetFromAtom:156->withInlineEntitySet:134 »
ODataClientError
  EntityRetrieveTestITCase.withInlineEntitySetFromJSON:166->withInlineEntitySet:134 »
ODataClientError
  EntityRetrieveTestITCase.checkForETagAsAtom:249->checkForETag:232 » ODataClientError
  EntityRetrieveTestITCase.checkForETagAsJSON:259->checkForETag:232 » ODataClientError
  EntityRetrieveTestITCase.containedFromAtom:328->contained:317 » ODataClientError
  EntityRetrieveTestITCase.containedFromJSON:338->contained:317 » ODataClientError
  EntityRetrieveTestITCase.issue99 »  Unexpected exception, expected<java.lang.I...
  EntitySetTestITCase.readWithNextFromAtom:170->readWithNext:154 » ODataClientError
  EntitySetTestITCase.readWithNextFromJSON:175->readWithNext:154 » ODataClientError
  EntitySetTestITCase.readODataEntitySetIteratorFromJSONNo:143->readODataEntitySetIterator:111
» ODataClientError
  EntitySetTestITCase.readWithInlineCountAsFullJSON:96->readWithInlineCount:79 » ODataClientError
  EntitySetTestITCase.readODataEntitySetIteratorFromAtom:128->readODataEntitySetIterator:111
» ODataClientError
  EntitySetTestITCase.readODataEntitySetIteratorFromJSON:133->readODataEntitySetIterator:111
» ODataClientError
  EntitySetTestITCase.rawRequestAsAtom:64->rawRequest:54 » ODataClientError (404...
  EntitySetTestITCase.rawRequestAsJSON:69->rawRequest:54 » ODataClientError (404...
  EntitySetTestITCase.readWithInlineCountAsAtom:101->readWithInlineCount:79 » ODataClientError
  EntitySetTestITCase.readWithInlineCountAsJSON:91->readWithInlineCount:79 » ODataClientError
  EntitySetTestITCase.readODataEntitySetIteratorFromJSONFull:138->readODataEntitySetIterator:111
» ODataClientError
  EntityUpdateTestITCase.jsonBindOperation:183->bindOperation:162 » ODataClientError
  EntityUpdateTestITCase.jsonOnContained:145->onContained:130 » ODataClientError
  EntityUpdateTestITCase.atomBindOperation:178->bindOperation:162 » HttpClient j...
  EntityUpdateTestITCase.atomUpsert:106->upsert:66 » ODataClientError (400) Bad ...
  EntityUpdateTestITCase.jsonUpsert:112->upsert:66 » ODataClientError (400) Bad ...
  EntityUpdateTestITCase.atomOnContained:140->onContained:130 » HttpClient java....
  ErrorResponseTestITCase.jsonError:48 NullPointer
  FilterFactoryTestITCase.crossjoin:55 » ODataClientError (404) Not Found [HTTP/...
  JSONFormatConformanceTestITCase.item1:72 » ODataClientError (404) Not Found [H...
  JSONFormatConformanceTestITCase.item2:99 » ODataClientError (404) Not Found [H...
  JSONFormatConformanceTestITCase.item6:324 » ODataClientError (404) Not Found [...
  KeyAsSegmentTestITCase.jsonRead:78->read:60 » ODataClientError (404) Not Found...
  KeyAsSegmentTestITCase.jsonCreateAndDelete:88->AbstractTestITCase.createAndDeleteOrder:151
» HttpClient
  KeyAsSegmentTestITCase.atomUpdate:119->update:104 » ODataClientError (400) Bad...
  KeyAsSegmentTestITCase.atomRead:73->read:60 » ODataClientError (404) Not Found...
  KeyAsSegmentTestITCase.jsonUpdate:124->update:104 » HttpClient java.net.Socket...
  KeyAsSegmentTestITCase.atomCreateAndDelete:83->AbstractTestITCase.createAndDeleteOrder:151
» HttpClient
  MediaEntityTestITCase.updateAsAtom:176->update:161 » HttpClient java.util.conc...
  MediaEntityTestITCase.updateAsJSON:181->update:161 » HttpClient java.util.conc...
  MediaEntityTestITCase.readAsAtom:86->read:68 » ODataClientError (404) Not Foun...
  MediaEntityTestITCase.readAsJSON:91->read:68 » ODataClientError (404) Not Foun...
  MediaEntityTestITCase.readAsJSONFull:96->read:68 » ODataClientError (404) Not ...
  MediaEntityTestITCase.createAsAtom:140->create:108 » HttpClient java.util.conc...
  MediaEntityTestITCase.createAsJSON:145->create:108 » HttpClient java.util.conc...
  MetadataTestITCase.retrieve:46 » ODataClientError (404) Not Found [HTTP/1.0 40...
  MetadataTestITCase.vocabularies:95 » ODataClientError (404) Not Found [HTTP/1....
  MetadataTestITCase.include:81 » ODataClientError (404) Not Found [HTTP/1.0 404...
  OAuth2TestITCase.createAndDelete:112->AbstractTestITCase.createAndDeleteOrder:147 »
OAuth2
  OAuth2TestITCase.readAsFullJSON:102->read:77 » OAuth2 java.io.IOException: com...
  OAuth2TestITCase.readAsAtom:97->read:77 » OAuth2 java.io.IOException: com.fast...
  OAuth2TestITCase.readAsJSON:107->read:77 » OAuth2 java.io.IOException: com.fas...
  OpenTypeTestITCase.readAsAtom:74->read:64->readRow:60->AbstractTestITCase.read:105
» ODataClientError
  OpenTypeTestITCase.readAsJSON:79->read:64->readRow:60->AbstractTestITCase.read:105
» ODataClientError
  OpenTypeTestITCase.checkOpenTypeEntityTypesExist:47 » ODataClientError (404) N...
  OpenTypeTestITCase.cudAsAtom:183->cud:159 » HttpClient java.net.SocketExceptio...
  OpenTypeTestITCase.cudAsJSON:188->cud:159 » ODataClientError (400) Bad Request...
  OperationImportInvokeTestITCase.atomBossEmails:287->bossEmails:265 » ODataClientError
  OperationImportInvokeTestITCase.atomFunctionImports:116->functionImports:51 » ODataClientError
  OperationImportInvokeTestITCase.jsonActionImports:223->actionImports:193 » ODataClientError
  OperationImportInvokeTestITCase.atomActionImports:218->actionImports:193 » HttpClient
  OperationImportInvokeTestITCase.edmEnabledFunctionImports:127 » ODataClientError
  OperationImportInvokeTestITCase.jsonFunctionImports:121->functionImports:51 » ODataClientError
  OperationImportInvokeTestITCase.edmEnabledActionImports:230 » ODataClientError
  OperationImportInvokeTestITCase.jsonBossEmails:292->bossEmails:265 » ODataClientError
  PropertyTestITCase.enumFromJSON:67->_enum:53 » ODataClientError (404) Not Foun...
  PropertyTestITCase.geospatialFromFullJSON:100->geospatial:82 » ODataClientError
  PropertyTestITCase.createAndDelete:189 » ODataClientError (400) Bad Request [H...
  PropertyTestITCase.geospatialFromJSON:95->geospatial:82 » ODataClientError (40...
  PropertyTestITCase.complexFromXML:119->complex:110 » ODataClientError (404) No...
  PropertyTestITCase.enumFromXML:62->_enum:53 » ODataClientError (404) Not Found...
  PropertyTestITCase.complexFromJSON:124->complex:110 » ODataClientError (404) N...
  PropertyTestITCase.geospatialFromXML:90->geospatial:82 » ODataClientError (404...
  PropertyTestITCase.patchComplexPropertyAsJSON:173->updateComplexProperty:140 » ODataClientError
  PropertyTestITCase.enumFromFullJSON:72->_enum:53 » ODataClientError (404) Not ...
  PropertyTestITCase.complexFromFullJSON:129->complex:110 » ODataClientError (40...
  PropertyValueTestITCase.retrieveNullPropertyValueTest:136 » ODataClientError (...
  PropertyValueTestITCase.retrieveBooleanPropertyValueTest:56 » ODataClientError
  PropertyValueTestITCase.retrieveIntPropertyValueTest:47 » ODataClientError (40...
  PropertyValueTestITCase.retrieveDecimalPropertyValueTest:84 » ODataClientError
  PropertyValueTestITCase.retrieveDatePropertyValueTest:74 » ODataClientError (4...
  PropertyValueTestITCase.retrieveCollectionPropertyValueTest:124 » ODataClientError
  PropertyValueTestITCase.retrieveBinaryPropertyValueTest:94 » ODataClientError ...
  PropertyValueTestITCase.retrieveStringPropertyValueTest:65 » ODataClientError ...
  QueryOptionsTestITCase.filterOrderby:87 » ODataClientError (404) Not Found [HT...
  QueryOptionsTestITCase.expandWithFilter:69 » ODataClientError (404) Not Found ...
  QueryOptionsTestITCase.format:130 » ODataClientError (404) Not Found [HTTP/1.0...
  QueryOptionsTestITCase.search:237 » ODataClientError (404) Not Found [HTTP/1.0...
  QueryOptionsTestITCase.select:210 » ODataClientError (404) Not Found [HTTP/1.0...
  QueryOptionsTestITCase.count:195 » ODataClientError (404) Not Found [HTTP/1.0 ...
  QueryOptionsTestITCase.issue253:224 » ODataClientError (404) Not Found [HTTP/1...
  QueryOptionsTestITCase.skiptoken:175 » ODataClientError (404) Not Found [HTTP/...
  ServiceDocumentTestITCase.retrieveServiceDocumentAsJSON:61->retrieveServiceDocument:38
» ODataClientError
  ServiceDocumentTestITCase.retrieveServiceDocumentAsXML:56->retrieveServiceDocument:38
» ODataClientError
  SingletonTestITCase.readWithAnnotationsFromAtom:92->readWithAnnotations:82 » ODataClientError
  SingletonTestITCase.readWithAnnotationsFromJSON:97->readWithAnnotations:82 » ODataClientError
  SingletonTestITCase.readfromJSONFull:71->read:49 » ODataClientError (404) Not ...
  SingletonTestITCase.atomUpdate:126->update:116 » ODataClientError (400) Bad Re...
  SingletonTestITCase.jsonUpdate:131->update:116 » ODataClientError (400) Bad Re...
  SingletonTestITCase.readFromAtom:61->read:49 » ODataClientError (404) Not Foun...
  SingletonTestITCase.readFromJSON:66->read:49 » ODataClientError (404) Not Foun...
  SingletonTestITCase.readWithAnnotationsFromJSONFull:102->readWithAnnotations:82 » ODataClientError

Tests run: 426, Failures: 17, Errors: 393, Skipped: 5

[INFO] ------------------------------------------------------------------------
[INFO] Reactor Summary:
[INFO] 
[INFO] Olingo-OData ...................................... SUCCESS [8.440s]
[INFO] odata-lib ......................................... SUCCESS [1.822s]
[INFO] odata-commons-api ................................. SUCCESS [7.843s]
[INFO] odata-commons-core ................................ SUCCESS [9.429s]
[INFO] odata-client-api .................................. SUCCESS [4.529s]
[INFO] odata-client-core ................................. SUCCESS [11.375s]
[INFO] odata-server-api .................................. SUCCESS [4.960s]
[INFO] odata-server-core ................................. SUCCESS [16.381s]
[INFO] odata-server-tecsvc ............................... SUCCESS [8.206s]
[INFO] odata-server-test ................................. SUCCESS [10.193s]
[INFO] odata-ext ......................................... SUCCESS [1.553s]
[INFO] odata-client-proxy ................................ SUCCESS [6.093s]
[INFO] pojogen-maven-plugin .............................. SUCCESS [32.299s]
[INFO] odata-client-android .............................. SUCCESS [6.686s]
[INFO] odata-fit ......................................... FAILURE [20.002s]
[INFO] odata-dist ........................................ SKIPPED
[INFO] Olingo-OData-Client-for-Android ................... SKIPPED
[INFO] Olingo-OData-Client-for-Java ...................... SKIPPED
[INFO] Olingo-OData-Server-for-Java ...................... SKIPPED
[INFO] Olingo-OData-JavaDoc .............................. SKIPPED
[INFO] odata-samples ..................................... SKIPPED
[INFO] odata-server-sample ............................... SKIPPED
[INFO] ------------------------------------------------------------------------
[INFO] BUILD FAILURE
[INFO] ------------------------------------------------------------------------
[INFO] Total time: 2:30.530s
[INFO] Finished at: Mon Feb 23 13:30:11 UTC 2015
[INFO] Final Memory: 55M/440M
[INFO] ------------------------------------------------------------------------
[ERROR] Failed to execute goal org.apache.maven.plugins:maven-surefire-plugin:2.17:test (default-test)
on project odata-fit: There are test failures.
[ERROR] 
[ERROR] Please refer to <https://builds.apache.org/job/olingo-odata4/ws/fit/target/surefire-reports>
for the individual test results.
[ERROR] -> [Help 1]
[ERROR] 
[ERROR] To see the full stack trace of the errors, re-run Maven with the -e switch.
[ERROR] Re-run Maven using the -X switch to enable full debug logging.
[ERROR] 
[ERROR] For more information about the errors and possible solutions, please read the following
articles:
[ERROR] [Help 1] http://cwiki.apache.org/confluence/display/MAVEN/MojoFailureException
[ERROR] 
[ERROR] After correcting the problems, you can resume the build with the command
[ERROR]   mvn <goals> -rf :odata-fit
Build step 'Invoke top-level Maven targets' marked build as failure

Mime
View raw message