olingo-commits mailing list archives

Site index · List index
Message view « Date » · « Thread »
Top « Date » · « Thread »
From Apache Jenkins Server <jenk...@builds.apache.org>
Subject Build failed in Jenkins: olingo-odata2-quality #301
Date Tue, 05 Aug 2014 03:35:46 GMT
See <https://builds.apache.org/job/olingo-odata2-quality/301/changes>

Changes:

[chandan.v.a] [OLINGO-376] Fetch 0 records when $top is 0.

------------------------------------------
[...truncated 524 lines...]
Tests run: 4, Failures: 0, Errors: 0, Skipped: 0, Time elapsed: 0.064 sec
Running org.apache.olingo.odata2.core.ep.producer.XmlPropertyProducerTest
Tests run: 12, Failures: 0, Errors: 0, Skipped: 0, Time elapsed: 0.162 sec
Running org.apache.olingo.odata2.core.ep.producer.AtomFeedProducerTest
Tests run: 20, Failures: 0, Errors: 0, Skipped: 0, Time elapsed: 0.503 sec
Running org.apache.olingo.odata2.core.ep.producer.XmlErrorProducerTest
Tests run: 24, Failures: 0, Errors: 0, Skipped: 0, Time elapsed: 0.488 sec
Running org.apache.olingo.odata2.core.ep.producer.XmlLinksEntityProducerTest
Tests run: 4, Failures: 0, Errors: 0, Skipped: 0, Time elapsed: 0.049 sec
Running org.apache.olingo.odata2.core.ep.producer.ExpandSelectProducerWithBuilderTest
Tests run: 12, Failures: 0, Errors: 0, Skipped: 0, Time elapsed: 0.187 sec
Running org.apache.olingo.odata2.core.ep.producer.JsonFunctionImportTest
Tests run: 5, Failures: 0, Errors: 0, Skipped: 0, Time elapsed: 0.039 sec
Running org.apache.olingo.odata2.core.ep.producer.JsonErrorProducerTest
Tests run: 3, Failures: 0, Errors: 0, Skipped: 0, Time elapsed: 0.001 sec
Running org.apache.olingo.odata2.core.ep.producer.XmlMetadataProducerTest
Tests run: 16, Failures: 0, Errors: 0, Skipped: 0, Time elapsed: 0.059 sec
Running org.apache.olingo.odata2.core.ep.producer.JsonFeedWithDeltaLinkProducerTest
Tests run: 4, Failures: 0, Errors: 0, Skipped: 0, Time elapsed: 0.143 sec
Running org.apache.olingo.odata2.core.ep.producer.XmlFunctionImportTest
Tests run: 10, Failures: 0, Errors: 0, Skipped: 0, Time elapsed: 0.121 sec
Running org.apache.olingo.odata2.core.ep.producer.ServiceDocumentProducerTest
Tests run: 2, Failures: 0, Errors: 0, Skipped: 0, Time elapsed: 0.007 sec
Running org.apache.olingo.odata2.core.ep.producer.JsonFeedEntityProducerTest
Tests run: 4, Failures: 0, Errors: 0, Skipped: 0, Time elapsed: 0.032 sec
Running org.apache.olingo.odata2.core.ep.producer.AtomServiceDocumentProducerTest
Tests run: 10, Failures: 0, Errors: 0, Skipped: 0, Time elapsed: 0.068 sec
Running org.apache.olingo.odata2.core.ep.producer.AtomEntryProducerTest
Tests run: 84, Failures: 0, Errors: 0, Skipped: 0, Time elapsed: 1.637 sec
Running org.apache.olingo.odata2.core.ep.producer.JsonLinksEntityProducerTest
Tests run: 4, Failures: 0, Errors: 0, Skipped: 0, Time elapsed: 0.042 sec
Running org.apache.olingo.odata2.core.ep.producer.JsonEntryEntityProducerTest
Tests run: 26, Failures: 0, Errors: 0, Skipped: 0, Time elapsed: 0.276 sec
Running org.apache.olingo.odata2.core.ep.producer.JsonPropertyProducerTest
Tests run: 10, Failures: 0, Errors: 0, Skipped: 0, Time elapsed: 0.163 sec
Running org.apache.olingo.odata2.core.ep.producer.JsonLinkEntityProducerTest
Tests run: 2, Failures: 0, Errors: 0, Skipped: 0, Time elapsed: 0.03 sec
Running org.apache.olingo.odata2.core.ep.ProducerConsumerIntegrationTest
Tests run: 1, Failures: 0, Errors: 0, Skipped: 0, Time elapsed: 0.02 sec
Running org.apache.olingo.odata2.core.ep.BasicProviderTest
Tests run: 20, Failures: 0, Errors: 0, Skipped: 0, Time elapsed: 0.549 sec
Running org.apache.olingo.odata2.core.ep.PerformanceTest
Tests run: 8, Failures: 0, Errors: 0, Skipped: 0, Time elapsed: 0.81 sec
Running org.apache.olingo.odata2.core.ep.ODataEntityProviderPropertiesTest
Tests run: 3, Failures: 0, Errors: 0, Skipped: 0, Time elapsed: 0 sec
Running org.apache.olingo.odata2.core.ODataRequestHandlerValidationTest
Tests run: 16, Failures: 0, Errors: 0, Skipped: 0, Time elapsed: 1.068 sec
Running org.apache.olingo.odata2.core.PathSegmentTest
Tests run: 3, Failures: 0, Errors: 0, Skipped: 0, Time elapsed: 0 sec
Running org.apache.olingo.odata2.core.ODataContextImplTest
Tests run: 3, Failures: 0, Errors: 0, Skipped: 0, Time elapsed: 0 sec
Running org.apache.olingo.odata2.core.ContentNegotiatorTest
Tests run: 21, Failures: 0, Errors: 0, Skipped: 0, Time elapsed: 0.006 sec
Running org.apache.olingo.odata2.core.uri.ExpandSelectTreeCreatorImplTest
Tests run: 27, Failures: 0, Errors: 0, Skipped: 0, Time elapsed: 0.038 sec
Running org.apache.olingo.odata2.core.uri.UriParserFacadeTest
Tests run: 1, Failures: 0, Errors: 0, Skipped: 0, Time elapsed: 0.006 sec
Running org.apache.olingo.odata2.core.uri.expression.TestTokenizer
Tests run: 7, Failures: 0, Errors: 0, Skipped: 0, Time elapsed: 0.005 sec
Running org.apache.olingo.odata2.core.uri.expression.TestParser
Tests run: 21, Failures: 0, Errors: 0, Skipped: 0, Time elapsed: 0.031 sec
Running org.apache.olingo.odata2.core.uri.expression.FilterToJsonTest
Tests run: 7, Failures: 0, Errors: 0, Skipped: 0, Time elapsed: 0.004 sec
Running org.apache.olingo.odata2.core.uri.expression.TestAbapCompatibility
Tests run: 5, Failures: 0, Errors: 0, Skipped: 0, Time elapsed: 0.026 sec
Running org.apache.olingo.odata2.core.uri.expression.TestSpec
Tests run: 3, Failures: 0, Errors: 0, Skipped: 0, Time elapsed: 0.014 sec
Running org.apache.olingo.odata2.core.uri.expression.TestExceptionTexts
Tests run: 5, Failures: 0, Errors: 0, Skipped: 0, Time elapsed: 0.004 sec
Running org.apache.olingo.odata2.core.uri.expression.TestParserExceptions
Tests run: 8, Failures: 0, Errors: 0, Skipped: 0, Time elapsed: 0.011 sec
Running org.apache.olingo.odata2.core.uri.ExpandSelectTreeNodeBuilderTest
Tests run: 18, Failures: 0, Errors: 0, Skipped: 0, Time elapsed: 0.183 sec
Running org.apache.olingo.odata2.core.uri.UriParserTest
Tests run: 68, Failures: 0, Errors: 0, Skipped: 0, Time elapsed: 1.468 sec
Running org.apache.olingo.odata2.core.uri.UriInfoTest
Tests run: 4, Failures: 0, Errors: 0, Skipped: 0, Time elapsed: 0.002 sec
Running org.apache.olingo.odata2.core.uri.QueryOptionsEnumTest
Tests run: 22, Failures: 0, Errors: 0, Skipped: 0, Time elapsed: 0.005 sec
Running org.apache.olingo.odata2.core.batch.BatchResponseTest
Tests run: 3, Failures: 0, Errors: 0, Skipped: 0, Time elapsed: 0.015 sec
Running org.apache.olingo.odata2.core.batch.BatchResponseParserTest
Tests run: 14, Failures: 0, Errors: 1, Skipped: 0, Time elapsed: 0.022 sec <<< FAILURE!
testBatchResponse(org.apache.olingo.odata2.core.batch.BatchResponseParserTest)  Time elapsed:
0.007 sec  <<< ERROR!
org.apache.olingo.odata2.api.batch.BatchException: Missing close delimiter at line '1'.
	at org.apache.olingo.odata2.core.batch.BatchResponseParser.parseBatchResponse(BatchResponseParser.java:102)
	at org.apache.olingo.odata2.core.batch.BatchResponseParser.parse(BatchResponseParser.java:77)
	at org.apache.olingo.odata2.core.batch.BatchResponseParserTest.testBatchResponse(BatchResponseParserTest.java:77)
	at sun.reflect.NativeMethodAccessorImpl.invoke0(Native Method)
	at sun.reflect.NativeMethodAccessorImpl.invoke(NativeMethodAccessorImpl.java:39)
	at sun.reflect.DelegatingMethodAccessorImpl.invoke(DelegatingMethodAccessorImpl.java:25)
	at java.lang.reflect.Method.invoke(Method.java:597)
	at org.junit.runners.model.FrameworkMethod$1.runReflectiveCall(FrameworkMethod.java:45)
	at org.junit.internal.runners.model.ReflectiveCallable.run(ReflectiveCallable.java:15)
	at org.junit.runners.model.FrameworkMethod.invokeExplosively(FrameworkMethod.java:42)
	at org.junit.internal.runners.statements.InvokeMethod.evaluate(InvokeMethod.java:20)
	at org.junit.runners.ParentRunner.runLeaf(ParentRunner.java:263)
	at org.junit.runners.BlockJUnit4ClassRunner.runChild(BlockJUnit4ClassRunner.java:68)
	at org.junit.runners.BlockJUnit4ClassRunner.runChild(BlockJUnit4ClassRunner.java:47)
	at org.junit.runners.ParentRunner$3.run(ParentRunner.java:231)
	at org.junit.runners.ParentRunner$1.schedule(ParentRunner.java:60)
	at org.junit.runners.ParentRunner.runChildren(ParentRunner.java:229)
	at org.junit.runners.ParentRunner.access$000(ParentRunner.java:50)
	at org.junit.runners.ParentRunner$2.evaluate(ParentRunner.java:222)
	at org.junit.runners.ParentRunner.run(ParentRunner.java:300)
	at org.apache.maven.surefire.junit4.JUnit4Provider.execute(JUnit4Provider.java:252)
	at org.apache.maven.surefire.junit4.JUnit4Provider.executeTestSet(JUnit4Provider.java:141)
	at org.apache.maven.surefire.junit4.JUnit4Provider.invoke(JUnit4Provider.java:112)
	at sun.reflect.NativeMethodAccessorImpl.invoke0(Native Method)
	at sun.reflect.NativeMethodAccessorImpl.invoke(NativeMethodAccessorImpl.java:39)
	at sun.reflect.DelegatingMethodAccessorImpl.invoke(DelegatingMethodAccessorImpl.java:25)
	at java.lang.reflect.Method.invoke(Method.java:597)
	at org.apache.maven.surefire.util.ReflectionUtils.invokeMethodWithArray(ReflectionUtils.java:189)
	at org.apache.maven.surefire.booter.ProviderFactory$ProviderProxy.invoke(ProviderFactory.java:165)
	at org.apache.maven.surefire.booter.ProviderFactory.invokeProvider(ProviderFactory.java:85)
	at org.apache.maven.surefire.booter.ForkedBooter.runSuitesInProcess(ForkedBooter.java:115)
	at org.apache.maven.surefire.booter.ForkedBooter.main(ForkedBooter.java:75)

Running org.apache.olingo.odata2.core.batch.AcceptParserTest
Tests run: 15, Failures: 0, Errors: 0, Skipped: 0, Time elapsed: 0.011 sec
Running org.apache.olingo.odata2.core.batch.BatchRequestTest
Tests run: 7, Failures: 0, Errors: 0, Skipped: 0, Time elapsed: 0.022 sec
Running org.apache.olingo.odata2.core.batch.BatchRequestParserTest
Tests run: 28, Failures: 0, Errors: 0, Skipped: 1, Time elapsed: 0.038 sec
Running org.apache.olingo.odata2.core.batch.BatchResponseWriterTest
Tests run: 4, Failures: 0, Errors: 0, Skipped: 0, Time elapsed: 0.001 sec
Running org.apache.olingo.odata2.core.batch.BatchRequestWriterTest
Tests run: 7, Failures: 0, Errors: 0, Skipped: 0, Time elapsed: 0.003 sec
Running org.apache.olingo.odata2.core.processor.ODataSingleProcessorServiceTest
Tests run: 14, Failures: 0, Errors: 0, Skipped: 0, Time elapsed: 0.018 sec
Running org.apache.olingo.odata2.core.ODataRequestTest
Tests run: 1, Failures: 0, Errors: 0, Skipped: 0, Time elapsed: 0 sec
Running org.apache.olingo.odata2.core.ODataResponseTest
Tests run: 7, Failures: 0, Errors: 0, Skipped: 0, Time elapsed: 0.002 sec
Running org.apache.olingo.odata2.core.edm.EdmSimpleTypeTest
Tests run: 67, Failures: 0, Errors: 0, Skipped: 0, Time elapsed: 0.053 sec
Running org.apache.olingo.odata2.core.edm.EdmImplTest
Tests run: 6, Failures: 0, Errors: 0, Skipped: 0, Time elapsed: 0.004 sec
Running org.apache.olingo.odata2.core.edm.EdmSimpleTypeFacadeTest
Tests run: 36, Failures: 0, Errors: 0, Skipped: 0, Time elapsed: 0.012 sec
Running org.apache.olingo.odata2.core.edm.provider.EdmAssociationSetEndImplProvTest
Tests run: 2, Failures: 0, Errors: 0, Skipped: 0, Time elapsed: 0 sec
Running org.apache.olingo.odata2.core.edm.provider.EdmFunctionImportImplProvTest
Tests run: 9, Failures: 0, Errors: 0, Skipped: 0, Time elapsed: 0.003 sec
Running org.apache.olingo.odata2.core.edm.provider.EdmReferentialConstraintRoleImplProvTest
Tests run: 1, Failures: 0, Errors: 0, Skipped: 0, Time elapsed: 0 sec
Running org.apache.olingo.odata2.core.edm.provider.EdmEntityTypeImplProvTest
Tests run: 9, Failures: 0, Errors: 0, Skipped: 0, Time elapsed: 0.002 sec
Running org.apache.olingo.odata2.core.edm.provider.EdmMappingTest
Tests run: 2, Failures: 0, Errors: 0, Skipped: 0, Time elapsed: 0 sec
Running org.apache.olingo.odata2.core.edm.provider.EdmPropertyImplProvTest
Tests run: 4, Failures: 0, Errors: 0, Skipped: 0, Time elapsed: 0 sec
Running org.apache.olingo.odata2.core.edm.provider.EdmImplProvTest
Tests run: 5, Failures: 0, Errors: 0, Skipped: 0, Time elapsed: 0.002 sec
Running org.apache.olingo.odata2.core.edm.provider.EdmComplexTypeImplProvTest
Tests run: 5, Failures: 0, Errors: 0, Skipped: 0, Time elapsed: 0.001 sec
Running org.apache.olingo.odata2.core.edm.provider.EdmAssociationImplProvTest
Tests run: 5, Failures: 0, Errors: 0, Skipped: 0, Time elapsed: 0.001 sec
Running org.apache.olingo.odata2.core.edm.provider.EdmEntityContainerImplProvTest
Tests run: 8, Failures: 0, Errors: 0, Skipped: 0, Time elapsed: 0.02 sec
Running org.apache.olingo.odata2.core.edm.provider.EdmReferentialConstraintImplProvTest
Tests run: 1, Failures: 0, Errors: 0, Skipped: 0, Time elapsed: 0 sec
Running org.apache.olingo.odata2.core.edm.provider.EdmEntitySetInfoImplProvTest
Tests run: 2, Failures: 0, Errors: 0, Skipped: 0, Time elapsed: 0.001 sec
Running org.apache.olingo.odata2.core.edm.provider.EdmNamedImplProvTest
Tests run: 1, Failures: 0, Errors: 0, Skipped: 0, Time elapsed: 0.001 sec
Running org.apache.olingo.odata2.core.edm.provider.EdmServiceMetadataImplProvTest
Tests run: 14, Failures: 0, Errors: 0, Skipped: 0, Time elapsed: 0.075 sec
Running org.apache.olingo.odata2.core.edm.provider.EdmAssociationSetImplProvTest
Tests run: 5, Failures: 0, Errors: 0, Skipped: 0, Time elapsed: 0.001 sec
Running org.apache.olingo.odata2.core.edm.provider.EdmAnnotationsImplProvTest
Tests run: 7, Failures: 0, Errors: 0, Skipped: 0, Time elapsed: 0.002 sec
Running org.apache.olingo.odata2.core.edm.provider.EdmxProviderTest
Tests run: 19, Failures: 0, Errors: 0, Skipped: 0, Time elapsed: 0.074 sec
Running org.apache.olingo.odata2.core.edm.provider.EdmAssociationEndImplProvTest
Tests run: 3, Failures: 0, Errors: 0, Skipped: 0, Time elapsed: 0.001 sec
Running org.apache.olingo.odata2.core.edm.provider.EdmNavigationPropertyImplProvTest
Tests run: 2, Failures: 0, Errors: 0, Skipped: 0, Time elapsed: 0 sec
Running org.apache.olingo.odata2.core.edm.provider.EdmEntitySetProvTest
Tests run: 5, Failures: 0, Errors: 0, Skipped: 0, Time elapsed: 0 sec
Running org.apache.olingo.odata2.core.commons.ContentTypeTest
Tests run: 89, Failures: 0, Errors: 0, Skipped: 1, Time elapsed: 0.016 sec
Running org.apache.olingo.odata2.core.commons.DecoderTest
Tests run: 10, Failures: 0, Errors: 0, Skipped: 0, Time elapsed: 0 sec
Running org.apache.olingo.odata2.core.commons.XmlHelperTest
Tests run: 8, Failures: 0, Errors: 0, Skipped: 1, Time elapsed: 0.06 sec
Running org.apache.olingo.odata2.core.commons.EncoderTest
Tests run: 10, Failures: 0, Errors: 0, Skipped: 0, Time elapsed: 0.001 sec

Results :

Tests in error: 
  testBatchResponse(org.apache.olingo.odata2.core.batch.BatchResponseParserTest): Missing
close delimiter at line '1'.

Tests run: 1595, Failures: 0, Errors: 1, Skipped: 5

[INFO] ------------------------------------------------------------------------
[INFO] Reactor Summary:
[INFO] 
[INFO] olingo-odata2-parent .............................. SUCCESS [6.525s]
[INFO] olingo-odata2-lib ................................. SUCCESS [0.604s]
[INFO] olingo-odata2-api ................................. SUCCESS [7.380s]
[INFO] olingo-odata2-api-annotation ...................... SUCCESS [1.272s]
[INFO] olingo-odata2-testutil ............................ SUCCESS [3.946s]
[INFO] olingo-odata2-core ................................ FAILURE [30.498s]
[INFO] olingo-odata2-ref ................................. SKIPPED
[INFO] olingo-odata2-fit ................................. SKIPPED
[INFO] olingo-odata2-ref-web ............................. SKIPPED
[INFO] olingo-odata2-jpa-processor ....................... SKIPPED
[INFO] olingo-odata2-jpa-processor-api ................... SKIPPED
[INFO] olingo-odata2-jpa-processor-core .................. SKIPPED
[INFO] olingo-odata2-jpa-processor-ref ................... SKIPPED
[INFO] olingo-odata2-jpa-processor-ref-web ............... SKIPPED
[INFO] olingo-odata2-annotation-processor ................ SKIPPED
[INFO] olingo-odata2-annotation-processor-api ............ SKIPPED
[INFO] olingo-odata2-annotation-processor-core ........... SKIPPED
[INFO] olingo-odata2-annotation-processor-ref ............ SKIPPED
[INFO] olingo-odata2-annotation-processor-ref-web ........ SKIPPED
[INFO] olingo-odata2-dist ................................ SKIPPED
[INFO] olingo-odata2-dist-lib ............................ SKIPPED
[INFO] olingo-odata2-dist-jpa ............................ SKIPPED
[INFO] olingo-odata2-dist-janos .......................... SKIPPED
[INFO] olingo-odata2-dist-ref ............................ SKIPPED
[INFO] olingo-odata2-dist-javadoc ........................ SKIPPED
[INFO] olingo-odata2-sample .............................. SKIPPED
[INFO] olingo-odata2-sample-cars-service-archetype ....... SKIPPED
[INFO] olingo-odata2-sample-cars-annotation-archetype .... SKIPPED
[INFO] olingo-odata2-sample-cars-jpa-archetype ........... SKIPPED
[INFO] ------------------------------------------------------------------------
[INFO] BUILD FAILURE
[INFO] ------------------------------------------------------------------------
[INFO] Total time: 51.701s
[INFO] Finished at: Tue Aug 05 03:33:19 UTC 2014
[INFO] Final Memory: 52M/390M
[INFO] ------------------------------------------------------------------------
[ERROR] Failed to execute goal org.apache.maven.plugins:maven-surefire-plugin:2.12.4:test
(default-test) on project olingo-odata2-core: There are test failures.
[ERROR] 
[ERROR] Please refer to <https://builds.apache.org/job/olingo-odata2-quality/ws/odata2-lib/odata-core/target/surefire-reports>
for the individual test results.
[ERROR] -> [Help 1]
[ERROR] 
[ERROR] To see the full stack trace of the errors, re-run Maven with the -e switch.
[ERROR] Re-run Maven using the -X switch to enable full debug logging.
[ERROR] 
[ERROR] For more information about the errors and possible solutions, please read the following
articles:
[ERROR] [Help 1] http://cwiki.apache.org/confluence/display/MAVEN/MojoFailureException
[ERROR] 
[ERROR] After correcting the problems, you can resume the build with the command
[ERROR]   mvn <goals> -rf :olingo-odata2-core
Build step 'Invoke top-level Maven targets' marked build as failure

Mime
View raw message