olingo-commits mailing list archives

Site index · List index
Message view « Date » · « Thread »
Top « Date » · « Thread »
From Apache Jenkins Server <jenk...@builds.apache.org>
Subject Build failed in Jenkins: olingo-odata2 #718
Date Tue, 29 Jul 2014 16:04:13 GMT
See <https://builds.apache.org/job/olingo-odata2/718/>

------------------------------------------
[...truncated 750 lines...]
Running org.apache.olingo.odata2.core.batch.AcceptParserTest
Tests run: 15, Failures: 0, Errors: 0, Skipped: 0, Time elapsed: 0.006 sec
Running org.apache.olingo.odata2.core.batch.BatchRequestTest
Tests run: 7, Failures: 0, Errors: 0, Skipped: 0, Time elapsed: 0.019 sec
Running org.apache.olingo.odata2.core.batch.BatchRequestWriterTest
Tests run: 7, Failures: 0, Errors: 0, Skipped: 0, Time elapsed: 0.004 sec
Running org.apache.olingo.odata2.core.ep.PerformanceTest
Tests run: 8, Failures: 0, Errors: 0, Skipped: 0, Time elapsed: 1.601 sec
Running org.apache.olingo.odata2.core.ep.ODataEntityProviderPropertiesTest
Tests run: 3, Failures: 0, Errors: 0, Skipped: 0, Time elapsed: 0.002 sec
Running org.apache.olingo.odata2.core.ep.ProducerConsumerIntegrationTest
Tests run: 1, Failures: 0, Errors: 0, Skipped: 0, Time elapsed: 0.038 sec
Running org.apache.olingo.odata2.core.ep.LoadXMLFactoryTest
Tests run: 2, Failures: 0, Errors: 0, Skipped: 0, Time elapsed: 0 sec
Running org.apache.olingo.odata2.core.ep.producer.AtomFeedProducerTest
Tests run: 20, Failures: 0, Errors: 0, Skipped: 0, Time elapsed: 1.028 sec
Running org.apache.olingo.odata2.core.ep.producer.TombstoneProducerTest
Tests run: 16, Failures: 0, Errors: 0, Skipped: 0, Time elapsed: 0.271 sec
Running org.apache.olingo.odata2.core.ep.producer.XmlLinksEntityProducerTest
Tests run: 4, Failures: 0, Errors: 0, Skipped: 0, Time elapsed: 0.057 sec
Running org.apache.olingo.odata2.core.ep.producer.XmlExpandProducerTest
Tests run: 28, Failures: 0, Errors: 0, Skipped: 0, Time elapsed: 1.281 sec
Running org.apache.olingo.odata2.core.ep.producer.XmlErrorProducerTest
Tests run: 24, Failures: 0, Errors: 0, Skipped: 0, Time elapsed: 0.298 sec
Running org.apache.olingo.odata2.core.ep.producer.JsonEntryEntityProducerTest
Tests run: 26, Failures: 0, Errors: 0, Skipped: 0, Time elapsed: 0.354 sec
Running org.apache.olingo.odata2.core.ep.producer.ExpandSelectProducerWithBuilderTest
Tests run: 12, Failures: 0, Errors: 0, Skipped: 0, Time elapsed: 0.151 sec
Running org.apache.olingo.odata2.core.ep.producer.JsonErrorProducerTest
Tests run: 3, Failures: 0, Errors: 0, Skipped: 0, Time elapsed: 0.001 sec
Running org.apache.olingo.odata2.core.ep.producer.JsonFunctionImportTest
Tests run: 5, Failures: 0, Errors: 0, Skipped: 0, Time elapsed: 0.036 sec
Running org.apache.olingo.odata2.core.ep.producer.AtomEntryProducerTest
Tests run: 84, Failures: 0, Errors: 0, Skipped: 0, Time elapsed: 1.39 sec
Running org.apache.olingo.odata2.core.ep.producer.XmlLinkEntityProducerTest
Tests run: 4, Failures: 0, Errors: 0, Skipped: 0, Time elapsed: 0.07 sec
Running org.apache.olingo.odata2.core.ep.producer.ServiceDocumentProducerTest
Tests run: 2, Failures: 0, Errors: 0, Skipped: 0, Time elapsed: 0.012 sec
Running org.apache.olingo.odata2.core.ep.producer.XmlPropertyProducerTest
Tests run: 12, Failures: 0, Errors: 0, Skipped: 0, Time elapsed: 0.147 sec
Running org.apache.olingo.odata2.core.ep.producer.XmlFeedWithTombstonesProducerTest
Tests run: 12, Failures: 0, Errors: 0, Skipped: 0, Time elapsed: 0.139 sec
Running org.apache.olingo.odata2.core.ep.producer.JsonFeedEntityProducerTest
Tests run: 4, Failures: 0, Errors: 0, Skipped: 0, Time elapsed: 0.031 sec
Running org.apache.olingo.odata2.core.ep.producer.JsonLinksEntityProducerTest
Tests run: 4, Failures: 0, Errors: 0, Skipped: 0, Time elapsed: 0.037 sec
Running org.apache.olingo.odata2.core.ep.producer.AtomServiceDocumentProducerTest
Tests run: 10, Failures: 0, Errors: 0, Skipped: 0, Time elapsed: 0.078 sec
Running org.apache.olingo.odata2.core.ep.producer.XmlFunctionImportTest
Tests run: 10, Failures: 0, Errors: 0, Skipped: 0, Time elapsed: 0.299 sec
Running org.apache.olingo.odata2.core.ep.producer.JsonPropertyProducerTest
Tests run: 10, Failures: 0, Errors: 0, Skipped: 0, Time elapsed: 0.094 sec
Running org.apache.olingo.odata2.core.ep.producer.XmlSelectProducerTest
Tests run: 18, Failures: 0, Errors: 0, Skipped: 0, Time elapsed: 0.43 sec
Running org.apache.olingo.odata2.core.ep.producer.JsonLinkEntityProducerTest
Tests run: 2, Failures: 0, Errors: 0, Skipped: 0, Time elapsed: 0.016 sec
Running org.apache.olingo.odata2.core.ep.producer.XmlMetadataProducerTest
Tests run: 16, Failures: 0, Errors: 0, Skipped: 0, Time elapsed: 0.106 sec
Running org.apache.olingo.odata2.core.ep.producer.JsonServiceDocumentProducerTest
Tests run: 2, Failures: 0, Errors: 0, Skipped: 0, Time elapsed: 0.004 sec
Running org.apache.olingo.odata2.core.ep.producer.JsonFeedWithDeltaLinkProducerTest
Tests run: 4, Failures: 0, Errors: 0, Skipped: 0, Time elapsed: 0.036 sec
Running org.apache.olingo.odata2.core.ep.consumer.JsonLinkConsumerTest
Tests run: 19, Failures: 0, Errors: 0, Skipped: 0, Time elapsed: 0.009 sec
Running org.apache.olingo.odata2.core.ep.consumer.XmlPropertyConsumerTest
Tests run: 56, Failures: 0, Errors: 0, Skipped: 0, Time elapsed: 0.559 sec
Running org.apache.olingo.odata2.core.ep.consumer.XmlFeedConsumerTest
Tests run: 12, Failures: 0, Errors: 0, Skipped: 0, Time elapsed: 0.93 sec
Running org.apache.olingo.odata2.core.ep.consumer.JsonEntryDeepInsertFeedTest
Tests run: 7, Failures: 0, Errors: 0, Skipped: 0, Time elapsed: 0.065 sec
Running org.apache.olingo.odata2.core.ep.consumer.XmlEntityConsumerTest
Tests run: 142, Failures: 0, Errors: 0, Skipped: 2, Time elapsed: 1.367 sec
Running org.apache.olingo.odata2.core.ep.consumer.XmlMetadataConsumerTest
Tests run: 64, Failures: 0, Errors: 0, Skipped: 0, Time elapsed: 0.063 sec
Running org.apache.olingo.odata2.core.ep.consumer.XmlLinkConsumerTest
Tests run: 14, Failures: 0, Errors: 0, Skipped: 0, Time elapsed: 0.005 sec
Running org.apache.olingo.odata2.core.ep.consumer.JsonEntryDeepInsertEntryTest
Tests run: 7, Failures: 0, Errors: 0, Skipped: 0, Time elapsed: 0.074 sec
Running org.apache.olingo.odata2.core.ep.consumer.XmlErrorDocumentConsumerTest
Tests run: 14, Failures: 0, Errors: 0, Skipped: 0, Time elapsed: 0.009 sec
Running org.apache.olingo.odata2.core.ep.consumer.JsonErrorDocumentConsumerTest
Tests run: 14, Failures: 0, Errors: 0, Skipped: 0, Time elapsed: 0.004 sec
Running org.apache.olingo.odata2.core.ep.consumer.AtomServiceDocumentConsumerTest
Tests run: 16, Failures: 0, Errors: 0, Skipped: 0, Time elapsed: 0.024 sec
Running org.apache.olingo.odata2.core.ep.consumer.JsonEntryConsumerTest
Tests run: 17, Failures: 0, Errors: 0, Skipped: 0, Time elapsed: 0.125 sec
Running org.apache.olingo.odata2.core.ep.consumer.ServiceDocumentConsumerTest
Tests run: 6, Failures: 0, Errors: 0, Skipped: 0, Time elapsed: 0.005 sec
Running org.apache.olingo.odata2.core.ep.consumer.JsonServiceDocumentConsumerTest
Tests run: 3, Failures: 0, Errors: 0, Skipped: 0, Time elapsed: 0.001 sec
Running org.apache.olingo.odata2.core.ep.consumer.JsonPropertyConsumerTest
Tests run: 35, Failures: 0, Errors: 0, Skipped: 0, Time elapsed: 1.148 sec
Running org.apache.olingo.odata2.core.ep.consumer.JsonFeedConsumerTest
Tests run: 26, Failures: 0, Errors: 0, Skipped: 0, Time elapsed: 0.183 sec
Running org.apache.olingo.odata2.core.ep.BasicProviderTest
Tests run: 20, Failures: 0, Errors: 0, Skipped: 0, Time elapsed: 0.196 sec
Running org.apache.olingo.odata2.core.ep.aggregator.EntityInfoAggregatorTest
Tests run: 2, Failures: 0, Errors: 0, Skipped: 0, Time elapsed: 0.017 sec
Running org.apache.olingo.odata2.core.ep.ProviderFacadeImplTest
Tests run: 21, Failures: 0, Errors: 0, Skipped: 0, Time elapsed: 0.116 sec
Running org.apache.olingo.odata2.core.ep.util.CircleStreamBufferTest
Tests run: 9, Failures: 0, Errors: 0, Skipped: 0, Time elapsed: 0.012 sec
Running org.apache.olingo.odata2.core.ep.util.JsonStreamWriterTest
Tests run: 3, Failures: 0, Errors: 0, Skipped: 0, Time elapsed: 0 sec
Running org.apache.olingo.odata2.core.ODataExceptionWrapperTest
Tests run: 1, Failures: 0, Errors: 0, Skipped: 0, Time elapsed: 0.01 sec
Running org.apache.olingo.odata2.core.rt.RuntimeDelegateTest
Tests run: 1, Failures: 0, Errors: 0, Skipped: 0, Time elapsed: 0 sec
Running org.apache.olingo.odata2.core.exception.ODataExceptionTest
Tests run: 6, Failures: 0, Errors: 0, Skipped: 0, Time elapsed: 0.005 sec
Running org.apache.olingo.odata2.core.exception.MessageServiceTest
Tests run: 9, Failures: 0, Errors: 0, Skipped: 0, Time elapsed: 0.002 sec
Running org.apache.olingo.odata2.core.exception.ODataMessageTextVerifierTest
Tests run: 1, Failures: 0, Errors: 0, Skipped: 0, Time elapsed: 0 sec
Running org.apache.olingo.odata2.core.exception.MessageReferenceTest
Tests run: 3, Failures: 0, Errors: 0, Skipped: 0, Time elapsed: 0 sec
Running org.apache.olingo.odata2.core.processor.ODataSingleProcessorServiceTest
Tests run: 14, Failures: 0, Errors: 0, Skipped: 0, Time elapsed: 0.021 sec
Running org.apache.olingo.odata2.core.PathSegmentTest
Tests run: 3, Failures: 0, Errors: 0, Skipped: 0, Time elapsed: 0.001 sec
Running org.apache.olingo.odata2.core.rest.ODataExceptionMapperImplTest
Tests run: 24, Failures: 0, Errors: 0, Skipped: 0, Time elapsed: 0.2 sec
Running org.apache.olingo.odata2.core.ContentNegotiatorTest
Tests run: 21, Failures: 0, Errors: 0, Skipped: 0, Time elapsed: 0.024 sec
Running org.apache.olingo.odata2.core.edm.provider.EdmFunctionImportImplProvTest
Tests run: 9, Failures: 0, Errors: 0, Skipped: 0, Time elapsed: 0.003 sec
Running org.apache.olingo.odata2.core.edm.provider.EdmComplexTypeImplProvTest
Tests run: 5, Failures: 0, Errors: 0, Skipped: 0, Time elapsed: 0.001 sec
Running org.apache.olingo.odata2.core.edm.provider.EdmPropertyImplProvTest
Tests run: 4, Failures: 0, Errors: 0, Skipped: 0, Time elapsed: 0.001 sec
Running org.apache.olingo.odata2.core.edm.provider.EdmReferentialConstraintRoleImplProvTest
Tests run: 1, Failures: 0, Errors: 0, Skipped: 0, Time elapsed: 0.001 sec
Running org.apache.olingo.odata2.core.edm.provider.EdmAnnotationsImplProvTest
Tests run: 7, Failures: 0, Errors: 0, Skipped: 0, Time elapsed: 0.003 sec
Running org.apache.olingo.odata2.core.edm.provider.EdmAssociationSetEndImplProvTest
Tests run: 2, Failures: 0, Errors: 0, Skipped: 0, Time elapsed: 0 sec
Running org.apache.olingo.odata2.core.edm.provider.EdmNamedImplProvTest
Tests run: 1, Failures: 0, Errors: 0, Skipped: 0, Time elapsed: 0 sec
Running org.apache.olingo.odata2.core.edm.provider.EdmEntitySetProvTest
Tests run: 5, Failures: 0, Errors: 0, Skipped: 0, Time elapsed: 0.002 sec
Running org.apache.olingo.odata2.core.edm.provider.EdmEntitySetInfoImplProvTest
Tests run: 2, Failures: 0, Errors: 0, Skipped: 0, Time elapsed: 0 sec
Running org.apache.olingo.odata2.core.edm.provider.EdmMappingTest
Tests run: 2, Failures: 0, Errors: 0, Skipped: 0, Time elapsed: 0.001 sec
Running org.apache.olingo.odata2.core.edm.provider.EdmEntityContainerImplProvTest
Tests run: 8, Failures: 0, Errors: 0, Skipped: 0, Time elapsed: 0.022 sec
Running org.apache.olingo.odata2.core.edm.provider.EdmNavigationPropertyImplProvTest
Tests run: 2, Failures: 0, Errors: 0, Skipped: 0, Time elapsed: 0 sec
Running org.apache.olingo.odata2.core.edm.provider.EdmAssociationImplProvTest
Tests run: 5, Failures: 0, Errors: 0, Skipped: 0, Time elapsed: 0.001 sec
Running org.apache.olingo.odata2.core.edm.provider.EdmAssociationEndImplProvTest
Tests run: 3, Failures: 0, Errors: 0, Skipped: 0, Time elapsed: 0 sec
Running org.apache.olingo.odata2.core.edm.provider.EdmImplProvTest
Tests run: 5, Failures: 0, Errors: 0, Skipped: 0, Time elapsed: 0.001 sec
Running org.apache.olingo.odata2.core.edm.provider.EdmAssociationSetImplProvTest
Tests run: 5, Failures: 0, Errors: 0, Skipped: 0, Time elapsed: 0.001 sec
Running org.apache.olingo.odata2.core.edm.provider.EdmReferentialConstraintImplProvTest
Tests run: 1, Failures: 0, Errors: 0, Skipped: 0, Time elapsed: 0 sec
Running org.apache.olingo.odata2.core.edm.provider.EdmxProviderTest
Tests run: 19, Failures: 0, Errors: 0, Skipped: 0, Time elapsed: 0.078 sec
Running org.apache.olingo.odata2.core.edm.provider.EdmServiceMetadataImplProvTest
Tests run: 14, Failures: 0, Errors: 0, Skipped: 0, Time elapsed: 0.061 sec
Running org.apache.olingo.odata2.core.edm.provider.EdmEntityTypeImplProvTest
Tests run: 9, Failures: 0, Errors: 0, Skipped: 0, Time elapsed: 0.002 sec
Running org.apache.olingo.odata2.core.edm.EdmSimpleTypeFacadeTest
Tests run: 36, Failures: 0, Errors: 0, Skipped: 0, Time elapsed: 0.014 sec
Running org.apache.olingo.odata2.core.edm.EdmImplTest
Tests run: 6, Failures: 0, Errors: 0, Skipped: 0, Time elapsed: 0.001 sec
Running org.apache.olingo.odata2.core.edm.EdmSimpleTypeTest
Tests run: 67, Failures: 0, Errors: 0, Skipped: 0, Time elapsed: 0.051 sec
Running org.apache.olingo.odata2.core.ODataContextImplTest
Tests run: 3, Failures: 0, Errors: 0, Skipped: 0, Time elapsed: 0.003 sec
Running org.apache.olingo.odata2.core.DispatcherTest
Tests run: 8, Failures: 0, Errors: 0, Skipped: 0, Time elapsed: 0.334 sec
Running org.apache.olingo.odata2.core.ODataRequestTest
Tests run: 1, Failures: 0, Errors: 0, Skipped: 0, Time elapsed: 0 sec
Running org.apache.olingo.odata2.core.commons.DecoderTest
Tests run: 10, Failures: 0, Errors: 0, Skipped: 0, Time elapsed: 0.002 sec
Running org.apache.olingo.odata2.core.commons.XmlHelperTest
Tests run: 8, Failures: 0, Errors: 0, Skipped: 1, Time elapsed: 0.049 sec
Running org.apache.olingo.odata2.core.commons.ContentTypeTest
Tests run: 89, Failures: 0, Errors: 0, Skipped: 1, Time elapsed: 0.025 sec
Running org.apache.olingo.odata2.core.commons.EncoderTest
Tests run: 10, Failures: 0, Errors: 0, Skipped: 0, Time elapsed: 0.001 sec
Running org.apache.olingo.odata2.core.ODataRequestHandlerValidationTest
Tests run: 16, Failures: 0, Errors: 0, Skipped: 0, Time elapsed: 1.163 sec
Running org.apache.olingo.odata2.core.ODataResponseTest
Tests run: 7, Failures: 0, Errors: 0, Skipped: 0, Time elapsed: 0 sec

Results :

Tests in error: 
  testBatchResponse(org.apache.olingo.odata2.core.batch.BatchResponseParserTest): Missing
close delimiter at line '1'.

Tests run: 1595, Failures: 0, Errors: 1, Skipped: 5

[INFO] ------------------------------------------------------------------------
[INFO] Reactor Summary:
[INFO] 
[INFO] olingo-odata2-parent .............................. SUCCESS [8.640s]
[INFO] olingo-odata2-lib ................................. SUCCESS [3.387s]
[INFO] olingo-odata2-api ................................. SUCCESS [12.514s]
[INFO] olingo-odata2-api-annotation ...................... SUCCESS [25.883s]
[INFO] olingo-odata2-testutil ............................ SUCCESS [3.704s]
[INFO] olingo-odata2-core ................................ FAILURE [26.694s]
[INFO] olingo-odata2-ref ................................. SKIPPED
[INFO] olingo-odata2-fit ................................. SKIPPED
[INFO] olingo-odata2-ref-web ............................. SKIPPED
[INFO] olingo-odata2-jpa-processor ....................... SKIPPED
[INFO] olingo-odata2-jpa-processor-api ................... SKIPPED
[INFO] olingo-odata2-jpa-processor-core .................. SKIPPED
[INFO] olingo-odata2-jpa-processor-ref ................... SKIPPED
[INFO] olingo-odata2-jpa-processor-ref-web ............... SKIPPED
[INFO] olingo-odata2-annotation-processor ................ SKIPPED
[INFO] olingo-odata2-annotation-processor-api ............ SKIPPED
[INFO] olingo-odata2-annotation-processor-core ........... SKIPPED
[INFO] olingo-odata2-annotation-processor-ref ............ SKIPPED
[INFO] olingo-odata2-annotation-processor-ref-web ........ SKIPPED
[INFO] olingo-odata2-dist ................................ SKIPPED
[INFO] olingo-odata2-dist-lib ............................ SKIPPED
[INFO] olingo-odata2-dist-jpa ............................ SKIPPED
[INFO] olingo-odata2-dist-janos .......................... SKIPPED
[INFO] olingo-odata2-dist-ref ............................ SKIPPED
[INFO] olingo-odata2-dist-javadoc ........................ SKIPPED
[INFO] olingo-odata2-sample .............................. SKIPPED
[INFO] olingo-odata2-sample-cars-service-archetype ....... SKIPPED
[INFO] olingo-odata2-sample-cars-annotation-archetype .... SKIPPED
[INFO] olingo-odata2-sample-cars-jpa-archetype ........... SKIPPED
[INFO] ------------------------------------------------------------------------
[INFO] BUILD FAILURE
[INFO] ------------------------------------------------------------------------
[INFO] Total time: 1:22.333s
[INFO] Finished at: Tue Jul 29 16:05:06 UTC 2014
[INFO] Final Memory: 47M/382M
[INFO] ------------------------------------------------------------------------
[ERROR] Failed to execute goal org.apache.maven.plugins:maven-surefire-plugin:2.12.4:test
(default-test) on project olingo-odata2-core: There are test failures.
[ERROR] 
[ERROR] Please refer to <https://builds.apache.org/job/olingo-odata2/ws/odata2-lib/odata-core/target/surefire-reports>
for the individual test results.
[ERROR] -> [Help 1]
[ERROR] 
[ERROR] To see the full stack trace of the errors, re-run Maven with the -e switch.
[ERROR] Re-run Maven using the -X switch to enable full debug logging.
[ERROR] 
[ERROR] For more information about the errors and possible solutions, please read the following
articles:
[ERROR] [Help 1] http://cwiki.apache.org/confluence/display/MAVEN/MojoFailureException
[ERROR] 
[ERROR] After correcting the problems, you can resume the build with the command
[ERROR]   mvn <goals> -rf :olingo-odata2-core
Build step 'Invoke top-level Maven targets' marked build as failure

Mime
View raw message