olingo-commits mailing list archives

Site index · List index
Message view « Date » · « Thread »
Top « Date » · « Thread »
From Apache Jenkins Server <jenk...@builds.apache.org>
Subject Build failed in Jenkins: olingo-odata4 #437
Date Tue, 22 Jul 2014 14:15:34 GMT
See <https://builds.apache.org/job/olingo-odata4/437/changes>

Changes:

[michael.bolz] [OLINGO-356] Code clean up (warnings)

------------------------------------------
[...truncated 4535 lines...]
10/37 KB   
12/37 KB   
14/37 KB   
16/37 KB   
18/37 KB   
20/37 KB   
22/37 KB   
24/37 KB   
26/37 KB   
28/37 KB   
30/37 KB   
32/37 KB   
34/37 KB   
36/37 KB   
37/37 KB   
           
Uploaded: https://repository.apache.org/content/repositories/snapshots/org/apache/olingo/olingo-server-tecsvc/0.1.0-SNAPSHOT/olingo-server-tecsvc-0.1.0-20140722.141521-133-sources.jar
(37 KB at 308.3 KB/sec)
Uploading: https://repository.apache.org/content/repositories/snapshots/org/apache/olingo/olingo-server-tecsvc/0.1.0-SNAPSHOT/maven-metadata.xml
1009/1009 B   
              
Uploaded: https://repository.apache.org/content/repositories/snapshots/org/apache/olingo/olingo-server-tecsvc/0.1.0-SNAPSHOT/maven-metadata.xml
(1009 B at 11.5 KB/sec)
[INFO]                                                                         
[INFO] ------------------------------------------------------------------------
[INFO] Building olingo-server-test 0.1.0-SNAPSHOT
[INFO] ------------------------------------------------------------------------
[INFO] 
[INFO] --- maven-clean-plugin:2.5:clean (default-clean) @ olingo-server-test ---
[INFO] Deleting /x1/jenkins/jenkins-slave/workspace/olingo-odata4/lib/server-test/target
[INFO] 
[INFO] --- maven-remote-resources-plugin:1.5:process (default) @ olingo-server-test ---
[INFO] 
[INFO] --- maven-resources-plugin:2.6:resources (default-resources) @ olingo-server-test ---
[INFO] Using 'UTF-8' encoding to copy filtered resources.
[INFO] skip non existing resourceDirectory /x1/jenkins/jenkins-slave/workspace/olingo-odata4/lib/server-test/src/main/resources
[INFO] Copying 3 resources
[INFO] 
[INFO] --- maven-compiler-plugin:2.3.2:compile (default-compile) @ olingo-server-test ---
[INFO] No sources to compile
[INFO] 
[INFO] --- maven-resources-plugin:2.6:testResources (default-testResources) @ olingo-server-test
---
[INFO] Using 'UTF-8' encoding to copy filtered resources.
[INFO] Copying 1 resource
[INFO] Copying 3 resources
[INFO] 
[INFO] --- maven-compiler-plugin:2.3.2:testCompile (default-testCompile) @ olingo-server-test
---
[INFO] Compiling 26 source files to /x1/jenkins/jenkins-slave/workspace/olingo-odata4/lib/server-test/target/test-classes
[INFO] 
[INFO] --- maven-surefire-plugin:2.17:test (default-test) @ olingo-server-test ---
[INFO] Surefire report directory: /x1/jenkins/jenkins-slave/workspace/olingo-odata4/lib/server-test/target/surefire-reports

-------------------------------------------------------
 T E S T S
-------------------------------------------------------
Running org.apache.olingo.server.core.ODataHandlerTest
Tests run: 8, Failures: 0, Errors: 0, Skipped: 0, Time elapsed: 1.78 sec - in org.apache.olingo.server.core.ODataHandlerTest
Running org.apache.olingo.server.core.serializer.json.ODataJsonSerializerTest
Tests run: 13, Failures: 0, Errors: 0, Skipped: 0, Time elapsed: 0.103 sec - in org.apache.olingo.server.core.serializer.json.ODataJsonSerializerTest
Running org.apache.olingo.server.core.serializer.json.ServiceDocumentTest
Tests run: 1, Failures: 0, Errors: 0, Skipped: 0, Time elapsed: 0.118 sec - in org.apache.olingo.server.core.serializer.json.ServiceDocumentTest
Running org.apache.olingo.server.core.serializer.xml.MetadataDocumentTest
Tests run: 4, Failures: 0, Errors: 0, Skipped: 0, Time elapsed: 0.104 sec - in org.apache.olingo.server.core.serializer.xml.MetadataDocumentTest
Running org.apache.olingo.server.core.uri.RawUriTest
Tests run: 3, Failures: 0, Errors: 0, Skipped: 0, Time elapsed: 0.006 sec - in org.apache.olingo.server.core.uri.RawUriTest
Running org.apache.olingo.server.core.uri.UriInfoImplTest
Tests run: 7, Failures: 0, Errors: 0, Skipped: 0, Time elapsed: 0.007 sec - in org.apache.olingo.server.core.uri.UriInfoImplTest
Running org.apache.olingo.server.core.uri.UriResourceImplTest
Tests run: 19, Failures: 0, Errors: 0, Skipped: 0, Time elapsed: 0.035 sec - in org.apache.olingo.server.core.uri.UriResourceImplTest
Running org.apache.olingo.server.core.uri.antlr.TestFullResourcePath
Tests run: 80, Failures: 0, Errors: 0, Skipped: 1, Time elapsed: 1.097 sec - in org.apache.olingo.server.core.uri.antlr.TestFullResourcePath
Running org.apache.olingo.server.core.uri.antlr.TestLexer
Tests run: 6, Failures: 0, Errors: 0, Skipped: 0, Time elapsed: 0.05 sec - in org.apache.olingo.server.core.uri.antlr.TestLexer
Running org.apache.olingo.server.core.uri.antlr.TestUriParserImpl
Tests run: 31, Failures: 0, Errors: 0, Skipped: 0, Time elapsed: 0.231 sec - in org.apache.olingo.server.core.uri.antlr.TestUriParserImpl
Running org.apache.olingo.server.core.uri.queryoption.QueryOptionTest
Tests run: 18, Failures: 0, Errors: 0, Skipped: 0, Time elapsed: 0.01 sec - in org.apache.olingo.server.core.uri.queryoption.QueryOptionTest
Running org.apache.olingo.server.core.uri.queryoption.expression.ExpressionTest
Tests run: 10, Failures: 0, Errors: 0, Skipped: 0, Time elapsed: 0.034 sec - in org.apache.olingo.server.core.uri.queryoption.expression.ExpressionTest
Running org.apache.olingo.server.core.uri.validator.UriValidatorTest
Tests run: 12, Failures: 0, Errors: 0, Skipped: 0, Time elapsed: 0.187 sec - in org.apache.olingo.server.core.uri.validator.UriValidatorTest

Results :

Tests run: 212, Failures: 0, Errors: 0, Skipped: 1

[INFO] 
[INFO] --- apache-rat-plugin:0.10:check (rat-check) @ olingo-server-test ---
[INFO] 51 implicit excludes (use -debug for more details).
[INFO] Exclude: **/META-INF/**
[INFO] Exclude: **/*.txt
[INFO] Exclude: **/*.ini
[INFO] Exclude: **/*.bin
[INFO] Exclude: **/MANIFEST.MF
[INFO] Exclude: .gitignore
[INFO] Exclude: .git/**
[INFO] Exclude: bin/**
[INFO] Exclude: **/*.local
[INFO] Exclude: **/*.project
[INFO] Exclude: **/*.classpath
[INFO] Exclude: **/*.json
[INFO] Exclude: **/*.batch
[INFO] Exclude: **/NOTICE
[INFO] Exclude: **/DEPENDENCIES
[INFO] Exclude: **/nb-configuration.xml
[INFO] Exclude: **/.externalToolBuilders/**
[INFO] Exclude: **/maven-eclipse.xml
[INFO] Exclude: **/ref/**
[INFO] Exclude: **/server-ref/**
[INFO] Exclude: **/dependency-reduced-pom.xml
[INFO] 28 resources included (use -debug for more details)
[INFO] Rat check: Summary of files. Unapproved: 0 unknown: 0 generated: 0 approved: 28 licence.
[INFO] 
[INFO] --- maven-jar-plugin:2.4:jar (default-jar) @ olingo-server-test ---
[INFO] Building jar: /x1/jenkins/jenkins-slave/workspace/olingo-odata4/lib/server-test/target/olingo-server-test-0.1.0-SNAPSHOT.jar
[INFO] 
[INFO] --- maven-site-plugin:3.3:attach-descriptor (attach-descriptor) @ olingo-server-test
---
[INFO] 
[INFO] --- maven-failsafe-plugin:2.17:integration-test (integration-test) @ olingo-server-test
---
[INFO] 
[INFO] --- maven-source-plugin:2.2.1:jar-no-fork (attach-sources) @ olingo-server-test ---
[INFO] Building jar: /x1/jenkins/jenkins-slave/workspace/olingo-odata4/lib/server-test/target/olingo-server-test-0.1.0-SNAPSHOT-sources.jar
[INFO] 
[INFO] --- maven-failsafe-plugin:2.17:verify (integration-test) @ olingo-server-test ---
[INFO] Failsafe report directory: /x1/jenkins/jenkins-slave/workspace/olingo-odata4/lib/server-test/target/failsafe-reports
[INFO] 
[INFO] --- maven-checkstyle-plugin:2.12.1:check (checkstyle) @ olingo-server-test ---
[INFO] Starting audit...
Audit done.

[INFO] 
[INFO] --- maven-install-plugin:2.5.1:install (default-install) @ olingo-server-test ---
[INFO] Installing /x1/jenkins/jenkins-slave/workspace/olingo-odata4/lib/server-test/target/olingo-server-test-0.1.0-SNAPSHOT.jar
to /home/jenkins/.m2/repository/org/apache/olingo/olingo-server-test/0.1.0-SNAPSHOT/olingo-server-test-0.1.0-SNAPSHOT.jar
[INFO] Installing /x1/jenkins/jenkins-slave/workspace/olingo-odata4/lib/server-test/pom.xml
to /home/jenkins/.m2/repository/org/apache/olingo/olingo-server-test/0.1.0-SNAPSHOT/olingo-server-test-0.1.0-SNAPSHOT.pom
[INFO] Installing /x1/jenkins/jenkins-slave/workspace/olingo-odata4/lib/server-test/target/olingo-server-test-0.1.0-SNAPSHOT-sources.jar
to /home/jenkins/.m2/repository/org/apache/olingo/olingo-server-test/0.1.0-SNAPSHOT/olingo-server-test-0.1.0-SNAPSHOT-sources.jar
[INFO] 
[INFO] --- maven-deploy-plugin:2.8.1:deploy (default-deploy) @ olingo-server-test ---
Downloading: https://repository.apache.org/content/repositories/snapshots/org/apache/olingo/olingo-server-test/0.1.0-SNAPSHOT/maven-metadata.xml
1007/1007 B   
              
Downloaded: https://repository.apache.org/content/repositories/snapshots/org/apache/olingo/olingo-server-test/0.1.0-SNAPSHOT/maven-metadata.xml
(1007 B at 10.2 KB/sec)
Uploading: https://repository.apache.org/content/repositories/snapshots/org/apache/olingo/olingo-server-test/0.1.0-SNAPSHOT/olingo-server-test-0.1.0-20140722.141532-123.jar
2/7 KB        
4/7 KB   
6/7 KB   
7/7 KB   
         
Uploaded: https://repository.apache.org/content/repositories/snapshots/org/apache/olingo/olingo-server-test/0.1.0-SNAPSHOT/olingo-server-test-0.1.0-20140722.141532-123.jar
(7 KB at 90.7 KB/sec)
Uploading: https://repository.apache.org/content/repositories/snapshots/org/apache/olingo/olingo-server-test/0.1.0-SNAPSHOT/olingo-server-test-0.1.0-20140722.141532-123.pom
2/3 KB   
3/3 KB   
         
Uploaded: https://repository.apache.org/content/repositories/snapshots/org/apache/olingo/olingo-server-test/0.1.0-SNAPSHOT/olingo-server-test-0.1.0-20140722.141532-123.pom
(3 KB at 33.1 KB/sec)
Downloading: https://repository.apache.org/content/repositories/snapshots/org/apache/olingo/olingo-server-test/maven-metadata.xml
295/295 B   
            
Downloaded: https://repository.apache.org/content/repositories/snapshots/org/apache/olingo/olingo-server-test/maven-metadata.xml
(295 B at 3.9 KB/sec)
Uploading: https://repository.apache.org/content/repositories/snapshots/org/apache/olingo/olingo-server-test/0.1.0-SNAPSHOT/maven-metadata.xml
1007/1007 B   
              
Uploaded: https://repository.apache.org/content/repositories/snapshots/org/apache/olingo/olingo-server-test/0.1.0-SNAPSHOT/maven-metadata.xml
(1007 B at 12.3 KB/sec)
Uploading: https://repository.apache.org/content/repositories/snapshots/org/apache/olingo/olingo-server-test/maven-metadata.xml
295/295 B     
            
Uploaded: https://repository.apache.org/content/repositories/snapshots/org/apache/olingo/olingo-server-test/maven-metadata.xml
(295 B at 3.8 KB/sec)
Uploading: https://repository.apache.org/content/repositories/snapshots/org/apache/olingo/olingo-server-test/0.1.0-SNAPSHOT/olingo-server-test-0.1.0-20140722.141532-123-sources.jar
2/5 KB      
4/5 KB   
5/5 KB   
         
Uploaded: https://repository.apache.org/content/repositories/snapshots/org/apache/olingo/olingo-server-test/0.1.0-SNAPSHOT/olingo-server-test-0.1.0-20140722.141532-123-sources.jar
(5 KB at 45.6 KB/sec)
Uploading: https://repository.apache.org/content/repositories/snapshots/org/apache/olingo/olingo-server-test/0.1.0-SNAPSHOT/maven-metadata.xml
1007/1007 B   
              
Uploaded: https://repository.apache.org/content/repositories/snapshots/org/apache/olingo/olingo-server-test/0.1.0-SNAPSHOT/maven-metadata.xml
(1007 B at 17.6 KB/sec)
[INFO]                                                                         
[INFO] ------------------------------------------------------------------------
[INFO] Building olingo-ext 0.1.0-SNAPSHOT
[INFO] ------------------------------------------------------------------------
[INFO] 
[INFO] --- maven-clean-plugin:2.5:clean (default-clean) @ olingo-ext ---
[INFO] Deleting /x1/jenkins/jenkins-slave/workspace/olingo-odata4/ext/target
[INFO] 
[INFO] --- maven-remote-resources-plugin:1.5:process (default) @ olingo-ext ---
[INFO] 
[INFO] --- apache-rat-plugin:0.10:check (rat-check) @ olingo-ext ---
[INFO] 54 implicit excludes (use -debug for more details).
[INFO] Exclude: **/META-INF/**
[INFO] Exclude: **/*.txt
[INFO] Exclude: **/*.ini
[INFO] Exclude: **/*.bin
[INFO] Exclude: **/MANIFEST.MF
[INFO] Exclude: .gitignore
[INFO] Exclude: .git/**
[INFO] Exclude: bin/**
[INFO] Exclude: **/*.local
[INFO] Exclude: **/*.project
[INFO] Exclude: **/*.classpath
[INFO] Exclude: **/*.json
[INFO] Exclude: **/*.batch
[INFO] Exclude: **/NOTICE
[INFO] Exclude: **/DEPENDENCIES
[INFO] Exclude: **/nb-configuration.xml
[INFO] Exclude: **/.externalToolBuilders/**
[INFO] Exclude: **/maven-eclipse.xml
[INFO] Exclude: **/ref/**
[INFO] Exclude: **/server-ref/**
[INFO] Exclude: **/dependency-reduced-pom.xml
[INFO] 25 resources included (use -debug for more details)
[INFO] Rat check: Summary of files. Unapproved: 8 unknown: 8 generated: 0 approved: 3 licence.
[INFO] ------------------------------------------------------------------------
[INFO] Reactor Summary:
[INFO] 
[INFO] olingo-parent ..................................... SUCCESS [15.528s]
[INFO] olingo-lib ........................................ SUCCESS [1.027s]
[INFO] olingo-commons-api ................................ SUCCESS [13.624s]
[INFO] olingo-commons-core ............................... SUCCESS [12.136s]
[INFO] olingo-client-api ................................. SUCCESS [5.216s]
[INFO] olingo-client-core ................................ SUCCESS [25.716s]
[INFO] olingo-server-api ................................. SUCCESS [5.548s]
[INFO] olingo-server-core ................................ SUCCESS [21.766s]
[INFO] olingo-server-tecsvc .............................. SUCCESS [10.376s]
[INFO] olingo-server-test ................................ SUCCESS [11.030s]
[INFO] olingo-ext ........................................ FAILURE [0.228s]
[INFO] olingo-client-proxy ............................... SKIPPED
[INFO] pojogen-maven-plugin .............................. SKIPPED
[INFO] olingo-client-android ............................. SKIPPED
[INFO] olingo-fit ........................................ SKIPPED
[INFO] olingo-dist ....................................... SKIPPED
[INFO] olingo-dist-android-lib ........................... SKIPPED
[INFO] olingo-dist-client-lib ............................ SKIPPED
[INFO] olingo-dist-server-lib ............................ SKIPPED
[INFO] olingo-dist-javadoc ............................... SKIPPED
[INFO] ------------------------------------------------------------------------
[INFO] BUILD FAILURE
[INFO] ------------------------------------------------------------------------
[INFO] Total time: 2:03.251s
[INFO] Finished at: Tue Jul 22 14:15:34 UTC 2014
[INFO] Final Memory: 73M/420M
[INFO] ------------------------------------------------------------------------
[ERROR] Failed to execute goal org.apache.rat:apache-rat-plugin:0.10:check (rat-check) on
project olingo-ext: Too many files with unapproved license: 8 See RAT report in: /x1/jenkins/jenkins-slave/workspace/olingo-odata4/ext/target/rat.txt
-> [Help 1]
[ERROR] 
[ERROR] To see the full stack trace of the errors, re-run Maven with the -e switch.
[ERROR] Re-run Maven using the -X switch to enable full debug logging.
[ERROR] 
[ERROR] For more information about the errors and possible solutions, please read the following
articles:
[ERROR] [Help 1] http://cwiki.apache.org/confluence/display/MAVEN/MojoFailureException
[ERROR] 
[ERROR] After correcting the problems, you can resume the build with the command
[ERROR]   mvn <goals> -rf :olingo-ext
Build step 'Invoke top-level Maven targets' marked build as failure

Mime
View raw message