olingo-commits mailing list archives

Site index · List index
Message view « Date » · « Thread »
Top « Date » · « Thread »
From Apache Jenkins Server <jenk...@builds.apache.org>
Subject Build failed in Jenkins: olingo-odata4 #303
Date Thu, 15 May 2014 19:29:45 GMT
See <https://builds.apache.org/job/olingo-odata4/303/changes>

Changes:

[--global] [OLINGO-260] V4 function / action import invoke

[--global] Fixing bad test

[--global] Fixing RAT errors due to ref and server-ref

[fmartelli] [OLINGO-260] provided primitive keys integration test for proxy and pojogen

[--global] [OLINGO-260] V4 bound operation invoke

[--global] [OLINGO-261] Simplifying enum handling

[--global] [OLINGO-261][OLINGO-260] Improving singleton handling

[--global] [OLINGO-260] async tests

[--global] [OLINGO-260] key as segment

[fmartelli] [OLINGO-260] partially provided opentype support on proxy

[fmartelli] [OLINGO-260] fix type seraialization + opentype integration test extension

[--global] [OLINGO-261] Saving enum and complex generated classes for usage with open types

[fmartelli] [OLINGO-260] opentypes full integrated onto the proxy

[--global] [OLINGO-260] Filter/orderby and search tests

------------------------------------------
[...truncated 6386 lines...]
[INFO] Webapp assembled in [376 msecs]
[INFO] Building war: /x1/jenkins/jenkins-slave/workspace/olingo-odata4/fit/target/olingo-fit-0.1.0-SNAPSHOT.war
[INFO] 
[INFO] --- maven-site-plugin:3.3:attach-descriptor (attach-descriptor) @ olingo-fit ---
[INFO] 
[INFO] --- cargo-maven2-plugin:1.4.8:start (start-container) @ olingo-fit ---
[INFO] 
[INFO] --- maven-invoker-plugin:1.8:integration-test (integration-test) @ olingo-fit ---
[INFO] Building: staticServiceV4/pom.xml
[INFO] run script verify.groovy
[INFO] ..SUCCESS (4.7 s)
[INFO] Building: primitiveKeysServiceV3/pom.xml
[INFO] run script verify.groovy
[INFO] ..SUCCESS (4.3 s)
[INFO] Building: staticServiceV3/pom.xml
[INFO] run script verify.groovy
[INFO] ..SUCCESS (5.7 s)
[INFO] Building: openTypeV4/pom.xml
[INFO] run script verify.groovy
[INFO] ..SUCCESS (4.5 s)
[INFO] Building: openTypeV3/pom.xml
[INFO] run script verify.groovy
[INFO] ..SUCCESS (4.2 s)
[INFO] Building: actionOverloadingV3/pom.xml
[INFO] run script verify.groovy
[INFO] ..SUCCESS (5.2 s)
[INFO] 
[INFO] --- maven-failsafe-plugin:2.17:integration-test (integration-test) @ olingo-fit ---
[INFO] Failsafe report directory: /x1/jenkins/jenkins-slave/workspace/olingo-odata4/fit/target/failsafe-reports

-------------------------------------------------------
 T E S T S
-------------------------------------------------------
Running org.apache.olingo.fit.proxy.v3.ActionOverloadingTestITCase
Tests run: 2, Failures: 0, Errors: 0, Skipped: 0, Time elapsed: 3.564 sec - in org.apache.olingo.fit.proxy.v3.ActionOverloadingTestITCase
Running org.apache.olingo.fit.proxy.v3.AsyncTestITCase
Tests run: 3, Failures: 0, Errors: 0, Skipped: 0, Time elapsed: 2.432 sec - in org.apache.olingo.fit.proxy.v3.AsyncTestITCase
Running org.apache.olingo.fit.proxy.v3.AuthEntityRetrieveTestITCase
Tests run: 11, Failures: 0, Errors: 0, Skipped: 0, Time elapsed: 0.617 sec - in org.apache.olingo.fit.proxy.v3.AuthEntityRetrieveTestITCase
Running org.apache.olingo.fit.proxy.v3.ContextTestITCase
Tests run: 11, Failures: 0, Errors: 0, Skipped: 0, Time elapsed: 1.143 sec - in org.apache.olingo.fit.proxy.v3.ContextTestITCase
Running org.apache.olingo.fit.proxy.v3.EntityCreateTestITCase
Tests run: 5, Failures: 0, Errors: 0, Skipped: 0, Time elapsed: 0.848 sec - in org.apache.olingo.fit.proxy.v3.EntityCreateTestITCase
Running org.apache.olingo.fit.proxy.v3.EntityRetrieveTestITCase
Tests run: 11, Failures: 0, Errors: 0, Skipped: 0, Time elapsed: 0.336 sec - in org.apache.olingo.fit.proxy.v3.EntityRetrieveTestITCase
Running org.apache.olingo.fit.proxy.v3.EntitySetTestITCase
Tests run: 5, Failures: 0, Errors: 0, Skipped: 0, Time elapsed: 0.985 sec - in org.apache.olingo.fit.proxy.v3.EntitySetTestITCase
Running org.apache.olingo.fit.proxy.v3.EntityUpdateTestITCase
Tests run: 4, Failures: 0, Errors: 0, Skipped: 0, Time elapsed: 0.659 sec - in org.apache.olingo.fit.proxy.v3.EntityUpdateTestITCase
Running org.apache.olingo.fit.proxy.v3.FilterTestITCase
Tests run: 3, Failures: 0, Errors: 0, Skipped: 0, Time elapsed: 0.22 sec - in org.apache.olingo.fit.proxy.v3.FilterTestITCase
Running org.apache.olingo.fit.proxy.v3.InvokeTestITCase
Tests run: 6, Failures: 0, Errors: 0, Skipped: 0, Time elapsed: 0.463 sec - in org.apache.olingo.fit.proxy.v3.InvokeTestITCase
Running org.apache.olingo.fit.proxy.v3.OpenTypeTestITCase
Tests run: 3, Failures: 0, Errors: 0, Skipped: 0, Time elapsed: 0.186 sec - in org.apache.olingo.fit.proxy.v3.OpenTypeTestITCase
Running org.apache.olingo.fit.proxy.v3.PrimitiveKeysTestITCase
Tests run: 1, Failures: 0, Errors: 0, Skipped: 0, Time elapsed: 0.149 sec - in org.apache.olingo.fit.proxy.v3.PrimitiveKeysTestITCase
Running org.apache.olingo.fit.proxy.v3.PropertyTestITCase
Tests run: 2, Failures: 0, Errors: 0, Skipped: 0, Time elapsed: 0.081 sec - in org.apache.olingo.fit.proxy.v3.PropertyTestITCase
Running org.apache.olingo.fit.proxy.v4.AsyncTestITCase
Tests run: 2, Failures: 1, Errors: 0, Skipped: 0, Time elapsed: 2.125 sec <<< FAILURE!
- in org.apache.olingo.fit.proxy.v4.AsyncTestITCase
updateEntity(org.apache.olingo.fit.proxy.v4.AsyncTestITCase)  Time elapsed: 1.106 sec  <<<
FAILURE!
org.junit.ComparisonFailure: expected:<[??????????]> but was:<[??????????????????????????????]>
	at org.junit.Assert.assertEquals(Assert.java:115)
	at org.junit.Assert.assertEquals(Assert.java:144)
	at org.apache.olingo.fit.proxy.v4.AsyncTestITCase.updateEntity(AsyncTestITCase.java:90)

Running org.apache.olingo.fit.proxy.v4.AuthEntityRetrieveTestITCase
Tests run: 9, Failures: 0, Errors: 0, Skipped: 0, Time elapsed: 0.049 sec - in org.apache.olingo.fit.proxy.v4.AuthEntityRetrieveTestITCase
Running org.apache.olingo.fit.proxy.v4.BoundOperationInvokeTestITCase
Tests run: 10, Failures: 0, Errors: 0, Skipped: 0, Time elapsed: 0.451 sec - in org.apache.olingo.fit.proxy.v4.BoundOperationInvokeTestITCase
Running org.apache.olingo.fit.proxy.v4.EntityCreateTestITCase
Tests run: 5, Failures: 0, Errors: 0, Skipped: 0, Time elapsed: 0.529 sec - in org.apache.olingo.fit.proxy.v4.EntityCreateTestITCase
Running org.apache.olingo.fit.proxy.v4.EntityRetrieveTestITCase
Tests run: 9, Failures: 0, Errors: 0, Skipped: 0, Time elapsed: 0.176 sec - in org.apache.olingo.fit.proxy.v4.EntityRetrieveTestITCase
Running org.apache.olingo.fit.proxy.v4.EntitySetTestITCase
Tests run: 4, Failures: 0, Errors: 0, Skipped: 0, Time elapsed: 0.108 sec - in org.apache.olingo.fit.proxy.v4.EntitySetTestITCase
Running org.apache.olingo.fit.proxy.v4.EntityUpdateTestITCase
Tests run: 4, Failures: 0, Errors: 0, Skipped: 0, Time elapsed: 0.351 sec - in org.apache.olingo.fit.proxy.v4.EntityUpdateTestITCase
Running org.apache.olingo.fit.proxy.v4.FilterTestITCase
Tests run: 2, Failures: 0, Errors: 0, Skipped: 0, Time elapsed: 0.07 sec - in org.apache.olingo.fit.proxy.v4.FilterTestITCase
Running org.apache.olingo.fit.proxy.v4.KeyAsSegmentTestITCase
Tests run: 3, Failures: 0, Errors: 0, Skipped: 0, Time elapsed: 0.15 sec - in org.apache.olingo.fit.proxy.v4.KeyAsSegmentTestITCase
Running org.apache.olingo.fit.proxy.v4.OpenTypeTestITCase
Tests run: 3, Failures: 0, Errors: 0, Skipped: 0, Time elapsed: 0.16 sec - in org.apache.olingo.fit.proxy.v4.OpenTypeTestITCase
Running org.apache.olingo.fit.proxy.v4.OperationImportInvokeTestITCase
Tests run: 8, Failures: 0, Errors: 0, Skipped: 0, Time elapsed: 0.145 sec - in org.apache.olingo.fit.proxy.v4.OperationImportInvokeTestITCase
Running org.apache.olingo.fit.proxy.v4.PropertyTestITCase
Tests run: 2, Failures: 0, Errors: 0, Skipped: 0, Time elapsed: 0.092 sec - in org.apache.olingo.fit.proxy.v4.PropertyTestITCase
Running org.apache.olingo.fit.proxy.v4.SingletonTestITCase
Tests run: 2, Failures: 0, Errors: 0, Skipped: 0, Time elapsed: 0.074 sec - in org.apache.olingo.fit.proxy.v4.SingletonTestITCase
Running org.apache.olingo.fit.tecsvc.PingITCase
Tests run: 1, Failures: 0, Errors: 0, Skipped: 0, Time elapsed: 0.049 sec - in org.apache.olingo.fit.tecsvc.PingITCase
Running org.apache.olingo.fit.v3.ActionOverloadingTestITCase
Tests run: 2, Failures: 0, Errors: 0, Skipped: 0, Time elapsed: 0.2 sec - in org.apache.olingo.fit.v3.ActionOverloadingTestITCase
Running org.apache.olingo.fit.v3.AsyncTestITCase
Tests run: 3, Failures: 0, Errors: 0, Skipped: 0, Time elapsed: 3.054 sec - in org.apache.olingo.fit.v3.AsyncTestITCase
Running org.apache.olingo.fit.v3.AuthEntityRetrieveTestITCase
Tests run: 13, Failures: 0, Errors: 0, Skipped: 0, Time elapsed: 0.62 sec - in org.apache.olingo.fit.v3.AuthEntityRetrieveTestITCase
Running org.apache.olingo.fit.v3.BatchTestITCase
Tests run: 6, Failures: 0, Errors: 0, Skipped: 0, Time elapsed: 0.485 sec - in org.apache.olingo.fit.v3.BatchTestITCase
Running org.apache.olingo.fit.v3.CountTestITCase
Tests run: 2, Failures: 0, Errors: 0, Skipped: 0, Time elapsed: 0.024 sec - in org.apache.olingo.fit.v3.CountTestITCase
Running org.apache.olingo.fit.v3.EntityCreateTestITCase
Tests run: 16, Failures: 0, Errors: 0, Skipped: 0, Time elapsed: 1.089 sec - in org.apache.olingo.fit.v3.EntityCreateTestITCase
Running org.apache.olingo.fit.v3.EntityRetrieveTestITCase
Tests run: 13, Failures: 0, Errors: 0, Skipped: 0, Time elapsed: 0.226 sec - in org.apache.olingo.fit.v3.EntityRetrieveTestITCase
Running org.apache.olingo.fit.v3.EntitySetTestITCase
Tests run: 10, Failures: 0, Errors: 0, Skipped: 0, Time elapsed: 0.865 sec - in org.apache.olingo.fit.v3.EntitySetTestITCase
Running org.apache.olingo.fit.v3.EntityUpdateTestITCase
Tests run: 12, Failures: 0, Errors: 0, Skipped: 0, Time elapsed: 0.52 sec - in org.apache.olingo.fit.v3.EntityUpdateTestITCase
Running org.apache.olingo.fit.v3.ErrorTestITCase
Tests run: 6, Failures: 0, Errors: 0, Skipped: 0, Time elapsed: 0.099 sec - in org.apache.olingo.fit.v3.ErrorTestITCase
Running org.apache.olingo.fit.v3.FilterFactoryTestITCase
Tests run: 9, Failures: 0, Errors: 0, Skipped: 0, Time elapsed: 0.147 sec - in org.apache.olingo.fit.v3.FilterFactoryTestITCase
Running org.apache.olingo.fit.v3.FilterTestITCase
Tests run: 7, Failures: 0, Errors: 0, Skipped: 0, Time elapsed: 0.506 sec - in org.apache.olingo.fit.v3.FilterTestITCase
Running org.apache.olingo.fit.v3.InvokeTestITCase
Tests run: 6, Failures: 0, Errors: 0, Skipped: 0, Time elapsed: 0.293 sec - in org.apache.olingo.fit.v3.InvokeTestITCase
Running org.apache.olingo.fit.v3.KeyAsSegmentTestITCase
Tests run: 6, Failures: 0, Errors: 0, Skipped: 0, Time elapsed: 0.147 sec - in org.apache.olingo.fit.v3.KeyAsSegmentTestITCase
Running org.apache.olingo.fit.v3.LinkTestITCase
Tests run: 7, Failures: 0, Errors: 0, Skipped: 0, Time elapsed: 0.289 sec - in org.apache.olingo.fit.v3.LinkTestITCase
Running org.apache.olingo.fit.v3.MediaEntityTestITCase
Tests run: 9, Failures: 0, Errors: 0, Skipped: 0, Time elapsed: 0.148 sec - in org.apache.olingo.fit.v3.MediaEntityTestITCase
Running org.apache.olingo.fit.v3.MetadataTestITCase
Tests run: 1, Failures: 0, Errors: 0, Skipped: 0, Time elapsed: 0.019 sec - in org.apache.olingo.fit.v3.MetadataTestITCase
Running org.apache.olingo.fit.v3.OpenTypeTestITCase
Tests run: 5, Failures: 0, Errors: 0, Skipped: 0, Time elapsed: 0.104 sec - in org.apache.olingo.fit.v3.OpenTypeTestITCase
Running org.apache.olingo.fit.v3.PrimitiveKeysTestITCase
Tests run: 2, Failures: 0, Errors: 0, Skipped: 0, Time elapsed: 0.261 sec - in org.apache.olingo.fit.v3.PrimitiveKeysTestITCase
Running org.apache.olingo.fit.v3.PropertyRetrieveTestITCase
Tests run: 14, Failures: 0, Errors: 0, Skipped: 0, Time elapsed: 0.597 sec - in org.apache.olingo.fit.v3.PropertyRetrieveTestITCase
Running org.apache.olingo.fit.v3.PropertyTestITCase
Tests run: 16, Failures: 0, Errors: 0, Skipped: 0, Time elapsed: 0.438 sec - in org.apache.olingo.fit.v3.PropertyTestITCase
Running org.apache.olingo.fit.v3.PropertyValueTestITCase
Tests run: 10, Failures: 0, Errors: 0, Skipped: 0, Time elapsed: 0.077 sec - in org.apache.olingo.fit.v3.PropertyValueTestITCase
Running org.apache.olingo.fit.v3.QueryOptionsTestITCase
Tests run: 6, Failures: 0, Errors: 0, Skipped: 0, Time elapsed: 0.182 sec - in org.apache.olingo.fit.v3.QueryOptionsTestITCase
Running org.apache.olingo.fit.v3.ServiceDocumentTestITCase
Tests run: 2, Failures: 0, Errors: 0, Skipped: 0, Time elapsed: 0.026 sec - in org.apache.olingo.fit.v3.ServiceDocumentTestITCase
Running org.apache.olingo.fit.v3.XHTTPMethodEntityUpdateTestITCase
Tests run: 12, Failures: 0, Errors: 0, Skipped: 0, Time elapsed: 0.489 sec - in org.apache.olingo.fit.v3.XHTTPMethodEntityUpdateTestITCase
Running org.apache.olingo.fit.v3.XHTTPMethodPropertyUpdateTestITCase
Tests run: 16, Failures: 0, Errors: 0, Skipped: 0, Time elapsed: 0.437 sec - in org.apache.olingo.fit.v3.XHTTPMethodPropertyUpdateTestITCase
Running org.apache.olingo.fit.v4.AsyncTestITCase
Tests run: 5, Failures: 0, Errors: 0, Skipped: 0, Time elapsed: 1.071 sec - in org.apache.olingo.fit.v4.AsyncTestITCase
Running org.apache.olingo.fit.v4.BatchTestITCase
Tests run: 9, Failures: 0, Errors: 0, Skipped: 0, Time elapsed: 0.497 sec - in org.apache.olingo.fit.v4.BatchTestITCase
Running org.apache.olingo.fit.v4.BoundOperationInvokeTestITCase
Tests run: 4, Failures: 0, Errors: 0, Skipped: 0, Time elapsed: 0.413 sec - in org.apache.olingo.fit.v4.BoundOperationInvokeTestITCase
Running org.apache.olingo.fit.v4.DeltaTestITCase
Tests run: 2, Failures: 0, Errors: 0, Skipped: 0, Time elapsed: 0.074 sec - in org.apache.olingo.fit.v4.DeltaTestITCase
Running org.apache.olingo.fit.v4.DerivedTypeTestITCase
Tests run: 4, Failures: 0, Errors: 0, Skipped: 0, Time elapsed: 0.126 sec - in org.apache.olingo.fit.v4.DerivedTypeTestITCase
Running org.apache.olingo.fit.v4.EntityCreateTestITCase
Tests run: 6, Failures: 0, Errors: 0, Skipped: 0, Time elapsed: 0.258 sec - in org.apache.olingo.fit.v4.EntityCreateTestITCase
Running org.apache.olingo.fit.v4.EntityRetrieveTestITCase
Tests run: 21, Failures: 0, Errors: 0, Skipped: 0, Time elapsed: 0.319 sec - in org.apache.olingo.fit.v4.EntityRetrieveTestITCase
Running org.apache.olingo.fit.v4.EntitySetTestITCase
Tests run: 11, Failures: 0, Errors: 0, Skipped: 0, Time elapsed: 0.363 sec - in org.apache.olingo.fit.v4.EntitySetTestITCase
Running org.apache.olingo.fit.v4.EntityUpdateTestITCase
Tests run: 6, Failures: 0, Errors: 0, Skipped: 0, Time elapsed: 0.216 sec - in org.apache.olingo.fit.v4.EntityUpdateTestITCase
Running org.apache.olingo.fit.v4.ErrorResponseTestITCase
Tests run: 1, Failures: 0, Errors: 0, Skipped: 0, Time elapsed: 0.008 sec - in org.apache.olingo.fit.v4.ErrorResponseTestITCase
Running org.apache.olingo.fit.v4.FilterFactoryTestITCase
Tests run: 1, Failures: 0, Errors: 0, Skipped: 0, Time elapsed: 0.011 sec - in org.apache.olingo.fit.v4.FilterFactoryTestITCase
Running org.apache.olingo.fit.v4.KeyAsSegmentTestITCase
Tests run: 6, Failures: 0, Errors: 0, Skipped: 0, Time elapsed: 0.145 sec - in org.apache.olingo.fit.v4.KeyAsSegmentTestITCase
Running org.apache.olingo.fit.v4.MediaEntityTestITCase
Tests run: 7, Failures: 0, Errors: 0, Skipped: 0, Time elapsed: 0.17 sec - in org.apache.olingo.fit.v4.MediaEntityTestITCase
Running org.apache.olingo.fit.v4.MetadataTestITCase
Tests run: 3, Failures: 0, Errors: 0, Skipped: 0, Time elapsed: 0.082 sec - in org.apache.olingo.fit.v4.MetadataTestITCase
Running org.apache.olingo.fit.v4.OpenTypeTestITCase
Tests run: 5, Failures: 0, Errors: 0, Skipped: 0, Time elapsed: 0.121 sec - in org.apache.olingo.fit.v4.OpenTypeTestITCase
Running org.apache.olingo.fit.v4.OperationImportInvokeTestITCase
Tests run: 6, Failures: 0, Errors: 0, Skipped: 0, Time elapsed: 0.305 sec - in org.apache.olingo.fit.v4.OperationImportInvokeTestITCase
Running org.apache.olingo.fit.v4.PropertyTestITCase
Tests run: 10, Failures: 0, Errors: 0, Skipped: 0, Time elapsed: 0.126 sec - in org.apache.olingo.fit.v4.PropertyTestITCase
Running org.apache.olingo.fit.v4.PropertyValueTestITCase
Tests run: 10, Failures: 0, Errors: 0, Skipped: 0, Time elapsed: 0.074 sec - in org.apache.olingo.fit.v4.PropertyValueTestITCase
Running org.apache.olingo.fit.v4.QueryOptionsTestITCase
Tests run: 8, Failures: 0, Errors: 0, Skipped: 0, Time elapsed: 0.102 sec - in org.apache.olingo.fit.v4.QueryOptionsTestITCase
Running org.apache.olingo.fit.v4.ServiceDocumentTestITCase
Tests run: 2, Failures: 0, Errors: 0, Skipped: 0, Time elapsed: 0.022 sec - in org.apache.olingo.fit.v4.ServiceDocumentTestITCase
Running org.apache.olingo.fit.v4.SingletonTestITCase
Tests run: 8, Failures: 0, Errors: 0, Skipped: 0, Time elapsed: 0.142 sec - in org.apache.olingo.fit.v4.SingletonTestITCase

Results :

Failed tests: 
  AsyncTestITCase.updateEntity:90 expected:<[??????????]> but was:<[??????????????????????????????]>

Tests run: 477, Failures: 1, Errors: 0, Skipped: 0

[INFO] 
[INFO] --- cargo-maven2-plugin:1.4.8:stop (stop-container) @ olingo-fit ---
[INFO] 
[INFO] --- maven-checkstyle-plugin:2.12.1:check (checkstyle) @ olingo-fit ---
[INFO] Starting audit...
Audit done.

[INFO] 
[INFO] --- maven-invoker-plugin:1.8:verify (integration-test) @ olingo-fit ---
[INFO] -------------------------------------------------
[INFO] Build Summary:
[INFO]   Passed: 6, Failed: 0, Errors: 0, Skipped: 0
[INFO] -------------------------------------------------
[INFO] 
[INFO] --- maven-failsafe-plugin:2.17:verify (integration-test) @ olingo-fit ---
[INFO] Failsafe report directory: /x1/jenkins/jenkins-slave/workspace/olingo-odata4/fit/target/failsafe-reports
[INFO] ------------------------------------------------------------------------
[INFO] Reactor Summary:
[INFO] 
[INFO] olingo-parent ..................................... SUCCESS [9.117s]
[INFO] olingo-lib ........................................ SUCCESS [3.750s]
[INFO] olingo-commons-api ................................ SUCCESS [7.685s]
[INFO] olingo-commons-core ............................... SUCCESS [7.309s]
[INFO] olingo-client-api ................................. SUCCESS [2.824s]
[INFO] olingo-client-core ................................ SUCCESS [11.796s]
[INFO] olingo-server-api ................................. SUCCESS [1.427s]
[INFO] olingo-server-core ................................ SUCCESS [6.324s]
[INFO] olingo-server-tecsvc .............................. SUCCESS [9.079s]
[INFO] olingo-ext ........................................ SUCCESS [0.919s]
[INFO] olingo-client-core-android ........................ SUCCESS [8.832s]
[INFO] olingo-client-proxy ............................... SUCCESS [3.035s]
[INFO] pojogen-maven-plugin .............................. SUCCESS [17.150s]
[INFO] olingo-fit ........................................ FAILURE [1:33.272s]
[INFO] ------------------------------------------------------------------------
[INFO] BUILD FAILURE
[INFO] ------------------------------------------------------------------------
[INFO] Total time: 3:03.009s
[INFO] Finished at: Thu May 15 19:29:44 UTC 2014
[INFO] Final Memory: 41M/382M
[INFO] ------------------------------------------------------------------------
[ERROR] Failed to execute goal org.apache.maven.plugins:maven-failsafe-plugin:2.17:verify
(integration-test) on project olingo-fit: There are test failures.
[ERROR] 
[ERROR] Please refer to /x1/jenkins/jenkins-slave/workspace/olingo-odata4/fit/target/failsafe-reports
for the individual test results.
[ERROR] -> [Help 1]
[ERROR] 
[ERROR] To see the full stack trace of the errors, re-run Maven with the -e switch.
[ERROR] Re-run Maven using the -X switch to enable full debug logging.
[ERROR] 
[ERROR] For more information about the errors and possible solutions, please read the following
articles:
[ERROR] [Help 1] http://cwiki.apache.org/confluence/display/MAVEN/MojoFailureException
[ERROR] 
[ERROR] After correcting the problems, you can resume the build with the command
[ERROR]   mvn <goals> -rf :olingo-fit
Build step 'Invoke top-level Maven targets' marked build as failure

Mime
View raw message