olingo-commits mailing list archives

Site index · List index
Message view « Date » · « Thread »
Top « Date » · « Thread »
From Apache Jenkins Server <jenk...@builds.apache.org>
Subject Build failed in Jenkins: olingo-odata4 #214
Date Wed, 02 Apr 2014 08:42:26 GMT
See <https://builds.apache.org/job/olingo-odata4/214/changes>

Changes:

[chrisam] [OLINGO-168] metadata serialization

[chrisam] [OLINGO-168] Refactor Tech Provider

[chrisam] [OLINGO-168] More TechProvider Refactoring

[chrisam] [OLINGO-168] Refactoring

------------------------------------------
[...truncated 7771 lines...]
12902/13055 KB   
12904/13055 KB   
12906/13055 KB   
12908/13055 KB   
12910/13055 KB   
12912/13055 KB   
12914/13055 KB   
12916/13055 KB   
12918/13055 KB   
12920/13055 KB   
12922/13055 KB   
12924/13055 KB   
12926/13055 KB   
12928/13055 KB   
12930/13055 KB   
12932/13055 KB   
12934/13055 KB   
12936/13055 KB   
12938/13055 KB   
12940/13055 KB   
12942/13055 KB   
12944/13055 KB   
12946/13055 KB   
12948/13055 KB   
12950/13055 KB   
12952/13055 KB   
12954/13055 KB   
12956/13055 KB   
12958/13055 KB   
12960/13055 KB   
12962/13055 KB   
12964/13055 KB   
12966/13055 KB   
12968/13055 KB   
12970/13055 KB   
12972/13055 KB   
12974/13055 KB   
12976/13055 KB   
12978/13055 KB   
12980/13055 KB   
12982/13055 KB   
12984/13055 KB   
12986/13055 KB   
12988/13055 KB   
12990/13055 KB   
12992/13055 KB   
12994/13055 KB   
12996/13055 KB   
12998/13055 KB   
13000/13055 KB   
13002/13055 KB   
13004/13055 KB   
13006/13055 KB   
13008/13055 KB   
13010/13055 KB   
13012/13055 KB   
13014/13055 KB   
13016/13055 KB   
13018/13055 KB   
13020/13055 KB   
13022/13055 KB   
13024/13055 KB   
13026/13055 KB   
13028/13055 KB   
13030/13055 KB   
13032/13055 KB   
13034/13055 KB   
13036/13055 KB   
13038/13055 KB   
13040/13055 KB   
13042/13055 KB   
13044/13055 KB   
13046/13055 KB   
13048/13055 KB   
13050/13055 KB   
13052/13055 KB   
13054/13055 KB   
13055/13055 KB   
                 
Uploaded: https://repository.apache.org/content/repositories/snapshots/org/apache/olingo/olingo-fit-incubating/0.1.0-SNAPSHOT/olingo-fit-incubating-0.1.0-20140402.084157-33.war
(13055 KB at 5448.5 KB/sec)
Uploading: https://repository.apache.org/content/repositories/snapshots/org/apache/olingo/olingo-fit-incubating/0.1.0-SNAPSHOT/olingo-fit-incubating-0.1.0-20140402.084157-33.pom
2/6 KB           
4/6 KB   
6/6 KB   
         
Uploaded: https://repository.apache.org/content/repositories/snapshots/org/apache/olingo/olingo-fit-incubating/0.1.0-SNAPSHOT/olingo-fit-incubating-0.1.0-20140402.084157-33.pom
(6 KB at 16.4 KB/sec)
Downloading: https://repository.apache.org/content/repositories/snapshots/org/apache/olingo/olingo-fit-incubating/maven-metadata.xml
298/298 B   
            
Downloaded: https://repository.apache.org/content/repositories/snapshots/org/apache/olingo/olingo-fit-incubating/maven-metadata.xml
(298 B at 1.6 KB/sec)
Uploading: https://repository.apache.org/content/repositories/snapshots/org/apache/olingo/olingo-fit-incubating/0.1.0-SNAPSHOT/maven-metadata.xml
791/791 B   
            
Uploaded: https://repository.apache.org/content/repositories/snapshots/org/apache/olingo/olingo-fit-incubating/0.1.0-SNAPSHOT/maven-metadata.xml
(791 B at 2.2 KB/sec)
Uploading: https://repository.apache.org/content/repositories/snapshots/org/apache/olingo/olingo-fit-incubating/maven-metadata.xml
298/298 B   
            
Uploaded: https://repository.apache.org/content/repositories/snapshots/org/apache/olingo/olingo-fit-incubating/maven-metadata.xml
(298 B at 0.8 KB/sec)
[INFO]                                                                         
[INFO] ------------------------------------------------------------------------
[INFO] Building olingo-client-core-incubating 0.1.0-SNAPSHOT
[INFO] ------------------------------------------------------------------------
[INFO] 
[INFO] --- maven-clean-plugin:2.5:clean (default-clean) @ olingo-client-core-incubating ---
[INFO] 
[INFO] --- maven-remote-resources-plugin:1.4:process (default) @ olingo-client-core-incubating
---
[INFO] 
[INFO] --- maven-resources-plugin:2.6:resources (default-resources) @ olingo-client-core-incubating
---
[INFO] Using 'UTF-8' encoding to copy filtered resources.
[INFO] skip non existing resourceDirectory <https://builds.apache.org/job/olingo-odata4/ws/lib/client-core/src/main/resources>
[INFO] Copying 3 resources
[INFO] 
[INFO] --- maven-compiler-plugin:3.1:compile (default-compile) @ olingo-client-core-incubating
---
[INFO] Changes detected - recompiling the module!
[INFO] Compiling 288 source files to <https://builds.apache.org/job/olingo-odata4/ws/lib/client-core/target/classes>
[INFO] 
[INFO] --- maven-resources-plugin:2.6:testResources (default-testResources) @ olingo-client-core-incubating
---
[INFO] Using 'UTF-8' encoding to copy filtered resources.
[INFO] Copying 105 resources
[INFO] Copying 231 resources
[INFO] Copying 3 resources
[INFO] 
[INFO] --- maven-compiler-plugin:3.1:testCompile (default-testCompile) @ olingo-client-core-incubating
---
[INFO] Changes detected - recompiling the module!
[INFO] Compiling 61 source files to <https://builds.apache.org/job/olingo-odata4/ws/lib/client-core/target/test-classes>
[INFO] 
[INFO] --- maven-surefire-plugin:2.16:test (default-test) @ olingo-client-core-incubating
---
[INFO] Surefire report directory: <https://builds.apache.org/job/olingo-odata4/ws/lib/client-core/target/surefire-reports>

-------------------------------------------------------
 T E S T S
-------------------------------------------------------
Running org.apache.olingo.client.core.ODataClientTest
SLF4J: Failed to load class "org.slf4j.impl.StaticLoggerBinder".
SLF4J: Defaulting to no-operation (NOP) logger implementation
SLF4J: See http://www.slf4j.org/codes.html#StaticLoggerBinder for further details.
Tests run: 1, Failures: 0, Errors: 0, Skipped: 0, Time elapsed: 0.232 sec - in org.apache.olingo.client.core.ODataClientTest
Running org.apache.olingo.client.core.uri.URIEscapeTest
Tests run: 6, Failures: 0, Errors: 0, Skipped: 0, Time elapsed: 0.022 sec - in org.apache.olingo.client.core.uri.URIEscapeTest
Running org.apache.olingo.client.core.uri.v3.FilterFactoryTest
Tests run: 10, Failures: 0, Errors: 0, Skipped: 0, Time elapsed: 0.024 sec - in org.apache.olingo.client.core.uri.v3.FilterFactoryTest
Running org.apache.olingo.client.core.uri.v3.URIBuilderTest
Tests run: 10, Failures: 0, Errors: 0, Skipped: 0, Time elapsed: 0.039 sec - in org.apache.olingo.client.core.uri.v3.URIBuilderTest
Running org.apache.olingo.client.core.uri.v4.FilterFactoryTest
Tests run: 4, Failures: 0, Errors: 0, Skipped: 0, Time elapsed: 0.004 sec - in org.apache.olingo.client.core.uri.v4.FilterFactoryTest
Running org.apache.olingo.client.core.uri.v4.URIBuilderTest
Tests run: 10, Failures: 0, Errors: 0, Skipped: 0, Time elapsed: 0.031 sec - in org.apache.olingo.client.core.uri.v4.URIBuilderTest
Running org.apache.olingo.client.core.v3.AtomTest
Tests run: 3, Failures: 0, Errors: 0, Skipped: 0, Time elapsed: 3.642 sec - in org.apache.olingo.client.core.v3.AtomTest
Running org.apache.olingo.client.core.v3.EntitySetTest
Tests run: 2, Failures: 0, Errors: 0, Skipped: 0, Time elapsed: 0.889 sec - in org.apache.olingo.client.core.v3.EntitySetTest
Running org.apache.olingo.client.core.v3.EntityTest
Tests run: 10, Failures: 0, Errors: 0, Skipped: 0, Time elapsed: 0.573 sec - in org.apache.olingo.client.core.v3.EntityTest
Running org.apache.olingo.client.core.v3.ErrorTest
Tests run: 4, Failures: 0, Errors: 0, Skipped: 0, Time elapsed: 0.026 sec - in org.apache.olingo.client.core.v3.ErrorTest
Running org.apache.olingo.client.core.v3.JSONTest
Tests run: 3, Failures: 0, Errors: 0, Skipped: 0, Time elapsed: 0.433 sec - in org.apache.olingo.client.core.v3.JSONTest
Running org.apache.olingo.client.core.v3.MetadataTest
Tests run: 5, Failures: 0, Errors: 0, Skipped: 0, Time elapsed: 0.429 sec - in org.apache.olingo.client.core.v3.MetadataTest
Running org.apache.olingo.client.core.v3.PrimitiveValueTest
Tests run: 16, Failures: 0, Errors: 0, Skipped: 0, Time elapsed: 0.067 sec - in org.apache.olingo.client.core.v3.PrimitiveValueTest
Running org.apache.olingo.client.core.v3.PropertyTest
Tests run: 7, Failures: 0, Errors: 0, Skipped: 0, Time elapsed: 0.146 sec - in org.apache.olingo.client.core.v3.PropertyTest
Running org.apache.olingo.client.core.v3.ServiceDocumentTest
Tests run: 2, Failures: 0, Errors: 0, Skipped: 0, Time elapsed: 0.031 sec - in org.apache.olingo.client.core.v3.ServiceDocumentTest
Running org.apache.olingo.client.core.v4.AtomTest
Tests run: 4, Failures: 0, Errors: 0, Skipped: 0, Time elapsed: 0.388 sec - in org.apache.olingo.client.core.v4.AtomTest
Running org.apache.olingo.client.core.v4.EntitySetTest
Tests run: 4, Failures: 0, Errors: 0, Skipped: 0, Time elapsed: 0.048 sec - in org.apache.olingo.client.core.v4.EntitySetTest
Running org.apache.olingo.client.core.v4.EntityTest
Tests run: 12, Failures: 0, Errors: 0, Skipped: 0, Time elapsed: 0.124 sec - in org.apache.olingo.client.core.v4.EntityTest
Running org.apache.olingo.client.core.v4.ErrorTest
Tests run: 2, Failures: 0, Errors: 0, Skipped: 0, Time elapsed: 0.004 sec - in org.apache.olingo.client.core.v4.ErrorTest
Running org.apache.olingo.client.core.v4.JSONTest
Tests run: 4, Failures: 0, Errors: 0, Skipped: 0, Time elapsed: 0.059 sec - in org.apache.olingo.client.core.v4.JSONTest
Running org.apache.olingo.client.core.v4.MetadataTest
Tests run: 6, Failures: 0, Errors: 0, Skipped: 0, Time elapsed: 0.392 sec - in org.apache.olingo.client.core.v4.MetadataTest
Running org.apache.olingo.client.core.v4.PrimitiveValueTest
Tests run: 2, Failures: 0, Errors: 0, Skipped: 0, Time elapsed: 0.004 sec - in org.apache.olingo.client.core.v4.PrimitiveValueTest
Running org.apache.olingo.client.core.v4.PropertyTest
Tests run: 6, Failures: 0, Errors: 0, Skipped: 0, Time elapsed: 0.037 sec - in org.apache.olingo.client.core.v4.PropertyTest
Running org.apache.olingo.client.core.v4.ServiceDocumentTest
Tests run: 2, Failures: 0, Errors: 0, Skipped: 0, Time elapsed: 0.012 sec - in org.apache.olingo.client.core.v4.ServiceDocumentTest

Results :

Tests run: 135, Failures: 0, Errors: 0, Skipped: 0

[INFO] 
[INFO] --- apache-rat-plugin:0.10:check (rat-check) @ olingo-client-core-incubating ---
[INFO] 51 implicit excludes (use -debug for more details).
[INFO] Exclude: **/META-INF/services/*
[INFO] Exclude: **/*.txt
[INFO] Exclude: **/*.ini
[INFO] Exclude: **/*.bin
[INFO] Exclude: **/MANIFEST.MF
[INFO] Exclude: .gitignore
[INFO] Exclude: .git/**
[INFO] Exclude: bin/**
[INFO] Exclude: **/*.local
[INFO] Exclude: **/*.project
[INFO] Exclude: **/*.classpath
[INFO] Exclude: **/*.json
[INFO] Exclude: **/*.batch
[INFO] Exclude: **/NOTICE
[INFO] Exclude: **/DEPENDENCIES
[INFO] Exclude: **/nb-configuration.xml
[INFO] Exclude: **/.externalToolBuilders/**
[INFO] Exclude: **/maven-eclipse.xml
[INFO] 404 resources included (use -debug for more details)
[INFO] Rat check: Summary of files. Unapproved: 0 unknown: 0 generated: 0 approved: 403 licence.
[INFO] 
[INFO] --- maven-jar-plugin:2.4:jar (default-jar) @ olingo-client-core-incubating ---
[INFO] Building jar: <https://builds.apache.org/job/olingo-odata4/ws/lib/client-core/target/olingo-client-core-incubating-0.1.0-SNAPSHOT.jar>
[INFO] 
[INFO] --- maven-site-plugin:3.2:attach-descriptor (attach-descriptor) @ olingo-client-core-incubating
---
[INFO] 
[INFO] --- cargo-maven2-plugin:1.4.7:start (start-container) @ olingo-client-core-incubating
---
[INFO] ------------------------------------------------------------------------
[INFO] Reactor Summary:
[INFO] 
[INFO] olingo-parent-incubating .......................... SUCCESS [14.317s]
[INFO] olingo-lib-incubating ............................. SUCCESS [2.106s]
[INFO] olingo-commons-api-incubating ..................... SUCCESS [8.327s]
[INFO] olingo-server-api-incubating ...................... SUCCESS [4.629s]
[INFO] olingo-commons-core-incubating .................... SUCCESS [16.932s]
[INFO] olingo-server-core-incubating ..................... SUCCESS [16.469s]
[INFO] olingo-client-api-incubating ...................... SUCCESS [4.350s]
[INFO] olingo-fit-incubating ............................. SUCCESS [18.847s]
[INFO] olingo-client-core-incubating ..................... FAILURE [24.561s]
[INFO] olingo-ref-incubating ............................. SKIPPED
[INFO] ------------------------------------------------------------------------
[INFO] BUILD FAILURE
[INFO] ------------------------------------------------------------------------
[INFO] Total time: 1:51.548s
[INFO] Finished at: Wed Apr 02 08:42:25 UTC 2014
[INFO] Final Memory: 35M/376M
[INFO] ------------------------------------------------------------------------
[ERROR] Failed to execute goal org.codehaus.cargo:cargo-maven2-plugin:1.4.7:start (start-container)
on project olingo-client-core-incubating: Execution start-container of goal org.codehaus.cargo:cargo-maven2-plugin:1.4.7:start
failed: Port number 9080 (defined with the property cargo.servlet.port) is in use. Please
free it on the system or set it to a different port in the container configuration. ->
[Help 1]
[ERROR] 
[ERROR] To see the full stack trace of the errors, re-run Maven with the -e switch.
[ERROR] Re-run Maven using the -X switch to enable full debug logging.
[ERROR] 
[ERROR] For more information about the errors and possible solutions, please read the following
articles:
[ERROR] [Help 1] http://cwiki.apache.org/confluence/display/MAVEN/PluginExecutionException
[ERROR] 
[ERROR] After correcting the problems, you can resume the build with the command
[ERROR]   mvn <goals> -rf :olingo-client-core-incubating
Build step 'Invoke top-level Maven targets' marked build as failure

Mime
View raw message