olingo-commits mailing list archives

Site index · List index
Message view « Date » · « Thread »
Top « Date » · « Thread »
From Apache Jenkins Server <jenk...@builds.apache.org>
Subject Build failed in Jenkins: olingo-odata2 #35
Date Fri, 02 Aug 2013 15:43:57 GMT
See <https://builds.apache.org/job/olingo-odata2/35/changes>

Changes:

[jhuesken] Cleanup 'sap' in test sources and files (core,fit)

------------------------------------------
[...truncated 875 lines...]
Running org.apache.olingo.odata2.core.uri.expression.TestParserExceptions
Tests run: 8, Failures: 3, Errors: 0, Skipped: 0, Time elapsed: 0.089 sec <<< FAILURE!
testOPMparseOrderByString(org.apache.olingo.odata2.core.uri.expression.TestParserExceptions)
 Time elapsed: 0.002 sec  <<< FAILURE!
org.junit.ComparisonFailure:   aExMessageText(String ascc)-->Expected: 'Invalid sort order
in OData orderby parser at position 8 in "String ascc".' Actual: 'Invalid sort order in OData
orderby parser at position 8 in String ascc.' expected:<...er at position 8 in ["String
ascc"].> but was:<...er at position 8 in [String ascc].>
	at org.junit.Assert.assertEquals(Assert.java:125)
	at org.apache.olingo.odata2.core.uri.expression.ParserTool.aExMsgText(ParserTool.java:188)
	at org.apache.olingo.odata2.core.uri.expression.TestParserExceptions.testOPMparseOrderByString(TestParserExceptions.java:38)
	at sun.reflect.NativeMethodAccessorImpl.invoke0(Native Method)
	at sun.reflect.NativeMethodAccessorImpl.invoke(NativeMethodAccessorImpl.java:39)
	at sun.reflect.DelegatingMethodAccessorImpl.invoke(DelegatingMethodAccessorImpl.java:25)
	at java.lang.reflect.Method.invoke(Method.java:597)
	at org.junit.runners.model.FrameworkMethod$1.runReflectiveCall(FrameworkMethod.java:45)
	at org.junit.internal.runners.model.ReflectiveCallable.run(ReflectiveCallable.java:15)
	at org.junit.runners.model.FrameworkMethod.invokeExplosively(FrameworkMethod.java:42)
	at org.junit.internal.runners.statements.InvokeMethod.evaluate(InvokeMethod.java:20)
	at org.junit.runners.ParentRunner.runLeaf(ParentRunner.java:263)
	at org.junit.runners.BlockJUnit4ClassRunner.runChild(BlockJUnit4ClassRunner.java:68)
	at org.junit.runners.BlockJUnit4ClassRunner.runChild(BlockJUnit4ClassRunner.java:47)
	at org.junit.runners.ParentRunner$3.run(ParentRunner.java:231)
	at org.junit.runners.ParentRunner$1.schedule(ParentRunner.java:60)
	at org.junit.runners.ParentRunner.runChildren(ParentRunner.java:229)
	at org.junit.runners.ParentRunner.access$000(ParentRunner.java:50)
	at org.junit.runners.ParentRunner$2.evaluate(ParentRunner.java:222)
	at org.junit.runners.ParentRunner.run(ParentRunner.java:300)
	at org.apache.maven.surefire.junit4.JUnit4Provider.execute(JUnit4Provider.java:252)
	at org.apache.maven.surefire.junit4.JUnit4Provider.executeTestSet(JUnit4Provider.java:141)
	at org.apache.maven.surefire.junit4.JUnit4Provider.invoke(JUnit4Provider.java:112)
	at sun.reflect.NativeMethodAccessorImpl.invoke0(Native Method)
	at sun.reflect.NativeMethodAccessorImpl.invoke(NativeMethodAccessorImpl.java:39)
	at sun.reflect.DelegatingMethodAccessorImpl.invoke(DelegatingMethodAccessorImpl.java:25)
	at java.lang.reflect.Method.invoke(Method.java:597)
	at org.apache.maven.surefire.util.ReflectionUtils.invokeMethodWithArray(ReflectionUtils.java:189)
	at org.apache.maven.surefire.booter.ProviderFactory$ProviderProxy.invoke(ProviderFactory.java:165)
	at org.apache.maven.surefire.booter.ProviderFactory.invokeProvider(ProviderFactory.java:85)
	at org.apache.maven.surefire.booter.ForkedBooter.runSuitesInProcess(ForkedBooter.java:115)
	at org.apache.maven.surefire.booter.ForkedBooter.main(ForkedBooter.java:75)

testPMreadParameters(org.apache.olingo.odata2.core.uri.expression.TestParserExceptions)  Time
elapsed: 0.003 sec  <<< FAILURE!
org.junit.ComparisonFailure:   aExMessageText(concat(123)-->Expected: '")" or "," expected
after position 10 in "concat(123".' Actual: '")" or "," expected after position 10.' expected:<...ed
after position 10[ in "concat(123"].> but was:<...ed after position 10[].>
	at org.junit.Assert.assertEquals(Assert.java:125)
	at org.apache.olingo.odata2.core.uri.expression.ParserTool.aExMsgText(ParserTool.java:188)
	at org.apache.olingo.odata2.core.uri.expression.TestParserExceptions.testPMreadParameters(TestParserExceptions.java:161)
	at sun.reflect.NativeMethodAccessorImpl.invoke0(Native Method)
	at sun.reflect.NativeMethodAccessorImpl.invoke(NativeMethodAccessorImpl.java:39)
	at sun.reflect.DelegatingMethodAccessorImpl.invoke(DelegatingMethodAccessorImpl.java:25)
	at java.lang.reflect.Method.invoke(Method.java:597)
	at org.junit.runners.model.FrameworkMethod$1.runReflectiveCall(FrameworkMethod.java:45)
	at org.junit.internal.runners.model.ReflectiveCallable.run(ReflectiveCallable.java:15)
	at org.junit.runners.model.FrameworkMethod.invokeExplosively(FrameworkMethod.java:42)
	at org.junit.internal.runners.statements.InvokeMethod.evaluate(InvokeMethod.java:20)
	at org.junit.runners.ParentRunner.runLeaf(ParentRunner.java:263)
	at org.junit.runners.BlockJUnit4ClassRunner.runChild(BlockJUnit4ClassRunner.java:68)
	at org.junit.runners.BlockJUnit4ClassRunner.runChild(BlockJUnit4ClassRunner.java:47)
	at org.junit.runners.ParentRunner$3.run(ParentRunner.java:231)
	at org.junit.runners.ParentRunner$1.schedule(ParentRunner.java:60)
	at org.junit.runners.ParentRunner.runChildren(ParentRunner.java:229)
	at org.junit.runners.ParentRunner.access$000(ParentRunner.java:50)
	at org.junit.runners.ParentRunner$2.evaluate(ParentRunner.java:222)
	at org.junit.runners.ParentRunner.run(ParentRunner.java:300)
	at org.apache.maven.surefire.junit4.JUnit4Provider.execute(JUnit4Provider.java:252)
	at org.apache.maven.surefire.junit4.JUnit4Provider.executeTestSet(JUnit4Provider.java:141)
	at org.apache.maven.surefire.junit4.JUnit4Provider.invoke(JUnit4Provider.java:112)
	at sun.reflect.NativeMethodAccessorImpl.invoke0(Native Method)
	at sun.reflect.NativeMethodAccessorImpl.invoke(NativeMethodAccessorImpl.java:39)
	at sun.reflect.DelegatingMethodAccessorImpl.invoke(DelegatingMethodAccessorImpl.java:25)
	at java.lang.reflect.Method.invoke(Method.java:597)
	at org.apache.maven.surefire.util.ReflectionUtils.invokeMethodWithArray(ReflectionUtils.java:189)
	at org.apache.maven.surefire.booter.ProviderFactory$ProviderProxy.invoke(ProviderFactory.java:165)
	at org.apache.maven.surefire.booter.ProviderFactory.invokeProvider(ProviderFactory.java:85)
	at org.apache.maven.surefire.booter.ForkedBooter.runSuitesInProcess(ForkedBooter.java:115)
	at org.apache.maven.surefire.booter.ForkedBooter.main(ForkedBooter.java:75)

testAdditionalStuff(org.apache.olingo.odata2.core.uri.expression.TestParserExceptions)  Time
elapsed: 0.002 sec  <<< FAILURE!
org.junit.ComparisonFailure:   aExMessageText(Address\NotAProperty)-->Expected: 'Error
while tokenizing a ODATA expression on token "\" at position 8 in "Address\NotAProperty".'
Actual: 'Error while tokenizing a ODATA expression on token '\' at position '8'.' expected:<...expression
on token ["\" at position 8 in "Address\NotAProperty"].> but was:<...expression on token
['\' at position '8'].>
	at org.junit.Assert.assertEquals(Assert.java:125)
	at org.apache.olingo.odata2.core.uri.expression.ParserTool.aExMsgText(ParserTool.java:188)
	at org.apache.olingo.odata2.core.uri.expression.TestParserExceptions.testAdditionalStuff(TestParserExceptions.java:311)
	at sun.reflect.NativeMethodAccessorImpl.invoke0(Native Method)
	at sun.reflect.NativeMethodAccessorImpl.invoke(NativeMethodAccessorImpl.java:39)
	at sun.reflect.DelegatingMethodAccessorImpl.invoke(DelegatingMethodAccessorImpl.java:25)
	at java.lang.reflect.Method.invoke(Method.java:597)
	at org.junit.runners.model.FrameworkMethod$1.runReflectiveCall(FrameworkMethod.java:45)
	at org.junit.internal.runners.model.ReflectiveCallable.run(ReflectiveCallable.java:15)
	at org.junit.runners.model.FrameworkMethod.invokeExplosively(FrameworkMethod.java:42)
	at org.junit.internal.runners.statements.InvokeMethod.evaluate(InvokeMethod.java:20)
	at org.junit.runners.ParentRunner.runLeaf(ParentRunner.java:263)
	at org.junit.runners.BlockJUnit4ClassRunner.runChild(BlockJUnit4ClassRunner.java:68)
	at org.junit.runners.BlockJUnit4ClassRunner.runChild(BlockJUnit4ClassRunner.java:47)
	at org.junit.runners.ParentRunner$3.run(ParentRunner.java:231)
	at org.junit.runners.ParentRunner$1.schedule(ParentRunner.java:60)
	at org.junit.runners.ParentRunner.runChildren(ParentRunner.java:229)
	at org.junit.runners.ParentRunner.access$000(ParentRunner.java:50)
	at org.junit.runners.ParentRunner$2.evaluate(ParentRunner.java:222)
	at org.junit.runners.ParentRunner.run(ParentRunner.java:300)
	at org.apache.maven.surefire.junit4.JUnit4Provider.execute(JUnit4Provider.java:252)
	at org.apache.maven.surefire.junit4.JUnit4Provider.executeTestSet(JUnit4Provider.java:141)
	at org.apache.maven.surefire.junit4.JUnit4Provider.invoke(JUnit4Provider.java:112)
	at sun.reflect.NativeMethodAccessorImpl.invoke0(Native Method)
	at sun.reflect.NativeMethodAccessorImpl.invoke(NativeMethodAccessorImpl.java:39)
	at sun.reflect.DelegatingMethodAccessorImpl.invoke(DelegatingMethodAccessorImpl.java:25)
	at java.lang.reflect.Method.invoke(Method.java:597)
	at org.apache.maven.surefire.util.ReflectionUtils.invokeMethodWithArray(ReflectionUtils.java:189)
	at org.apache.maven.surefire.booter.ProviderFactory$ProviderProxy.invoke(ProviderFactory.java:165)
	at org.apache.maven.surefire.booter.ProviderFactory.invokeProvider(ProviderFactory.java:85)
	at org.apache.maven.surefire.booter.ForkedBooter.runSuitesInProcess(ForkedBooter.java:115)
	at org.apache.maven.surefire.booter.ForkedBooter.main(ForkedBooter.java:75)

Running org.apache.olingo.odata2.core.uri.expression.TestSpec
Tests run: 3, Failures: 0, Errors: 0, Skipped: 0, Time elapsed: 0.015 sec
Running org.apache.olingo.odata2.core.uri.expression.TestAbapCompatibility
Tests run: 4, Failures: 1, Errors: 0, Skipped: 0, Time elapsed: 0.01 sec <<< FAILURE!
abapTestFilterParser(org.apache.olingo.odata2.core.uri.expression.TestAbapCompatibility) 
Time elapsed: 0.007 sec  <<< FAILURE!
org.junit.ComparisonFailure:   aExMessageText(concat('a' 'b'))-->Expected: '")" or ","
expected after position 10 in "concat('a' 'b')".' Actual: '")" or "," expected after position
10.' expected:<...ed after position 10[ in "concat('a' 'b')"].> but was:<...ed after
position 10[].>
	at org.junit.Assert.assertEquals(Assert.java:125)
	at org.apache.olingo.odata2.core.uri.expression.ParserTool.aExMsgText(ParserTool.java:188)
	at org.apache.olingo.odata2.core.uri.expression.TestAbapCompatibility.abapTestFilterParser(TestAbapCompatibility.java:373)
	at sun.reflect.NativeMethodAccessorImpl.invoke0(Native Method)
	at sun.reflect.NativeMethodAccessorImpl.invoke(NativeMethodAccessorImpl.java:39)
	at sun.reflect.DelegatingMethodAccessorImpl.invoke(DelegatingMethodAccessorImpl.java:25)
	at java.lang.reflect.Method.invoke(Method.java:597)
	at org.junit.runners.model.FrameworkMethod$1.runReflectiveCall(FrameworkMethod.java:45)
	at org.junit.internal.runners.model.ReflectiveCallable.run(ReflectiveCallable.java:15)
	at org.junit.runners.model.FrameworkMethod.invokeExplosively(FrameworkMethod.java:42)
	at org.junit.internal.runners.statements.InvokeMethod.evaluate(InvokeMethod.java:20)
	at org.junit.runners.ParentRunner.runLeaf(ParentRunner.java:263)
	at org.junit.runners.BlockJUnit4ClassRunner.runChild(BlockJUnit4ClassRunner.java:68)
	at org.junit.runners.BlockJUnit4ClassRunner.runChild(BlockJUnit4ClassRunner.java:47)
	at org.junit.runners.ParentRunner$3.run(ParentRunner.java:231)
	at org.junit.runners.ParentRunner$1.schedule(ParentRunner.java:60)
	at org.junit.runners.ParentRunner.runChildren(ParentRunner.java:229)
	at org.junit.runners.ParentRunner.access$000(ParentRunner.java:50)
	at org.junit.runners.ParentRunner$2.evaluate(ParentRunner.java:222)
	at org.junit.runners.ParentRunner.run(ParentRunner.java:300)
	at org.apache.maven.surefire.junit4.JUnit4Provider.execute(JUnit4Provider.java:252)
	at org.apache.maven.surefire.junit4.JUnit4Provider.executeTestSet(JUnit4Provider.java:141)
	at org.apache.maven.surefire.junit4.JUnit4Provider.invoke(JUnit4Provider.java:112)
	at sun.reflect.NativeMethodAccessorImpl.invoke0(Native Method)
	at sun.reflect.NativeMethodAccessorImpl.invoke(NativeMethodAccessorImpl.java:39)
	at sun.reflect.DelegatingMethodAccessorImpl.invoke(DelegatingMethodAccessorImpl.java:25)
	at java.lang.reflect.Method.invoke(Method.java:597)
	at org.apache.maven.surefire.util.ReflectionUtils.invokeMethodWithArray(ReflectionUtils.java:189)
	at org.apache.maven.surefire.booter.ProviderFactory$ProviderProxy.invoke(ProviderFactory.java:165)
	at org.apache.maven.surefire.booter.ProviderFactory.invokeProvider(ProviderFactory.java:85)
	at org.apache.maven.surefire.booter.ForkedBooter.runSuitesInProcess(ForkedBooter.java:115)
	at org.apache.maven.surefire.booter.ForkedBooter.main(ForkedBooter.java:75)

Running org.apache.olingo.odata2.core.uri.expression.TestTokenizer
Tests run: 7, Failures: 1, Errors: 0, Skipped: 0, Time elapsed: 0.003 sec <<< FAILURE!
testExceptions(org.apache.olingo.odata2.core.uri.expression.TestTokenizer)  Time elapsed:
0.001 sec  <<< FAILURE!
org.junit.ComparisonFailure:   aExMessageText(\)-->Expected: 'Unknown character '\' at
position '0' detected in "\".' Actual: 'Unknown character '\' at position '0' detected.' expected:<...osition
'0' detected[ in "\"].> but was:<...osition '0' detected[].>
	at org.junit.Assert.assertEquals(Assert.java:125)
	at org.apache.olingo.odata2.core.uri.expression.TokenTool.aExMsgText(TokenTool.java:257)
	at org.apache.olingo.odata2.core.uri.expression.TestTokenizer.testExceptions(TestTokenizer.java:124)
	at sun.reflect.NativeMethodAccessorImpl.invoke0(Native Method)
	at sun.reflect.NativeMethodAccessorImpl.invoke(NativeMethodAccessorImpl.java:39)
	at sun.reflect.DelegatingMethodAccessorImpl.invoke(DelegatingMethodAccessorImpl.java:25)
	at java.lang.reflect.Method.invoke(Method.java:597)
	at org.junit.runners.model.FrameworkMethod$1.runReflectiveCall(FrameworkMethod.java:45)
	at org.junit.internal.runners.model.ReflectiveCallable.run(ReflectiveCallable.java:15)
	at org.junit.runners.model.FrameworkMethod.invokeExplosively(FrameworkMethod.java:42)
	at org.junit.internal.runners.statements.InvokeMethod.evaluate(InvokeMethod.java:20)
	at org.junit.runners.ParentRunner.runLeaf(ParentRunner.java:263)
	at org.junit.runners.BlockJUnit4ClassRunner.runChild(BlockJUnit4ClassRunner.java:68)
	at org.junit.runners.BlockJUnit4ClassRunner.runChild(BlockJUnit4ClassRunner.java:47)
	at org.junit.runners.ParentRunner$3.run(ParentRunner.java:231)
	at org.junit.runners.ParentRunner$1.schedule(ParentRunner.java:60)
	at org.junit.runners.ParentRunner.runChildren(ParentRunner.java:229)
	at org.junit.runners.ParentRunner.access$000(ParentRunner.java:50)
	at org.junit.runners.ParentRunner$2.evaluate(ParentRunner.java:222)
	at org.junit.runners.ParentRunner.run(ParentRunner.java:300)
	at org.apache.maven.surefire.junit4.JUnit4Provider.execute(JUnit4Provider.java:252)
	at org.apache.maven.surefire.junit4.JUnit4Provider.executeTestSet(JUnit4Provider.java:141)
	at org.apache.maven.surefire.junit4.JUnit4Provider.invoke(JUnit4Provider.java:112)
	at sun.reflect.NativeMethodAccessorImpl.invoke0(Native Method)
	at sun.reflect.NativeMethodAccessorImpl.invoke(NativeMethodAccessorImpl.java:39)
	at sun.reflect.DelegatingMethodAccessorImpl.invoke(DelegatingMethodAccessorImpl.java:25)
	at java.lang.reflect.Method.invoke(Method.java:597)
	at org.apache.maven.surefire.util.ReflectionUtils.invokeMethodWithArray(ReflectionUtils.java:189)
	at org.apache.maven.surefire.booter.ProviderFactory$ProviderProxy.invoke(ProviderFactory.java:165)
	at org.apache.maven.surefire.booter.ProviderFactory.invokeProvider(ProviderFactory.java:85)
	at org.apache.maven.surefire.booter.ForkedBooter.runSuitesInProcess(ForkedBooter.java:115)
	at org.apache.maven.surefire.booter.ForkedBooter.main(ForkedBooter.java:75)

Running org.apache.olingo.odata2.core.uri.expression.TestExceptionTexts
Tests run: 5, Failures: 0, Errors: 0, Skipped: 0, Time elapsed: 0.001 sec
Running org.apache.olingo.odata2.core.uri.expression.TestParser
Tests run: 21, Failures: 0, Errors: 0, Skipped: 0, Time elapsed: 0.001 sec
Running org.apache.olingo.odata2.core.uri.UriInfoTest
Tests run: 4, Failures: 0, Errors: 0, Skipped: 0, Time elapsed: 0 sec
Running org.apache.olingo.odata2.core.uri.QueryOptionsEnumTest
Tests run: 22, Failures: 0, Errors: 0, Skipped: 0, Time elapsed: 0.001 sec
Running org.apache.olingo.odata2.core.uri.UriParserTest
Tests run: 67, Failures: 0, Errors: 0, Skipped: 0, Time elapsed: 0.026 sec
Running org.apache.olingo.odata2.core.uri.UriParserFacadeTest
Tests run: 1, Failures: 0, Errors: 0, Skipped: 0, Time elapsed: 0.008 sec
Running org.apache.olingo.odata2.core.uri.ExpandSelectTreeCreatorImplTest
Tests run: 27, Failures: 0, Errors: 0, Skipped: 0, Time elapsed: 0.034 sec

Results :

Failed tests:   testParameter(org.apache.olingo.odata2.core.exception.MessageServiceTest):
expected:<[Only replacement is [first]]!> but was:<[Missing message for key 'org.apache.olingo.odata2.api.exception.ODataMessageException.ONE_REPLACEMENTS']!>
  testOneParameterForTwo(org.apache.olingo.odata2.core.exception.MessageServiceTest): expected:<Missing
[replacement for place holder in value 'First was [%1$s] and second was [%2$s]!' for following
arguments '[first]]'!> but was:<Missing [message for key 'org.apache.olingo.odata2.api.exception.ODataMessageException.TWO_REPLACEMENTS]'!>
  testTwoParameters(org.apache.olingo.odata2.core.exception.MessageServiceTest): expected:<[First
was [first] and second was [second]]!> but was:<[Missing message for key 'org.apache.olingo.odata2.api.exception.ODataMessageException.TWO_REPLACEMENTS']!>
  testTwoParametersWithTwoAddContent(org.apache.olingo.odata2.core.exception.MessageServiceTest):
expected:<[First was [first] and second was [second]]!> but was:<[Missing message
for key 'org.apache.olingo.odata2.api.exception.ODataMessageException.TWO_REPLACEMENTS']!>
  testThreeParametersForTwo(org.apache.olingo.odata2.core.exception.MessageServiceTest): expected:<[First
was [first] and second was [second]]!> but was:<[Missing message for key 'org.apache.olingo.odata2.api.exception.ODataMessageException.TWO_REPLACEMENTS']!>
  testThreeParametersPerAddContentForTwo(org.apache.olingo.odata2.core.exception.MessageServiceTest):
expected:<[First was [first] and second was [second]]!> but was:<[Missing message
for key 'org.apache.olingo.odata2.api.exception.ODataMessageException.TWO_REPLACEMENTS']!>
  testThreeParametersPerMixedForTwo(org.apache.olingo.odata2.core.exception.MessageServiceTest):
expected:<[First was [first] and second was [second]]!> but was:<[Missing message
for key 'org.apache.olingo.odata2.api.exception.ODataMessageException.TWO_REPLACEMENTS']!>
  testOPMparseOrderByString(org.apache.olingo.odata2.core.uri.expression.TestParserExceptions):
  aExMessageText(String ascc)-->Expected: 'Invalid sort order in OData orderby parser at
position 8 in "String ascc".' Actual: 'Invalid sort order in OData orderby parser at position
8 in String ascc.' expected:<...er at position 8 in ["String ascc"].> but was:<...er
at position 8 in [String ascc].>
  testPMreadParameters(org.apache.olingo.odata2.core.uri.expression.TestParserExceptions):
  aExMessageText(concat(123)-->Expected: '")" or "," expected after position 10 in "concat(123".'
Actual: '")" or "," expected after position 10.' expected:<...ed after position 10[ in
"concat(123"].> but was:<...ed after position 10[].>
  testAdditionalStuff(org.apache.olingo.odata2.core.uri.expression.TestParserExceptions):
  aExMessageText(Address\NotAProperty)-->Expected: 'Error while tokenizing a ODATA expression
on token "\" at position 8 in "Address\NotAProperty".' Actual: 'Error while tokenizing a ODATA
expression on token '\' at position '8'.' expected:<...expression on token ["\" at position
8 in "Address\NotAProperty"].> but was:<...expression on token ['\' at position '8'].>
  abapTestFilterParser(org.apache.olingo.odata2.core.uri.expression.TestAbapCompatibility):
  aExMessageText(concat('a' 'b'))-->Expected: '")" or "," expected after position 10 in
"concat('a' 'b')".' Actual: '")" or "," expected after position 10.' expected:<...ed after
position 10[ in "concat('a' 'b')"].> but was:<...ed after position 10[].>
  testExceptions(org.apache.olingo.odata2.core.uri.expression.TestTokenizer):   aExMessageText(\)-->Expected:
'Unknown character '\' at position '0' detected in "\".' Actual: 'Unknown character '\' at
position '0' detected.' expected:<...osition '0' detected[ in "\"].> but was:<...osition
'0' detected[].>

Tests run: 1193, Failures: 12, Errors: 0, Skipped: 2

[INFO] ------------------------------------------------------------------------
[INFO] Reactor Summary:
[INFO] 
[INFO] org.apache.olingo.odata2-parent ................... SUCCESS [10.015s]
[INFO] org.apache.olingo.odata2-api ...................... SUCCESS [13.181s]
[INFO] org.apache.olingo.odata2-testutil ................. SUCCESS [5.845s]
[INFO] org.apache.olingo.odata2-core ..................... FAILURE [24.717s]
[INFO] org.apache.olingo.odata2-ref ...................... SKIPPED
[INFO] org.apache.olingo.odata2-fit ...................... SKIPPED
[INFO] org.apache.olingo.odata2-ref.web .................. SKIPPED
[INFO] org.apache.olingo.odata2-api.annotation ........... SKIPPED
[INFO] org.apache.olingo.odata2-jpa.processor.api ........ SKIPPED
[INFO] org.apache.olingo.odata2-jpa.processor.core ....... SKIPPED
[INFO] ------------------------------------------------------------------------
[INFO] BUILD FAILURE
[INFO] ------------------------------------------------------------------------
[INFO] Total time: 57.523s
[INFO] Finished at: Fri Aug 02 15:43:57 UTC 2013
[INFO] Final Memory: 37M/129M
[INFO] ------------------------------------------------------------------------
[ERROR] Failed to execute goal org.apache.maven.plugins:maven-surefire-plugin:2.12.4:test
(default-test) on project core: There are test failures.
[ERROR] 
[ERROR] Please refer to /home/hudson/jenkins-slave/workspace/olingo-odata2/odata-core/target/surefire-reports
for the individual test results.
[ERROR] -> [Help 1]
[ERROR] 
[ERROR] To see the full stack trace of the errors, re-run Maven with the -e switch.
[ERROR] Re-run Maven using the -X switch to enable full debug logging.
[ERROR] 
[ERROR] For more information about the errors and possible solutions, please read the following
articles:
[ERROR] [Help 1] http://cwiki.apache.org/confluence/display/MAVEN/MojoFailureException
[ERROR] 
[ERROR] After correcting the problems, you can resume the build with the command
[ERROR]   mvn <goals> -rf :core
Build step 'Invoke top-level Maven targets' marked build as failure

Mime
View raw message