ofbiz-notifications mailing list archives

Site index · List index
Message view « Date » · « Thread »
Top « Date » · « Thread »
From "Jacques Le Roux (JIRA)" <j...@apache.org>
Subject [jira] [Comment Edited] (OFBIZ-10228) Build Failed Apache OFBiz with Build failed with an exception
Date Tue, 20 Feb 2018 12:19:00 GMT

    [ https://issues.apache.org/jira/browse/OFBIZ-10228?page=com.atlassian.jira.plugin.system.issuetabpanels:comment-tabpanel&focusedCommentId=16369989#comment-16369989
] 

Jacques Le Roux edited comment on OFBIZ-10228 at 2/20/18 12:18 PM:
-------------------------------------------------------------------

Hi Asil,

 R15 branch was not released and is no longer supported. It's not recommended to use it.

Could you please share in more details the steps you used to get this error?

 

 


was (Author: jacques.le.roux):
Hi Asil,

 R15 branch was not released and is no longer supported. It's not recommended to use it.

Could you please share the steps you used to get this error?

 

 

> Build Failed Apache OFBiz with Build failed with an exception
> -------------------------------------------------------------
>
>                 Key: OFBIZ-10228
>                 URL: https://issues.apache.org/jira/browse/OFBIZ-10228
>             Project: OFBiz
>          Issue Type: Bug
>    Affects Versions: 16.11.04
>            Reporter: Asil
>            Priority: Major
>
> I tried to install and run OFBiz on MacOs High Sierra. I installed Gradle 4.5.1 and Java
1.8. I followed the official tutorial. When I tried to build and start OFBiz using ./gradlew
cleanAll loadDefault ofbiz, the following error occurred.
> [...]/ofbiz.16.11/specialpurpose/lucene/src/main/java/org/apache/ofbiz/content/search/SearchWorker.java:44:
error: cannot find symbol
>     private static final Version LUCENE_VERSION = Version.LUCENE_5_3_1;
>                                                         
^
>   symbol:   variable LUCENE_5_3_1
>   location: class Version
>  
> [...]/ofbiz.16.11/specialpurpose/lucene/src/main/java/org/apache/ofbiz/content/search/ProductDocument.java:302:
error: cannot find symbol
>             field.setBoost(weight);
>                  ^
>   symbol:   method setBoost(float)
>   location: variable field of type Field
> Note: Some input files use unchecked or unsafe operations.
> Note: Recompile with -Xlint:unchecked for details.
> 2 errors
> :compileJava {color:#8eb021}FAILED{color}
>  
> {color:#d04437}FAILURE: Build failed with an exception.{color}
> * What went wrong:
> Execution failed for task ':compileJava'.
> > Compilation failed; see the compiler error output for details.
>  
> * Try:
> Run with *--stacktrace* option to get the stack trace. Run with *--info* or *--debug*
option to get more log output.
>  
> {color:#d04437}BUILD FAILED{color}



--
This message was sent by Atlassian JIRA
(v7.6.3#76005)

Mime
View raw message