ofbiz-notifications mailing list archives

Site index · List index
Message view « Date » · « Thread »
Top « Date » · « Thread »
From "Asil (JIRA)" <j...@apache.org>
Subject [jira] [Created] (OFBIZ-10228) Build Failed Apache OFBiz with Build failed with an exception
Date Mon, 19 Feb 2018 18:54:00 GMT
Asil created OFBIZ-10228:

             Summary: Build Failed Apache OFBiz with Build failed with an exception
                 Key: OFBIZ-10228
                 URL: https://issues.apache.org/jira/browse/OFBIZ-10228
             Project: OFBiz
          Issue Type: Bug
    Affects Versions: 16.11.04
            Reporter: Asil

I tried to install and run OFBiz on MacOs High Sierra. I installed Gradle 4.5.1 and Java 1.8.
I followed the official tutorial. When I tried to build and start OFBiz using ./gradlew cleanAll
loadDefault ofbiz, the following error occurred.

error: cannot find symbol

    private static final Version LUCENE_VERSION = Version.LUCENE_5_3_1;


  symbol:   variable LUCENE_5_3_1

  location: class Version


error: cannot find symbol



  symbol:   method setBoost(float)

  location: variable field of type Field

Note: Some input files use unchecked or unsafe operations.

Note: Recompile with -Xlint:unchecked for details.

2 errors

:compileJava {color:#8eb021}FAILED{color}


{color:#d04437}FAILURE: Build failed with an exception.{color}

* What went wrong:

Execution failed for task ':compileJava'.

> Compilation failed; see the compiler error output for details.


* Try:

Run with *--stacktrace* option to get the stack trace. Run with *--info* or *--debug* option
to get more log output.


{color:#d04437}BUILD FAILED{color}

This message was sent by Atlassian JIRA

View raw message