ode-dev mailing list archives

Site index · List index
Message view « Date » · « Thread »
Top « Date » · « Thread »
From Apache Hudson Server <hud...@hudson.apache.org>
Subject Build failed in Hudson: ODE-trunk-maven2-jdk5 #154
Date Thu, 06 Jan 2011 19:39:07 GMT
See <https://hudson.apache.org/hudson/job/ODE-trunk-maven2-jdk5/154/changes>

Changes:

[Tammo van Lessen] build fix.

[Tammo van Lessen] make the bundle compatible with newer SMX versions.

[Tammo van Lessen] jbi osgi bundling fix.

[Tammo van Lessen] osgi bundling fix.

[Tammo van Lessen] fixing jbi-karaf and jbi-karaf with buildr.

[Tammo van Lessen] ODE-739: Add recoverActivity command. Thanks to Daniel Dominguez!

Also:
  - suspend and resume commands added.
  - list command improved.

[Tammo van Lessen] ODE-901: Improved handling of SMX4 BPEL bundles. Big thanks to Kurt Westerfeld.

[Tammo van Lessen] fixes a classloading issue with JMX on SMX 4 (Kudos to Kurt Westerfeld).

[Tammo van Lessen] empty file removed.

------------------------------------------
[...truncated 3949 lines...]
[INFO] Nothing to compile - all classes are up to date
[INFO] [resources:testResources {execution: default-testResources}]
[INFO] Using 'UTF-8' encoding to copy filtered resources.
[INFO] skip non existing resourceDirectory <https://hudson.apache.org/hudson/job/ODE-trunk-maven2-jdk5/ws/trunk/axis2-bundle/src/test/resources>
[INFO] Copying 3 resources
[INFO] Copying 3 resources
[INFO] [compiler:testCompile {execution: default-testCompile}]
[INFO] No sources to compile
[INFO] [surefire:test {execution: default-test}]
[INFO] Surefire report directory: <https://hudson.apache.org/hudson/job/ODE-trunk-maven2-jdk5/ws/trunk/axis2-bundle/target/surefire-reports>

-------------------------------------------------------
 T E S T S
-------------------------------------------------------
There are no tests to run.

Results :

Tests run: 0, Failures: 0, Errors: 0, Skipped: 0

[HUDSON] Recording test results
[INFO] [bundle:bundle {execution: default-bundle}]
[WARNING] Include-Resource: overriding processes/README.txt=src/main/resources/processes/README.txt,axis2.xml=src/main/resources/axis2.xml,META-INF/spring/ode-axis2.xml=src/main/resources/META-INF/spring/ode-axis2.xml,META-INF/NOTICE=target/maven-shared-archive-resources/META-INF/NOTICE,META-INF/DEPENDENCIES=target/maven-shared-archive-resources/META-INF/DEPENDENCIES,META-INF/LICENSE=target/maven-shared-archive-resources/META-INF/LICENSE,META-INF/NOTICE=target/maven-shared-archive-resources/META-INF/NOTICE,META-INF/DEPENDENCIES=target/maven-shared-archive-resources/META-INF/DEPENDENCIES,META-INF/LICENSE=target/maven-shared-archive-resources/META-INF/LICENSE
with src/main/resources,@../dao-jpa-ojpa-derby/target/ode-dao-jpa-ojpa-derby-1.4-SNAPSHOT.zip,@../dao-hibernate-db/target/ode-dao-hibernate-db-1.4-SNAPSHOT.zip,
(add {maven-resources} if you want to include the maven resources)
[WARNING] Warning building bundle org.apache.ode:ode-axis2-bundle:bundle:1.4-SNAPSHOT : There
are split packages, use directive -split-package:=(merge-first|merge-last) on instruction
to get rid of this warning: org.apache.ode.axis2, classpath: [Jar:., Jar:ode-axis2, Jar:ode-bpel-compiler,
Jar:ode-utils, Jar:axiom-api, Jar:geronimo-activation_1.1_spec, Jar:geronimo-javamail_1.4_spec,
Jar:commons-logging, Jar:servlet-api, Jar:jaxen, Jar:xml-apis, Jar:xercesImpl, Jar:geronimo-stax-api_1.0_spec,
Jar:axiom-impl, Jar:wstx-asl, Jar:axiom-dom, Jar:wsdl4j, Jar:commons-collections, Jar:commons-httpclient,
Jar:commons-codec, Jar:log4j, Jar:xstream, Jar:xpp3_min, Jar:axis2-adb, Jar:axis2-kernel,
Jar:geronimo-ws-metadata_2.0_spec, Jar:geronimo-jta_1.1_spec, Jar:commons-fileupload, Jar:XmlSchema,
Jar:neethi, Jar:woden-api, Jar:ant, Jar:ant-launcher, Jar:xmlParserAPIs, Jar:woden-impl-dom,
Jar:mail, Jar:activation, Jar:xalan, Jar:serializer, Jar:commons-io, Jar:axis2-codegen, Jar:axis2-java2wsdl,
Jar:axis2-transport-http, Jar:httpcore, Jar:axis2-transport-local, Jar:axis2-saaj, Jar:geronimo-saaj_1.3_spec,
Jar:axis2-transport-jms, Jar:axis2-transport-base, Jar:geronimo-jms_1.1_spec, Jar:geronimo-jta_1.0.1B_spec,
Jar:saxon, Jar:saxon-dom, Jar:saxon-xqj, Jar:saxon-xpath, Jar:commons-lang, Jar:junit, Jar:ode-bpel-api,
Jar:ode-bpel-schemas, Jar:xmlbeans, Jar:stax-api, Jar:ode-bpel-obj, Jar:logkit, Jar:avalon-framework,
Jar:dom4j, Jar:jdom, Jar:xom, Jar:icu4j, Jar:persistence-api, Jar:ode-bpel-connector, Jar:ode-bpel-api-jca,
Jar:geronimo-j2ee-connector_1.5_spec, Jar:ode-bpel-runtime, Jar:slf4j-log4j12, Jar:slf4j-api,
Jar:ode-bpel-dao, Jar:ode-bpel-store, Jar:ode-bpel-epr, Jar:derby, Jar:geronimo-connector,
Jar:geronimo-transaction, Jar:howl, Jar:jencks, Jar:spring-aop, Jar:aopalliance, Jar:spring-beans,
Jar:spring-core, Jar:spring-jms, Jar:commons-pool, Jar:spring-context, Jar:spring-dao, Jar:spring-support,
Jar:xapool-without-pool, Jar:commons-beanutils, Jar:ode-dao-hibernate, Jar:ode-bpel-ql, Jar:hibernate-core,
Jar:antlr, Jar:jta, Jar:ode-dao-jpa, Jar:openjpa, Jar:serp, Jar:geronimo-jpa_3.0_spec, Jar:javassist,
Jar:hsqldb, Jar:spring, Jar:ode-jacob, Jar:ode-agents, Jar:ode-jca-ra, Jar:ode-jca-server,
Jar:ode-tools, Jar:ant, Jar:ode-scheduler-simple, Jar:tranql-connector, Jar:geronimo-spec-j2ee-connector,
Jar:geronimo-spec-jta, Jar:axion, Jar:commons-primitives, Jar:javacc, Jar:regexp, Jar:rampart-core,
Jar:rampart-policy, Jar:mex, Jar:axis2-mtompolicy, Jar:wss4j, Jar:xmlsec, Jar:opensaml, Jar:opensaml,
Jar:openws, Jar:xmltooling, Jar:jcl-over-slf4j, Jar:log4j-over-slf4j, Jar:joda-time, Jar:bcprov-ext-jdk15,
Jar:not-yet-commons-ssl, Jar:jcip-annotations, Jar:jargs, Jar:velocity, Jar:slf4j-jdk14, Jar:bcprov-jdk15,
Jar:rampart-trust, Jar:org.osgi.core, Jar:spring-osgi-core, Jar:spring-osgi-io, Jar:org.springframework.aop,
Jar:com.springsource.org.aopalliance, Jar:org.springframework.beans, Jar:org.springframework.core,
Jar:org.springframework.context] from: <https://hudson.apache.org/hudson/job/ODE-trunk-maven2-jdk5/ws/trunk/axis2/target/ode-axis2-1.4-SNAPSHOT.jar>
[WARNING] Warning building bundle org.apache.ode:ode-axis2-bundle:bundle:1.4-SNAPSHOT : There
are split packages, use directive -split-package:=(merge-first|merge-last) on instruction
to get rid of this warning: org.apache.ode.bpel.pmapi, classpath: [Jar:., Jar:ode-axis2, Jar:ode-bpel-compiler,
Jar:ode-utils, Jar:axiom-api, Jar:geronimo-activation_1.1_spec, Jar:geronimo-javamail_1.4_spec,
Jar:commons-logging, Jar:servlet-api, Jar:jaxen, Jar:xml-apis, Jar:xercesImpl, Jar:geronimo-stax-api_1.0_spec,
Jar:axiom-impl, Jar:wstx-asl, Jar:axiom-dom, Jar:wsdl4j, Jar:commons-collections, Jar:commons-httpclient,
Jar:commons-codec, Jar:log4j, Jar:xstream, Jar:xpp3_min, Jar:axis2-adb, Jar:axis2-kernel,
Jar:geronimo-ws-metadata_2.0_spec, Jar:geronimo-jta_1.1_spec, Jar:commons-fileupload, Jar:XmlSchema,
Jar:neethi, Jar:woden-api, Jar:ant, Jar:ant-launcher, Jar:xmlParserAPIs, Jar:woden-impl-dom,
Jar:mail, Jar:activation, Jar:xalan, Jar:serializer, Jar:commons-io, Jar:axis2-codegen, Jar:axis2-java2wsdl,
Jar:axis2-transport-http, Jar:httpcore, Jar:axis2-transport-local, Jar:axis2-saaj, Jar:geronimo-saaj_1.3_spec,
Jar:axis2-transport-jms, Jar:axis2-transport-base, Jar:geronimo-jms_1.1_spec, Jar:geronimo-jta_1.0.1B_spec,
Jar:saxon, Jar:saxon-dom, Jar:saxon-xqj, Jar:saxon-xpath, Jar:commons-lang, Jar:junit, Jar:ode-bpel-api,
Jar:ode-bpel-schemas, Jar:xmlbeans, Jar:stax-api, Jar:ode-bpel-obj, Jar:logkit, Jar:avalon-framework,
Jar:dom4j, Jar:jdom, Jar:xom, Jar:icu4j, Jar:persistence-api, Jar:ode-bpel-connector, Jar:ode-bpel-api-jca,
Jar:geronimo-j2ee-connector_1.5_spec, Jar:ode-bpel-runtime, Jar:slf4j-log4j12, Jar:slf4j-api,
Jar:ode-bpel-dao, Jar:ode-bpel-store, Jar:ode-bpel-epr, Jar:derby, Jar:geronimo-connector,
Jar:geronimo-transaction, Jar:howl, Jar:jencks, Jar:spring-aop, Jar:aopalliance, Jar:spring-beans,
Jar:spring-core, Jar:spring-jms, Jar:commons-pool, Jar:spring-context, Jar:spring-dao, Jar:spring-support,
Jar:xapool-without-pool, Jar:commons-beanutils, Jar:ode-dao-hibernate, Jar:ode-bpel-ql, Jar:hibernate-core,
Jar:antlr, Jar:jta, Jar:ode-dao-jpa, Jar:openjpa, Jar:serp, Jar:geronimo-jpa_3.0_spec, Jar:javassist,
Jar:hsqldb, Jar:spring, Jar:ode-jacob, Jar:ode-agents, Jar:ode-jca-ra, Jar:ode-jca-server,
Jar:ode-tools, Jar:ant, Jar:ode-scheduler-simple, Jar:tranql-connector, Jar:geronimo-spec-j2ee-connector,
Jar:geronimo-spec-jta, Jar:axion, Jar:commons-primitives, Jar:javacc, Jar:regexp, Jar:rampart-core,
Jar:rampart-policy, Jar:mex, Jar:axis2-mtompolicy, Jar:wss4j, Jar:xmlsec, Jar:opensaml, Jar:opensaml,
Jar:openws, Jar:xmltooling, Jar:jcl-over-slf4j, Jar:log4j-over-slf4j, Jar:joda-time, Jar:bcprov-ext-jdk15,
Jar:not-yet-commons-ssl, Jar:jcip-annotations, Jar:jargs, Jar:velocity, Jar:slf4j-jdk14, Jar:bcprov-jdk15,
Jar:rampart-trust, Jar:org.osgi.core, Jar:spring-osgi-core, Jar:spring-osgi-io, Jar:org.springframework.aop,
Jar:com.springsource.org.aopalliance, Jar:org.springframework.beans, Jar:org.springframework.core,
Jar:org.springframework.context] from: <https://hudson.apache.org/hudson/job/ODE-trunk-maven2-jdk5/ws/trunk/bpel-schemas/target/ode-bpel-schemas-1.4-SNAPSHOT.jar>
[WARNING] Warning building bundle org.apache.ode:ode-axis2-bundle:bundle:1.4-SNAPSHOT : Did
not find matching referal for !com.sun.mirror*
[WARNING] Warning building bundle org.apache.ode:ode-axis2-bundle:bundle:1.4-SNAPSHOT : Did
not find matching referal for !junit.framework*
[HUDSON] Archiving <https://hudson.apache.org/hudson/job/ODE-trunk-maven2-jdk5/ws/trunk/axis2-bundle/pom.xml>
to /home/hudson/hudson/jobs/ODE-trunk-maven2-jdk5/modules/org.apache.ode$ode-axis2-bundle/builds/2011-01-06_19-07-50/archive/org.apache.ode/ode-axis2-bundle/1.4-SNAPSHOT/pom.xml
[HUDSON] Archiving <https://hudson.apache.org/hudson/job/ODE-trunk-maven2-jdk5/ws/trunk/axis2-bundle/target/ode-axis2-bundle-1.4-SNAPSHOT.jar>
to /home/hudson/hudson/jobs/ODE-trunk-maven2-jdk5/modules/org.apache.ode$ode-axis2-bundle/builds/2011-01-06_19-07-50/archive/org.apache.ode/ode-axis2-bundle/1.4-SNAPSHOT/ode-axis2-bundle-1.4-SNAPSHOT.jar
[INFO] ------------------------------------------------------------------------
[INFO] Building ODE :: JBI Distribution
[INFO]    task-segment: [clean, test, integration-test]
[INFO] ------------------------------------------------------------------------
[INFO] [clean:clean {execution: default-clean}]
[INFO] Deleting file set: <https://hudson.apache.org/hudson/job/ODE-trunk-maven2-jdk5/ws/trunk/jbi/target>
(included: [**], excluded: [])
[INFO] [remote-resources:process {execution: default}]
Downloading: https://repository.apache.org/content/groups/public/org/apache/ws/security/wss4j/1.5.2/wss4j-1.5.2.pom
[INFO] Unable to find resource 'org.apache.ws.security:wss4j:pom:1.5.2' in repository servicemix-repo
(https://repository.apache.org/content/groups/public)
Downloading: http://people.apache.org/~rr/saxon-repo/org/apache/ws/security/wss4j/1.5.2/wss4j-1.5.2.pom
[INFO] Unable to find resource 'org.apache.ws.security:wss4j:pom:1.5.2' in repository saxon-repo
(http://people.apache.org/~rr/saxon-repo)
Downloading: http://repo1.maven.org/maven2//org/apache/ws/security/wss4j/1.5.2/wss4j-1.5.2.pom
[INFO] Unable to find resource 'org.apache.ws.security:wss4j:pom:1.5.2' in repository central
(http://repo1.maven.org/maven2/)
Downloading: http://repository.jboss.org/nexus/content/groups/public//org/apache/ws/security/wss4j/1.5.2/wss4j-1.5.2.pom
[INFO] Unable to find resource 'org.apache.ws.security:wss4j:pom:1.5.2' in repository jboss-public-repository-group
(http://repository.jboss.org/nexus/content/groups/public/)
Downloading: http://svn.apache.org/repos/asf/servicemix/m2-repo//org/apache/ws/security/wss4j/1.5.2/wss4j-1.5.2.pom
[INFO] Unable to find resource 'org.apache.ws.security:wss4j:pom:1.5.2' in repository servicemix-m2-repo
(http://svn.apache.org/repos/asf/servicemix/m2-repo/)
[INFO] [resources:resources {execution: default-resources}]
[INFO] Using 'UTF-8' encoding to copy filtered resources.
[INFO] Copying 1 resource
[INFO] Copying 3 resources
[INFO] [jbi:generate-jbi-component-descriptor {execution: jbi-generation}]
[INFO] Generating jbi.xml
[WARNING] POM for 'tranql:tranql-connector-derby-common:pom:1.1:test' is invalid.

Its dependencies (if any) will NOT be available to the current build.
[INFO] [compiler:compile {execution: default-compile}]
[INFO] Compiling 33 source files to <https://hudson.apache.org/hudson/job/ODE-trunk-maven2-jdk5/ws/trunk/jbi/target/classes>
[INFO] [resources:testResources {execution: default-testResources}]
[INFO] Using 'UTF-8' encoding to copy filtered resources.
[INFO] Copying 108 resources
[INFO] Copying 1 resource to ../test/smx/ode
[INFO] Copying 1 resource to ../test/smx/ode
[INFO] Copying 3 resources
[INFO] [resources:copy-resources {execution: copy-resources}]
[INFO] Using 'UTF-8' encoding to copy filtered resources.
[INFO] Copying 169 resources
[INFO] Copying 153 resources
[INFO] [resources:copy-resources {execution: copy-resources2}]
[INFO] Using 'UTF-8' encoding to copy filtered resources.
[INFO] Copying 108 resources
[INFO] [compiler:testCompile {execution: default-testCompile}]
[INFO] Compiling 14 source files to <https://hudson.apache.org/hudson/job/ODE-trunk-maven2-jdk5/ws/trunk/jbi/target/test-classes>
[INFO] [surefire:test {execution: default-test}]
[INFO] Surefire report directory: <https://hudson.apache.org/hudson/job/ODE-trunk-maven2-jdk5/ws/trunk/jbi/target/surefire-reports>

-------------------------------------------------------
 T E S T S
-------------------------------------------------------
Running org.apache.ode.jbi.CommunicationJbiTest
Tests run: 1, Failures: 0, Errors: 0, Skipped: 0, Time elapsed: 29.181 sec
Running org.apache.ode.jbi.msgmap.JbiWsdl11WrapperMapperTest
Retrieving document at '<https://hudson.apache.org/hudson/job/ODE-trunk-maven2-jdk5/ws/trunk/jbi/target/test-classes/test.wsdl'.>
Tests run: 1, Failures: 0, Errors: 0, Skipped: 0, Time elapsed: 0.024 sec
Running org.apache.ode.jbi.OdeJbiComponentLifeCycleTest
Tests run: 1, Failures: 0, Errors: 0, Skipped: 1, Time elapsed: 0.006 sec
Running org.apache.ode.jbi.MagicSessionJbiTest
Tests run: 1, Failures: 0, Errors: 0, Skipped: 0, Time elapsed: 5.228 sec
Running org.apache.ode.jbi.MagicSessionExternalJbiTest
Tests run: 1, Failures: 0, Errors: 0, Skipped: 0, Time elapsed: 4.31 sec
Running org.apache.ode.jbi.ExtVarJbiTest
Tests run: 1, Failures: 0, Errors: 0, Skipped: 0, Time elapsed: 7.528 sec
Running org.apache.ode.jbi.SpringPropertiesJbiTest
Tests run: 1, Failures: 0, Errors: 0, Skipped: 0, Time elapsed: 2.189 sec
Running org.apache.ode.jbi.EmptyRespJbiTest
Tests run: 1, Failures: 0, Errors: 0, Skipped: 0, Time elapsed: 3.458 sec
Running org.apache.ode.jbi.RetireJbiTest
Tests run: 1, Failures: 0, Errors: 0, Skipped: 0, Time elapsed: 3.355 sec
Running org.apache.ode.jbi.ReplayerJbiTest
Tests run: 1, Failures: 0, Errors: 0, Skipped: 0, Time elapsed: 11.047 sec
Running org.apache.ode.jbi.HelloWorldJbiTest
Tests run: 1, Failures: 0, Errors: 0, Skipped: 0, Time elapsed: 1.891 sec

Results :

Tests run: 11, Failures: 0, Errors: 0, Skipped: 1

[HUDSON] Recording test results
[INFO] [remote-resources:process {execution: default}]
[INFO] [resources:resources {execution: default-resources}]
[INFO] Using 'UTF-8' encoding to copy filtered resources.
[INFO] Copying 1 resource
[INFO] Copying 3 resources
[INFO] Copying 3 resources
[INFO] [jbi:generate-jbi-component-descriptor {execution: jbi-generation}]
[INFO] Generating jbi.xml
[WARNING] POM for 'tranql:tranql-connector-derby-common:pom:1.1:test' is invalid.

Its dependencies (if any) will NOT be available to the current build.
[INFO] [compiler:compile {execution: default-compile}]
[INFO] Nothing to compile - all classes are up to date
[INFO] [resources:testResources {execution: default-testResources}]
[INFO] Using 'UTF-8' encoding to copy filtered resources.
[INFO] Copying 108 resources
[INFO] Copying 1 resource to ../test/smx/ode
[INFO] Copying 1 resource to ../test/smx/ode
[INFO] Copying 3 resources
[INFO] Copying 3 resources
[INFO] [resources:copy-resources {execution: copy-resources}]
[INFO] Using 'UTF-8' encoding to copy filtered resources.
[INFO] Copying 169 resources
[INFO] Copying 153 resources
[INFO] [resources:copy-resources {execution: copy-resources2}]
[INFO] Using 'UTF-8' encoding to copy filtered resources.
[INFO] Copying 108 resources
[INFO] [compiler:testCompile {execution: default-testCompile}]
[INFO] Nothing to compile - all classes are up to date
[INFO] [surefire:test {execution: default-test}]
[INFO] Surefire report directory: <https://hudson.apache.org/hudson/job/ODE-trunk-maven2-jdk5/ws/trunk/jbi/target/surefire-reports>

-------------------------------------------------------
 T E S T S
-------------------------------------------------------
Running org.apache.ode.jbi.CommunicationJbiTest
Tests run: 1, Failures: 0, Errors: 0, Skipped: 0, Time elapsed: 25.77 sec
Running org.apache.ode.jbi.msgmap.JbiWsdl11WrapperMapperTest
Retrieving document at '<https://hudson.apache.org/hudson/job/ODE-trunk-maven2-jdk5/ws/trunk/jbi/target/test-classes/test.wsdl'.>
Tests run: 1, Failures: 0, Errors: 0, Skipped: 0, Time elapsed: 0.027 sec
Running org.apache.ode.jbi.OdeJbiComponentLifeCycleTest
Tests run: 1, Failures: 0, Errors: 0, Skipped: 1, Time elapsed: 0.009 sec
Running org.apache.ode.jbi.MagicSessionJbiTest
Tests run: 1, Failures: 0, Errors: 0, Skipped: 0, Time elapsed: 6.051 sec
Running org.apache.ode.jbi.MagicSessionExternalJbiTest
Tests run: 1, Failures: 0, Errors: 0, Skipped: 0, Time elapsed: 3.89 sec
Running org.apache.ode.jbi.ExtVarJbiTest
Tests run: 1, Failures: 0, Errors: 0, Skipped: 0, Time elapsed: 3.709 sec
Running org.apache.ode.jbi.SpringPropertiesJbiTest
Tests run: 1, Failures: 0, Errors: 0, Skipped: 0, Time elapsed: 2.918 sec
Running org.apache.ode.jbi.EmptyRespJbiTest
Tests run: 1, Failures: 0, Errors: 0, Skipped: 0, Time elapsed: 3.008 sec
Running org.apache.ode.jbi.RetireJbiTest
Tests run: 1, Failures: 1, Errors: 0, Skipped: 0, Time elapsed: 3.657 sec <<< FAILURE!
Running org.apache.ode.jbi.ReplayerJbiTest
Tests run: 1, Failures: 0, Errors: 0, Skipped: 0, Time elapsed: 14.144 sec
Running org.apache.ode.jbi.HelloWorldJbiTest
Tests run: 1, Failures: 0, Errors: 0, Skipped: 0, Time elapsed: 2.148 sec

Results :

Failed tests: 
  testRetire(org.apache.ode.jbi.RetireJbiTest)

Tests run: 11, Failures: 1, Errors: 0, Skipped: 1

[ERROR] There are test failures.

Please refer to <https://hudson.apache.org/hudson/job/ODE-trunk-maven2-jdk5/ws/trunk/jbi/target/surefire-reports>
for the individual test results.
[HUDSON] Recording test results
[INFO] [jar:jar {execution: default-jar}]
[INFO] Building jar: <https://hudson.apache.org/hudson/job/ODE-trunk-maven2-jdk5/ws/trunk/jbi/target/ode-jbi-1.4-SNAPSHOT.jar>
[INFO] [assembly:single {execution: jbi-package}]
[INFO] Reading assembly descriptor: src/main/assembly/bin.xml
[INFO]  already added, skipping
[INFO] Building zip: <https://hudson.apache.org/hudson/job/ODE-trunk-maven2-jdk5/ws/trunk/jbi/target/ode-jbi-1.4-SNAPSHOT.zip>
[INFO]  already added, skipping
[HUDSON] Archiving <https://hudson.apache.org/hudson/job/ODE-trunk-maven2-jdk5/ws/trunk/jbi/pom.xml>
to /home/hudson/hudson/jobs/ODE-trunk-maven2-jdk5/modules/org.apache.ode$ode-jbi/builds/2011-01-06_19-07-50/archive/org.apache.ode/ode-jbi/1.4-SNAPSHOT/pom.xml
[HUDSON] Archiving <https://hudson.apache.org/hudson/job/ODE-trunk-maven2-jdk5/ws/trunk/jbi/target/ode-jbi-1.4-SNAPSHOT.jar>
to /home/hudson/hudson/jobs/ODE-trunk-maven2-jdk5/modules/org.apache.ode$ode-jbi/builds/2011-01-06_19-07-50/archive/org.apache.ode/ode-jbi/1.4-SNAPSHOT/ode-jbi-1.4-SNAPSHOT.jar
[HUDSON] Archiving <https://hudson.apache.org/hudson/job/ODE-trunk-maven2-jdk5/ws/trunk/jbi/target/ode-jbi-1.4-SNAPSHOT.zip>
to /home/hudson/hudson/jobs/ODE-trunk-maven2-jdk5/modules/org.apache.ode$ode-jbi/builds/2011-01-06_19-07-50/archive/org.apache.ode/ode-jbi/1.4-SNAPSHOT/ode-jbi-1.4-SNAPSHOT.zip
[INFO] ------------------------------------------------------------------------
[INFO] Building ODE :: JBI Bundle
[INFO]    task-segment: [clean, test, integration-test]
[INFO] ------------------------------------------------------------------------
[INFO] [clean:clean {execution: default-clean}]
[INFO] Deleting file set: <https://hudson.apache.org/hudson/job/ODE-trunk-maven2-jdk5/ws/trunk/jbi-bundle/target>
(included: [**], excluded: [])
[INFO] [remote-resources:process {execution: default}]
Downloading: https://repository.apache.org/content/groups/public/org/osgi/org.osgi.compendium/4.2.0/org.osgi.compendium-4.2.0.pom
[INFO] Unable to find resource 'org.osgi:org.osgi.compendium:pom:4.2.0' in repository servicemix-repo
(https://repository.apache.org/content/groups/public)
Downloading: http://people.apache.org/~rr/saxon-repo/org/osgi/org.osgi.compendium/4.2.0/org.osgi.compendium-4.2.0.pom
[INFO] Unable to find resource 'org.osgi:org.osgi.compendium:pom:4.2.0' in repository saxon-repo
(http://people.apache.org/~rr/saxon-repo)
Downloading: http://repo1.maven.org/maven2//org/osgi/org.osgi.compendium/4.2.0/org.osgi.compendium-4.2.0.pom

Downloading: https://repository.apache.org/content/groups/public/org/osgi/org.osgi.compendium/4.2.0/org.osgi.compendium-4.2.0.jar
[INFO] Unable to find resource 'org.osgi:org.osgi.compendium:jar:4.2.0' in repository servicemix-repo
(https://repository.apache.org/content/groups/public)
Downloading: http://people.apache.org/~rr/saxon-repo/org/osgi/org.osgi.compendium/4.2.0/org.osgi.compendium-4.2.0.jar
[INFO] Unable to find resource 'org.osgi:org.osgi.compendium:jar:4.2.0' in repository saxon-repo
(http://people.apache.org/~rr/saxon-repo)
Downloading: http://repo1.maven.org/maven2//org/osgi/org.osgi.compendium/4.2.0/org.osgi.compendium-4.2.0.jar

[INFO] [resources:resources {execution: default-resources}]
[INFO] Using 'UTF-8' encoding to copy filtered resources.
[INFO] Copying 2 resources
[INFO] Copying 3 resources
[INFO] [compiler:compile {execution: default-compile}]
[INFO] Compiling 5 source files to <https://hudson.apache.org/hudson/job/ODE-trunk-maven2-jdk5/ws/trunk/jbi-bundle/target/classes>
[HUDSON] Archiving <https://hudson.apache.org/hudson/job/ODE-trunk-maven2-jdk5/ws/trunk/jbi-bundle/pom.xml>
to /home/hudson/hudson/jobs/ODE-trunk-maven2-jdk5/modules/org.apache.ode$ode-jbi-bundle/builds/2011-01-06_19-07-50/archive/org.apache.ode/ode-jbi-bundle/1.4-SNAPSHOT/pom.xml
[INFO] ------------------------------------------------------------------------
[ERROR] BUILD FAILURE
[INFO] ------------------------------------------------------------------------
[INFO] Compilation failure

<https://hudson.apache.org/hudson/job/ODE-trunk-maven2-jdk5/ws/trunk/jbi-bundle/src/main/java/org/apache/ode/jbi/osgi/deployer/OdeExtenderImpl.java>:[56,5]
method does not override a method from its superclass

<https://hudson.apache.org/hudson/job/ODE-trunk-maven2-jdk5/ws/trunk/jbi-bundle/src/main/java/org/apache/ode/jbi/osgi/deployer/OdeExtenderImpl.java>:[61,5]
method does not override a method from its superclass

<https://hudson.apache.org/hudson/job/ODE-trunk-maven2-jdk5/ws/trunk/jbi-bundle/src/main/java/org/apache/ode/jbi/osgi/deployer/OdeExtenderImpl.java>:[74,5]
method does not override a method from its superclass

<https://hudson.apache.org/hudson/job/ODE-trunk-maven2-jdk5/ws/trunk/jbi-bundle/src/main/java/org/apache/ode/jbi/osgi/deployer/OdeExtenderImpl.java>:[86,5]
method does not override a method from its superclass

<https://hudson.apache.org/hudson/job/ODE-trunk-maven2-jdk5/ws/trunk/jbi-bundle/src/main/java/org/apache/ode/jbi/osgi/deployer/OdeExtenderImpl.java>:[132,9]
method does not override a method from its superclass

<https://hudson.apache.org/hudson/job/ODE-trunk-maven2-jdk5/ws/trunk/jbi-bundle/src/main/java/org/apache/ode/jbi/osgi/deployer/OdeExtenderImpl.java>:[136,9]
method does not override a method from its superclass

<https://hudson.apache.org/hudson/job/ODE-trunk-maven2-jdk5/ws/trunk/jbi-bundle/src/main/java/org/apache/ode/jbi/osgi/deployer/OdeExtenderImpl.java>:[192,9]
method does not override a method from its superclass

<https://hudson.apache.org/hudson/job/ODE-trunk-maven2-jdk5/ws/trunk/jbi-bundle/src/main/java/org/apache/ode/jbi/osgi/deployer/OdeExtenderImpl.java>:[225,9]
method does not override a method from its superclass

<https://hudson.apache.org/hudson/job/ODE-trunk-maven2-jdk5/ws/trunk/jbi-bundle/src/main/java/org/apache/ode/jbi/osgi/deployer/OdeDeployedBundle.java>:[144,29]
method does not override a method from its superclass


[INFO] ------------------------------------------------------------------------
[INFO] For more information, run Maven with the -e switch
[INFO] ------------------------------------------------------------------------
[INFO] Total time: 31 minutes 8 seconds
[INFO] Finished at: Thu Jan 06 14:39:04 EST 2011
[INFO] Final Memory: 103M/329M
[INFO] ------------------------------------------------------------------------
Sending e-mails to: dev@ode.apache.org vanto@apache.org
Sending e-mails to: dev@ode.apache.org vanto@apache.org
channel stopped
[locks-and-latches] Releasing all the locks
[locks-and-latches] All the locks released


Mime
View raw message