nutch-dev mailing list archives

Site index · List index
Message view « Date » · « Thread »
Top « Date » · « Thread »
From Apache Jenkins Server <jenk...@builds.apache.org>
Subject Build failed in Jenkins: Nutch-trunk #1650
Date Wed, 02 Nov 2011 11:31:32 GMT
See <https://builds.apache.org/job/Nutch-trunk/1650/changes>

Changes:

[lewismc] commit to add (hopefully) final configuration parameters to ant sonar target

------------------------------------------
[...truncated 2847 lines...]
deps-test:

deploy:
     [copy] Copying 1 file to /zonestorage/hudson_solaris/home/hudson/hudson-slave/workspace/Nutch-trunk/trunk/build/plugins/urlfilter-validator

copy-generated-lib:
     [copy] Copying 1 file to /zonestorage/hudson_solaris/home/hudson/hudson-slave/workspace/Nutch-trunk/trunk/build/plugins/urlfilter-validator

init:
    [mkdir] Created dir: /zonestorage/hudson_solaris/home/hudson/hudson-slave/workspace/Nutch-trunk/trunk/build/urlmeta
    [mkdir] Created dir: /zonestorage/hudson_solaris/home/hudson/hudson-slave/workspace/Nutch-trunk/trunk/build/urlmeta/classes
    [mkdir] Created dir: /zonestorage/hudson_solaris/home/hudson/hudson-slave/workspace/Nutch-trunk/trunk/build/urlmeta/test
    [mkdir] Created dir: /zonestorage/hudson_solaris/home/hudson/hudson-slave/workspace/Nutch-trunk/trunk/build/plugins/urlmeta

init-plugin:

deps-jar:

clean-lib:

resolve-default:
[ivy:resolve] :: loading settings :: file = /zonestorage/hudson_solaris/home/hudson/hudson-slave/workspace/Nutch-trunk/trunk/ivy/ivysettings.xml

compile:
     [echo] Compiling plugin: urlmeta
    [javac] /zonestorage/hudson_solaris/home/hudson/hudson-slave/workspace/Nutch-trunk/trunk/src/plugin/build-plugin.xml:117:
warning: 'includeantruntime' was not set, defaulting to build.sysclasspath=last; set to false
for repeatable builds
    [javac] Compiling 2 source files to /zonestorage/hudson_solaris/home/hudson/hudson-slave/workspace/Nutch-trunk/trunk/build/urlmeta/classes

jar:
      [jar] Building jar: /zonestorage/hudson_solaris/home/hudson/hudson-slave/workspace/Nutch-trunk/trunk/build/urlmeta/urlmeta.jar

deps-test:

deploy:
     [copy] Copying 1 file to /zonestorage/hudson_solaris/home/hudson/hudson-slave/workspace/Nutch-trunk/trunk/build/plugins/urlmeta

copy-generated-lib:
     [copy] Copying 1 file to /zonestorage/hudson_solaris/home/hudson/hudson-slave/workspace/Nutch-trunk/trunk/build/plugins/urlmeta

init:
    [mkdir] Created dir: /zonestorage/hudson_solaris/home/hudson/hudson-slave/workspace/Nutch-trunk/trunk/build/urlnormalizer-basic
    [mkdir] Created dir: /zonestorage/hudson_solaris/home/hudson/hudson-slave/workspace/Nutch-trunk/trunk/build/urlnormalizer-basic/classes
    [mkdir] Created dir: /zonestorage/hudson_solaris/home/hudson/hudson-slave/workspace/Nutch-trunk/trunk/build/urlnormalizer-basic/test
    [mkdir] Created dir: /zonestorage/hudson_solaris/home/hudson/hudson-slave/workspace/Nutch-trunk/trunk/build/plugins/urlnormalizer-basic

init-plugin:

deps-jar:

clean-lib:

resolve-default:
[ivy:resolve] :: loading settings :: file = /zonestorage/hudson_solaris/home/hudson/hudson-slave/workspace/Nutch-trunk/trunk/ivy/ivysettings.xml

compile:
     [echo] Compiling plugin: urlnormalizer-basic
    [javac] /zonestorage/hudson_solaris/home/hudson/hudson-slave/workspace/Nutch-trunk/trunk/src/plugin/build-plugin.xml:117:
warning: 'includeantruntime' was not set, defaulting to build.sysclasspath=last; set to false
for repeatable builds
    [javac] Compiling 1 source file to /zonestorage/hudson_solaris/home/hudson/hudson-slave/workspace/Nutch-trunk/trunk/build/urlnormalizer-basic/classes

jar:
      [jar] Building jar: /zonestorage/hudson_solaris/home/hudson/hudson-slave/workspace/Nutch-trunk/trunk/build/urlnormalizer-basic/urlnormalizer-basic.jar

deps-test:

deploy:
     [copy] Copying 1 file to /zonestorage/hudson_solaris/home/hudson/hudson-slave/workspace/Nutch-trunk/trunk/build/plugins/urlnormalizer-basic

copy-generated-lib:
     [copy] Copying 1 file to /zonestorage/hudson_solaris/home/hudson/hudson-slave/workspace/Nutch-trunk/trunk/build/plugins/urlnormalizer-basic

init:
    [mkdir] Created dir: /zonestorage/hudson_solaris/home/hudson/hudson-slave/workspace/Nutch-trunk/trunk/build/urlnormalizer-pass
    [mkdir] Created dir: /zonestorage/hudson_solaris/home/hudson/hudson-slave/workspace/Nutch-trunk/trunk/build/urlnormalizer-pass/classes
    [mkdir] Created dir: /zonestorage/hudson_solaris/home/hudson/hudson-slave/workspace/Nutch-trunk/trunk/build/urlnormalizer-pass/test
    [mkdir] Created dir: /zonestorage/hudson_solaris/home/hudson/hudson-slave/workspace/Nutch-trunk/trunk/build/plugins/urlnormalizer-pass

init-plugin:

deps-jar:

clean-lib:

resolve-default:
[ivy:resolve] :: loading settings :: file = /zonestorage/hudson_solaris/home/hudson/hudson-slave/workspace/Nutch-trunk/trunk/ivy/ivysettings.xml

compile:
     [echo] Compiling plugin: urlnormalizer-pass
    [javac] /zonestorage/hudson_solaris/home/hudson/hudson-slave/workspace/Nutch-trunk/trunk/src/plugin/build-plugin.xml:117:
warning: 'includeantruntime' was not set, defaulting to build.sysclasspath=last; set to false
for repeatable builds
    [javac] Compiling 1 source file to /zonestorage/hudson_solaris/home/hudson/hudson-slave/workspace/Nutch-trunk/trunk/build/urlnormalizer-pass/classes

jar:
      [jar] Building jar: /zonestorage/hudson_solaris/home/hudson/hudson-slave/workspace/Nutch-trunk/trunk/build/urlnormalizer-pass/urlnormalizer-pass.jar

deps-test:

deploy:
     [copy] Copying 1 file to /zonestorage/hudson_solaris/home/hudson/hudson-slave/workspace/Nutch-trunk/trunk/build/plugins/urlnormalizer-pass

copy-generated-lib:
     [copy] Copying 1 file to /zonestorage/hudson_solaris/home/hudson/hudson-slave/workspace/Nutch-trunk/trunk/build/plugins/urlnormalizer-pass
    [mkdir] Created dir: /zonestorage/hudson_solaris/home/hudson/hudson-slave/workspace/Nutch-trunk/trunk/build/urlnormalizer-regex/test/data
     [copy] Copying 4 files to /zonestorage/hudson_solaris/home/hudson/hudson-slave/workspace/Nutch-trunk/trunk/build/urlnormalizer-regex/test/data

init:
    [mkdir] Created dir: /zonestorage/hudson_solaris/home/hudson/hudson-slave/workspace/Nutch-trunk/trunk/build/urlnormalizer-regex/classes
    [mkdir] Created dir: /zonestorage/hudson_solaris/home/hudson/hudson-slave/workspace/Nutch-trunk/trunk/build/plugins/urlnormalizer-regex

init-plugin:

deps-jar:

clean-lib:

resolve-default:
[ivy:resolve] :: loading settings :: file = /zonestorage/hudson_solaris/home/hudson/hudson-slave/workspace/Nutch-trunk/trunk/ivy/ivysettings.xml

compile:
     [echo] Compiling plugin: urlnormalizer-regex
    [javac] /zonestorage/hudson_solaris/home/hudson/hudson-slave/workspace/Nutch-trunk/trunk/src/plugin/build-plugin.xml:117:
warning: 'includeantruntime' was not set, defaulting to build.sysclasspath=last; set to false
for repeatable builds
    [javac] Compiling 1 source file to /zonestorage/hudson_solaris/home/hudson/hudson-slave/workspace/Nutch-trunk/trunk/build/urlnormalizer-regex/classes
    [javac] Note: /zonestorage/hudson_solaris/home/hudson/hudson-slave/workspace/Nutch-trunk/trunk/src/plugin/urlnormalizer-regex/src/java/org/apache/nutch/net/urlnormalizer/regex/RegexURLNormalizer.java
uses unchecked or unsafe operations.
    [javac] Note: Recompile with -Xlint:unchecked for details.

jar:
      [jar] Building jar: /zonestorage/hudson_solaris/home/hudson/hudson-slave/workspace/Nutch-trunk/trunk/build/urlnormalizer-regex/urlnormalizer-regex.jar

deps-test:

init:

init-plugin:

clean-lib:

resolve-default:
[ivy:resolve] :: loading settings :: file = /zonestorage/hudson_solaris/home/hudson/hudson-slave/workspace/Nutch-trunk/trunk/ivy/ivysettings.xml

compile:

jar:

deps-test:

deploy:

copy-generated-lib:

deploy:
     [copy] Copying 1 file to /zonestorage/hudson_solaris/home/hudson/hudson-slave/workspace/Nutch-trunk/trunk/build/plugins/urlnormalizer-regex

copy-generated-lib:
     [copy] Copying 1 file to /zonestorage/hudson_solaris/home/hudson/hudson-slave/workspace/Nutch-trunk/trunk/build/plugins/urlnormalizer-regex

compile:

job:
      [jar] Building jar: /zonestorage/hudson_solaris/home/hudson/hudson-slave/workspace/Nutch-trunk/trunk/build/nutch-2011-11-02_11-21-12.job

resolve-test:
[ivy:resolve] 
[ivy:resolve] :: problems summary ::
[ivy:resolve] :::: ERRORS
[ivy:resolve] 	unknown resolver null
[ivy:resolve] 	unknown resolver null
[ivy:resolve] 
[ivy:resolve] :: USE VERBOSE OR DEBUG MESSAGE LEVEL FOR MORE DETAILS
  [taskdef] Could not load definitions from resource org/sonar/ant/antlib.xml. It could not
be found.

copy-libs:

compile-core-test:
    [javac] /zonestorage/hudson_solaris/home/hudson/hudson-slave/workspace/Nutch-trunk/trunk/build.xml:320:
warning: 'includeantruntime' was not set, defaulting to build.sysclasspath=last; set to false
for repeatable builds
    [javac] Compiling 32 source files to /zonestorage/hudson_solaris/home/hudson/hudson-slave/workspace/Nutch-trunk/trunk/build/test/classes
    [javac] Note: Some input files use or override a deprecated API.
    [javac] Note: Recompile with -Xlint:deprecation for details.
    [javac] Note: Some input files use unchecked or unsafe operations.
    [javac] Note: Recompile with -Xlint:unchecked for details.

test-core:
    [mkdir] Created dir: /zonestorage/hudson_solaris/home/hudson/hudson-slave/workspace/Nutch-trunk/trunk/build/test/data
     [copy] Copying 90 files to /zonestorage/hudson_solaris/home/hudson/hudson-slave/workspace/Nutch-trunk/trunk/build/test/data
     [copy] Copying 1 file to /zonestorage/hudson_solaris/home/hudson/hudson-slave/workspace/Nutch-trunk/trunk/build/test/classes
     [copy] Copying 1 file to /zonestorage/hudson_solaris/home/hudson/hudson-slave/workspace/Nutch-trunk/trunk/build/test/classes
    [junit] WARNING: multiple versions of ant detected in path for junit 
    [junit]          jar:file:/export/home/hudson/tools/ant/latest/lib/ant.jar!/org/apache/tools/ant/Project.class
    [junit]      and jar:file:/zonestorage/hudson_solaris/home/hudson/hudson-slave/workspace/Nutch-trunk/trunk/build/lib/ant-1.6.5.jar!/org/apache/tools/ant/Project.class
    [junit] Running org.apache.nutch.crawl.TestCrawlDbMerger
    [junit] Tests run: 1, Failures: 0, Errors: 0, Time elapsed: 6.935 sec
    [junit] Running org.apache.nutch.crawl.TestGenerator
    [junit] Tests run: 4, Failures: 0, Errors: 2, Time elapsed: 40.354 sec
    [junit] Test org.apache.nutch.crawl.TestGenerator FAILED
    [junit] Running org.apache.nutch.crawl.TestInjector
    [junit] Tests run: 1, Failures: 0, Errors: 0, Time elapsed: 13.152 sec
    [junit] Running org.apache.nutch.crawl.TestLinkDbMerger
    [junit] Tests run: 1, Failures: 0, Errors: 0, Time elapsed: 4.136 sec
    [junit] Running org.apache.nutch.crawl.TestSignatureFactory
    [junit] Tests run: 1, Failures: 0, Errors: 0, Time elapsed: 0.481 sec
    [junit] Tests run: 1, Failures: 0, Errors: 0, Time elapsed: 0.481 sec
    [junit] Running org.apache.nutch.fetcher.TestFetcher
    [junit] Tests run: 2, Failures: 0, Errors: 0, Time elapsed: 23.107 sec
    [junit] Running org.apache.nutch.indexer.TestIndexingFilters
    [junit] Tests run: 1, Failures: 0, Errors: 0, Time elapsed: 1.192 sec
    [junit] Running org.apache.nutch.metadata.TestMetadata
    [junit] Tests run: 10, Failures: 0, Errors: 0, Time elapsed: 0.15 sec
    [junit] Running org.apache.nutch.metadata.TestSpellCheckedMetadata
    [junit] Tests run: 11, Failures: 0, Errors: 0, Time elapsed: 3.539 sec
    [junit] Running org.apache.nutch.net.TestURLFilters
    [junit] Tests run: 1, Failures: 0, Errors: 0, Time elapsed: 1.424 sec
    [junit] Running org.apache.nutch.net.TestURLNormalizers
    [junit] Tests run: 1, Failures: 0, Errors: 0, Time elapsed: 0.662 sec
    [junit] Running org.apache.nutch.parse.TestOutlinkExtractor
    [junit] Tests run: 4, Failures: 0, Errors: 0, Time elapsed: 0.062 sec
    [junit] Running org.apache.nutch.parse.TestParseData
    [junit] Tests run: 2, Failures: 0, Errors: 0, Time elapsed: 0.052 sec
    [junit] Running org.apache.nutch.parse.TestParseText
    [junit] Tests run: 1, Failures: 0, Errors: 0, Time elapsed: 0.149 sec
    [junit] Running org.apache.nutch.parse.TestParserFactory
    [junit] Tests run: 2, Failures: 0, Errors: 0, Time elapsed: 1.085 sec
    [junit] Running org.apache.nutch.plugin.TestPluginSystem
    [junit] Tests run: 7, Failures: 0, Errors: 0, Time elapsed: 1.657 sec
    [junit] Running org.apache.nutch.protocol.TestContent
    [junit] Tests run: 2, Failures: 0, Errors: 0, Time elapsed: 0.532 sec
    [junit] Running org.apache.nutch.protocol.TestProtocolFactory
    [junit] Tests run: 2, Failures: 0, Errors: 0, Time elapsed: 0.711 sec
    [junit] Running org.apache.nutch.segment.TestSegmentMerger
    [junit] Tests run: 1, Failures: 0, Errors: 1, Time elapsed: 136.364 sec
    [junit] Test org.apache.nutch.segment.TestSegmentMerger FAILED
    [junit] Running org.apache.nutch.util.TestEncodingDetector
    [junit] Tests run: 1, Failures: 0, Errors: 0, Time elapsed: 0.678 sec
    [junit] Running org.apache.nutch.util.TestGZIPUtils
    [junit] Tests run: 4, Failures: 0, Errors: 0, Time elapsed: 1.144 sec
    [junit] Running org.apache.nutch.util.TestNodeWalker
    [junit] Tests run: 1, Failures: 0, Errors: 0, Time elapsed: 0.299 sec
    [junit] Running org.apache.nutch.util.TestPrefixStringMatcher
    [junit] Tests run: 1, Failures: 0, Errors: 0, Time elapsed: 0.131 sec
    [junit] Running org.apache.nutch.util.TestStringUtil
    [junit] Tests run: 2, Failures: 0, Errors: 0, Time elapsed: 0.051 sec
    [junit] Running org.apache.nutch.util.TestSuffixStringMatcher
    [junit] Tests run: 1, Failures: 0, Errors: 0, Time elapsed: 0.106 sec
    [junit] Running org.apache.nutch.util.TestURLUtil
    [junit] Tests run: 5, Failures: 0, Errors: 0, Time elapsed: 0.446 sec

BUILD FAILED
/zonestorage/hudson_solaris/home/hudson/hudson-slave/workspace/Nutch-trunk/trunk/build.xml:395:
Tests failed!

Total time: 6 minutes 9 seconds
Build step 'Execute shell' marked build as failure
Recording test results
Publishing Javadoc


Mime
View raw message