nifi-issues mailing list archives

Site index · List index
Message view « Date » · « Thread »
Top « Date » · « Thread »
From "Joe Witt (Jira)" <j...@apache.org>
Subject [jira] [Updated] (NIFI-7587) PeerSelectorTest.testGetAvailablePeerStatusShouldHandleMultiplePenalizedPeers is unstable
Date Mon, 29 Jun 2020 17:47:00 GMT

     [ https://issues.apache.org/jira/browse/NIFI-7587?page=com.atlassian.jira.plugin.system.issuetabpanels:all-tabpanel
]

Joe Witt updated NIFI-7587:
---------------------------

happened in Github Actions https://github.com/apache/nifi/runs/812306935?check_suite_focus=true

> PeerSelectorTest.testGetAvailablePeerStatusShouldHandleMultiplePenalizedPeers is unstable
> -----------------------------------------------------------------------------------------
>
>                 Key: NIFI-7587
>                 URL: https://issues.apache.org/jira/browse/NIFI-7587
>             Project: Apache NiFi
>          Issue Type: Test
>            Reporter: Joe Witt
>            Priority: Major
>             Fix For: 1.12.0
>
>
> Unstable and/or broken test or code
> [ERROR] Tests run: 22, Failures: 1, Errors: 0, Skipped: 0, Time elapsed: 22.765 s <<<
FAILURE! - in org.apache.nifi.remote.client.PeerSelectorTest
> [ERROR] testGetAvailablePeerStatusShouldHandleMultiplePenalizedPeers(org.apache.nifi.remote.client.PeerSelectorTest)
 Time elapsed: 1.095 s  <<< FAILURE!
> org.codehaus.groovy.runtime.powerassert.PowerAssertionError: 
> assert count >= lowerBound && count <= upperBound
>        |     |  |          |  |     |  |
>        5103  |  4900.0     |  5103  |  5100.0
>              true          false    false
> 	at org.apache.nifi.remote.client.PeerSelectorTest.assertDistributionPercentages(PeerSelectorTest.groovy:147)
> 	at org.apache.nifi.remote.client.PeerSelectorTest.testGetAvailablePeerStatusShouldHandleMultiplePenalizedPeers(PeerSelectorTest.groovy:759)
> [ERROR] Failures: 
> [ERROR]   PeerSelectorTest.testGetAvailablePeerStatusShouldHandleMultiplePenalizedPeers:759->assertDistributionPercentages:147
assert count >= lowerBound && count <= upperBound
>        |     |  |          |  |     |  |
>        5103  |  4900.0     |  5103  |  5100.0
>              true          false    false
> [ERROR] Tests run: 92, Failures: 1, Errors: 0, Skipped: 2
> [ERROR] Failed to execute goal org.apache.maven.plugins:maven-surefire-plugin:2.22.2:test
(default-test) on project nifi-site-to-site-client: There are test failures.



--
This message was sent by Atlassian Jira
(v8.3.4#803005)

Mime
View raw message