nifi-issues mailing list archives

Site index · List index
Message view « Date » · « Thread »
Top « Date » · « Thread »
From "Joe Witt (Jira)" <j...@apache.org>
Subject [jira] [Commented] (NIFI-7350) Build failure with latest adopt openjdk8 openj9 JDK in framework-core
Date Fri, 10 Apr 2020 14:08:00 GMT

    [ https://issues.apache.org/jira/browse/NIFI-7350?page=com.atlassian.jira.plugin.system.issuetabpanels:comment-tabpanel&focusedCommentId=17080515#comment-17080515
] 

Joe Witt commented on NIFI-7350:
--------------------------------

works perfectly fine on 

➜  nifi-framework-core git:(master) mvn -version
Apache Maven 3.6.3 (cecedd343002696d0abb50b32b541b8a6ba2883f)
Maven home: /usr/local/Cellar/maven/3.6.3_1/libexec
Java version: 1.8.0_202, vendor: Oracle Corporation, runtime: /Library/Java/JavaVirtualMachines/jdk1.8.0_202.jdk/Contents/Home/jre
Default locale: en_US, platform encoding: UTF-8
OS name: "mac os x", version: "10.15.4", arch: "x86_64", family: "mac"

> Build failure with latest adopt openjdk8 openj9 JDK in framework-core
> ---------------------------------------------------------------------
>
>                 Key: NIFI-7350
>                 URL: https://issues.apache.org/jira/browse/NIFI-7350
>             Project: Apache NiFi
>          Issue Type: Test
>         Environment: ➜  nifi-framework-core git:(master) mvn -version
> Apache Maven 3.6.3 ()
> Maven home: /usr/local/Cellar/maven/3.6.3_1/libexec
> Java version: 1.8.0_242, vendor: Eclipse OpenJ9, runtime: /Library/Java/JavaVirtualMachines/adoptopenjdk-8-openj9.jdk/Contents/Home/jre
> Default locale: en_US, platform encoding: UTF-8
> OS name: "mac os x", version: "10.15.4", arch: "x86_64", family: "mac"
>            Reporter: Joe Witt
>            Priority: Major
>
> [ERROR] Tests run: 10, Failures: 0, Errors: 1, Skipped: 0, Time elapsed: 0.055 s <<<
FAILURE! - in org.apache.nifi.util.ReflectionUtilsTest
> [ERROR] validateFailureWithWrongArgumentType(org.apache.nifi.util.ReflectionUtilsTest)
 Time elapsed: 0.002 s  <<< ERROR!
> java.lang.Exception: Unexpected exception, expected<java.lang.IllegalArgumentException>
but was<java.lang.reflect.InvocationTargetException>
> 	at org.apache.nifi.util.ReflectionUtilsTest.validateFailureWithWrongArgumentType(ReflectionUtilsTest.java:71)
> Caused by: java.lang.ClassCastException: java.lang.String incompatible with java.lang.Integer
> 	at org.apache.nifi.util.ReflectionUtilsTest.validateFailureWithWrongArgumentType(ReflectionUtilsTest.java:71)



--
This message was sent by Atlassian Jira
(v8.3.4#803005)

Mime
View raw message