nifi-dev mailing list archives

Site index · List index
Message view « Date » · « Thread »
Top « Date » · « Thread »
From Martin Mucha <alfon...@gmail.com>
Subject Re: unable to build master
Date Mon, 22 Jan 2018 14:54:43 GMT
I'm sorry, I cannot provide that any more. I though it's a permanent issue,
but apparently it wasn't.

I was running parallel build mvn -T 6C clean install on 4 core
hyperthreading machine with export MAVEN_OPTS="-Xmx4000m -Xms2000m". Maybe
that is somehow related.

I did
mvn clean
followed by just
mvn clean install having same MAVEN_OPTS
and build completed just fine.

mvn -version
Apache Maven 3.3.9
Maven home: /usr/share/maven
Java version: 1.8.0_151, vendor: Oracle Corporation
Java home: /opt/java/jdk1.8.0_151/jre
Default locale: en_US, platform encoding: UTF-8
OS name: "linux", version: "4.14.13-200.fc26.x86_64", arch: "amd64",
family: "unix"

Mar.

2018-01-22 15:17 GMT+01:00 Joe Witt <joe.witt@gmail.com>:

> hello
>
> would like to see result of
>
> full build output
>
> and result of
>
> mvn -version
>
>
> thanks
>
> On Jan 22, 2018 8:44 AM, "Martin Mucha" <alfonz19@gmail.com> wrote:
>
> > update: mvn clean and following build without -T parameter fixed issue.
> >
> > M.
> >
> > 2018-01-22 13:08 GMT+01:00 Martin Mucha <alfonz19@gmail.com>:
> >
> > > Hi,
> > >
> > > I pulled new changes and I'm unable to build master now.
> > >
> > > a) -Pcontrib-check is totally out of question, due to standard-bundles
> > > failues IIRC
> > > b) without contrib check it does not build also. See last few maven
> > lines:
> > >
> > > [INFO] ------------------------------------------------------------
> > > ------------
> > > [INFO] Reactor Summary:
> > > [INFO]
> > > [INFO] nifi ............................................... SUCCESS [
> > > 1.857 s]
> > > [INFO] nifi-api ........................................... SUCCESS [
> > > 14.940 s]
> > > [INFO] nifi-framework-api ................................. SUCCESS [
> > > 17.200 s]
> > > [INFO] nifi-commons ....................................... SUCCESS [
> > > 0.345 s]
> > > [INFO] nifi-utils ......................................... SUCCESS [
> > > 27.014 s]
> > > [INFO] nifi-properties .................................... SUCCESS [
> > > 14.267 s]
> > > [INFO] nifi-security-utils ................................ SUCCESS [
> > > 40.910 s]
> > > [INFO] nifi-nar-bundles ................................... SUCCESS [
> > > 0.767 s]
> > > [INFO] nifi-framework-bundle .............................. SUCCESS [
> > > 1.632 s]
> > > [INFO] nifi-framework ..................................... SUCCESS [
> > > 0.740 s]
> > > [INFO] nifi-properties-loader ............................. SUCCESS [
> > > 10.385 s]
> > > [INFO] nifi-data-provenance-utils ......................... SUCCESS [
> > > 21.573 s]
> > > [INFO] nifi-flowfile-packager ............................. SUCCESS [
> > > 13.867 s]
> > > [INFO] nifi-expression-language ........................... SUCCESS [
> > > 29.552 s]
> > > [INFO] nifi-logging-utils ................................. SUCCESS [
> > > 9.404 s]
> > > [INFO] nifi-socket-utils .................................. SUCCESS [
> > > 10.883 s]
> > > [INFO] nifi-web-utils ..................................... SUCCESS [
> > > 7.392 s]
> > > [INFO] nifi-write-ahead-log ............................... SUCCESS [
> > > 21.987 s]
> > > [INFO] nifi-client-dto .................................... SUCCESS [
> > > 22.276 s]
> > > [INFO] nifi-site-to-site-client ........................... SUCCESS [
> > > 47.007 s]
> > > [INFO] nifi-hl7-query-language ............................ SUCCESS [
> > > 30.170 s]
> > > [INFO] nifi-schema-utils .................................. SUCCESS [
> > > 14.590 s]
> > > [INFO] nifi-record ........................................ SUCCESS [
> > > 14.258 s]
> > > [INFO] nifi-record-path ................................... SUCCESS [
> > > 21.214 s]
> > > [INFO] nifi-bootstrap ..................................... SUCCESS [
> > > 22.305 s]
> > > [INFO] nifi-mock .......................................... SUCCESS [
> > > 13.790 s]
> > > [INFO] nifi-nar-utils ..................................... SUCCESS [
> > > 4.902 s]
> > > [INFO] nifi-framework-nar-utils ........................... SUCCESS [
> > > 3.110 s]
> > > [INFO] nifi-framework-authorization ....................... SUCCESS [
> > > 7.239 s]
> > > [INFO] nifi-framework-core-api ............................ SUCCESS
> > [01:01
> > > min]
> > > [INFO] nifi-runtime ....................................... SUCCESS [
> > > 1.769 s]
> > > [INFO] nifi-security ...................................... SUCCESS [
> > > 13.662 s]
> > > [INFO] nifi-user-actions .................................. SUCCESS [
> > > 3.102 s]
> > > [INFO] nifi-administration ................................ SUCCESS [
> > > 52.884 s]
> > > [INFO] nifi-site-to-site .................................. SKIPPED
> > > [INFO] nifi-repository-models ............................. SUCCESS [
> > > 7.199 s]
> > > [INFO] nifi-flowfile-repo-serialization ................... SUCCESS [
> > > 6.358 s]
> > > [INFO] nifi-framework-cluster-protocol .................... SUCCESS
> > > [01:39 min]
> > > [INFO] nifi-authorizer .................................... SUCCESS [
> > > 24.198 s]
> > > [INFO] nifi-framework-core ................................ SKIPPED
> > > [INFO] nifi-web ........................................... SUCCESS [
> > > 2.385 s]
> > > [INFO] nifi-web-security .................................. SKIPPED
> > > [INFO] nifi-web-optimistic-locking ........................ SKIPPED
> > > [INFO] nifi-framework-cluster ............................. SKIPPED
> > > [INFO] nifi-file-authorizer ............................... SKIPPED
> > > [INFO] nifi-custom-ui-utilities ........................... SUCCESS [
> > > 2.427 s]
> > > [INFO] nifi-web-content-access ............................ SUCCESS [
> > > 5.229 s]
> > > [INFO] nifi-ui-extension .................................. SUCCESS [
> > > 3.098 s]
> > > [INFO] nifi-provenance-repository-bundle .................. SUCCESS [
> > > 3.632 s]
> > > [INFO] nifi-volatile-provenance-repository ................ SUCCESS [
> > > 10.509 s]
> > > [INFO] nifi-web-api ....................................... SKIPPED
> > > [INFO] nifi-web-error ..................................... SUCCESS [
> > > 4.960 s]
> > > [INFO] nifi-web-docs ...................................... SUCCESS [
> > > 5.234 s]
> > > [INFO] nifi-web-content-viewer ............................ SUCCESS [
> > > 2.007 s]
> > > [INFO] nifi-web-ui ........................................ SUCCESS [
> > > 41.976 s]
> > > [INFO] nifi-documentation ................................. SUCCESS [
> > > 16.253 s]
> > > [INFO] nifi-jetty ......................................... SKIPPED
> > > [INFO] nifi-resources ..................................... SUCCESS [
> > > 4.662 s]
> > > [INFO] nifi-standard-prioritizers ......................... SUCCESS [
> > > 38.843 s]
> > > [INFO] nifi-framework-nar ................................. SKIPPED
> > > [INFO] nifi-extension-utils ............................... SUCCESS [
> > > 3.386 s]
> > > [INFO] nifi-hadoop-utils .................................. SUCCESS [
> > > 16.788 s]
> > > [INFO] nifi-standard-services ............................. SUCCESS [
> > > 2.806 s]
> > > [INFO] nifi-distributed-cache-client-service-api .......... SUCCESS [
> > > 7.253 s]
> > > [INFO] nifi-hadoop-bundle ................................. SUCCESS [
> > > 2.813 s]
> > > [INFO] nifi-hdfs-processors ............................... SUCCESS
> > > [02:13 min]
> > > [INFO] nifi-ssl-context-service-api ....................... SUCCESS [
> > > 6.141 s]
> > > [INFO] nifi-load-distribution-service-api ................. SUCCESS [
> > > 4.514 s]
> > > [INFO] nifi-http-context-map-api .......................... SUCCESS [
> > > 5.623 s]
> > > [INFO] nifi-dbcp-service-api .............................. SUCCESS [
> > > 6.157 s]
> > > [INFO] nifi-mongodb-client-service-api .................... SUCCESS [
> > > 3.160 s]
> > > [INFO] nifi-hbase-client-service-api ...................... SUCCESS [
> > > 5.947 s]
> > > [INFO] nifi-record-serialization-service-api .............. SUCCESS [
> > > 7.238 s]
> > > [INFO] nifi-schema-registry-service-api ................... SUCCESS [
> > > 3.765 s]
> > > [INFO] nifi-lookup-service-api ............................ SUCCESS [
> > > 7.250 s]
> > > [INFO] nifi-standard-services-api-nar ..................... SUCCESS [
> > > 4.596 s]
> > > [INFO] nifi-hadoop-libraries-bundle ....................... SUCCESS [
> > > 2.756 s]
> > > [INFO] nifi-hadoop-libraries-nar .......................... SUCCESS [
> > > 10.297 s]
> > > [INFO] nifi-hadoop-nar .................................... SUCCESS [
> > > 9.386 s]
> > > [INFO] nifi-jetty-bundle .................................. SUCCESS [
> > > 9.647 s]
> > > [INFO] nifi-persistent-provenance-repository .............. FAILURE
> > > [03:57 min]
> > > [INFO] nifi-provenance-repository-nar ..................... SKIPPED
> > > [INFO] nifi-processor-utils ............................... SUCCESS
> > > [01:09 min]
> > > [INFO] nifi-record-utils .................................. SUCCESS [
> > > 0.345 s]
> > > [INFO] nifi-standard-record-utils ......................... SUCCESS [
> > > 14.500 s]
> > > [INFO] nifi-avro-record-utils ............................. SUCCESS [
> > > 9.710 s]
> > > [INFO] nifi-distributed-cache-services-bundle ............. SUCCESS [
> > > 0.749 s]
> > > [INFO] nifi-distributed-cache-protocol .................... SUCCESS [
> > > 5.863 s]
> > > [INFO] nifi-distributed-cache-client-service .............. SUCCESS [
> > > 31.101 s]
> > > [INFO] nifi-ssl-context-bundle ............................ SUCCESS [
> > > 0.695 s]
> > > [INFO] nifi-ssl-context-service ........................... SUCCESS
> > [01:17
> > > min]
> > > [INFO] nifi-mock-record-utils ............................. SUCCESS [
> > > 7.201 s]
> > > [INFO] nifi-record-serialization-services-bundle .......... SUCCESS [
> > > 0.503 s]
> > > [INFO] nifi-record-serialization-services ................. SUCCESS
> > > [01:43 min]
> > > [INFO] nifi-lookup-services-bundle ........................ SUCCESS [
> > > 0.664 s]
> > > [INFO] nifi-lookup-services ............................... SUCCESS
> > > [01:19 min]
> > > [INFO] nifi-standard-bundle ............................... SUCCESS [
> > > 3.371 s]
> > > [INFO] nifi-standard-utils ................................ SUCCESS [
> > > 14.521 s]
> > > [INFO] nifi-standard-processors ........................... SKIPPED
> > > [INFO] nifi-standard-reporting-tasks ...................... SUCCESS [
> > > 44.993 s]
> > > [INFO] nifi-standard-content-viewer ....................... SUCCESS [
> > > 7.755 s]
> > > [INFO] nifi-jolt-transform-json-ui ........................ SKIPPED
> > > [INFO] nifi-standard-nar .................................. SKIPPED
> > > [INFO] nifi-distributed-cache-server ...................... SUCCESS
> > [01:15
> > > min]
> > > [INFO] nifi-distributed-cache-services-nar ................ SUCCESS [
> > > 6.359 s]
> > > [INFO] nifi-lookup-services-nar ........................... SUCCESS [
> > > 19.039 s]
> > > [INFO] nifi-ssl-context-service-nar ....................... SUCCESS [
> > > 12.738 s]
> > > [INFO] nifi-http-context-map-bundle ....................... SUCCESS [
> > > 0.513 s]
> > > [INFO] nifi-http-context-map .............................. SUCCESS [
> > > 6.019 s]
> > > [INFO] nifi-http-context-map-nar .......................... SUCCESS [
> > > 1.639 s]
> > > [INFO] nifi-dbcp-service-bundle ........................... SUCCESS [
> > > 0.581 s]
> > > [INFO] nifi-dbcp-service .................................. SUCCESS
> > > [01:36 min]
> > > [INFO] nifi-dbcp-service-nar .............................. SUCCESS [
> > > 12.977 s]
> > > [INFO] nifi-hbase_1_1_2-client-service-bundle ............. SUCCESS [
> > > 0.431 s]
> > > [INFO] nifi-hbase_1_1_2-client-service .................... SUCCESS
> > > [01:48 min]
> > > [INFO] nifi-hbase_1_1_2-client-service-nar ................ SUCCESS
> > > [01:08 min]
> > > [INFO] nifi-record-serialization-services-nar ............. SUCCESS [
> > > 28.411 s]
> > > [INFO] nifi-hwx-schema-registry-bundle .................... SUCCESS [
> > > 0.507 s]
> > > [INFO] nifi-hwx-schema-registry-service ................... SUCCESS
> > > [01:08 min]
> > > [INFO] nifi-hwx-schema-registry-nar ....................... SUCCESS [
> > > 42.314 s]
> > > [INFO] nifi-mongodb-services-bundle ....................... SUCCESS [
> > > 0.565 s]
> > > [INFO] nifi-mongodb-services .............................. SUCCESS [
> > > 53.996 s]
> > > [INFO] nifi-mongodb-services-nar .......................... SUCCESS [
> > > 16.062 s]
> > > [INFO] nifi-update-attribute-bundle ....................... SUCCESS [
> > > 2.803 s]
> > > [INFO] nifi-update-attribute-model ........................ SUCCESS [
> > > 4.860 s]
> > > [INFO] nifi-update-attribute-processor .................... SUCCESS [
> > > 59.205 s]
> > > [INFO] nifi-update-attribute-ui ........................... SUCCESS [
> > > 56.965 s]
> > > [INFO] nifi-update-attribute-nar .......................... SUCCESS [
> > > 44.101 s]
> > > [INFO] nifi-kafka-bundle .................................. SUCCESS [
> > > 1.225 s]
> > > [INFO] nifi-kafka-0-8-processors .......................... SUCCESS
> > [01:17
> > > min]
> > > [INFO] nifi-kafka-0-9-processors .......................... SUCCESS
> > [01:47
> > > min]
> > > [INFO] nifi-kafka-0-10-processors ......................... SUCCESS
> > [01:49
> > > min]
> > > [INFO] nifi-kafka-0-11-processors ......................... SUCCESS
> > [01:49
> > > min]
> > > [INFO] nifi-kafka-1-0-processors .......................... SUCCESS
> > [01:48
> > > min]
> > > [INFO] nifi-kafka-0-8-nar ................................. SUCCESS [
> > > 24.214 s]
> > > [INFO] nifi-kafka-0-9-nar ................................. SUCCESS [
> > > 13.825 s]
> > > [INFO] nifi-kafka-0-10-nar ................................ SUCCESS [
> > > 15.763 s]
> > > [INFO] nifi-kafka-0-11-nar ................................ SUCCESS [
> > > 13.471 s]
> > > [INFO] nifi-kafka-1-0-nar ................................. SUCCESS [
> > > 16.086 s]
> > > [INFO] nifi-kite-bundle ................................... SUCCESS [
> > > 3.404 s]
> > > [INFO] nifi-kite-processors ............................... SUCCESS
> > > [02:58 min]
> > > [INFO] nifi-kite-nar ...................................... SUCCESS [
> > > 27.311 s]
> > > [INFO] nifi-hadoop-record-utils ........................... SUCCESS [
> > > 6.498 s]
> > > [INFO] nifi-kudu-bundle ................................... SUCCESS [
> > > 2.846 s]
> > > [INFO] nifi-kudu-processors ............................... SUCCESS
> > > [01:14 min]
> > > [INFO] nifi-kudu-nar ...................................... SUCCESS [
> > > 42.034 s]
> > > [INFO] nifi-solr-bundle ................................... SUCCESS [
> > > 1.185 s]
> > > [INFO] nifi-solr-processors ............................... SKIPPED
> > > [INFO] nifi-solr-nar ...................................... SKIPPED
> > > [INFO] nifi-confluent-platform-bundle ..................... SUCCESS [
> > > 2.834 s]
> > > [INFO] nifi-confluent-schema-registry-service ............. SUCCESS [
> > > 7.608 s]
> > > [INFO] nifi-confluent-platform-nar ........................ SUCCESS [
> > > 3.044 s]
> > > [INFO] nifi-aws-bundle .................................... SUCCESS [
> > > 3.140 s]
> > > [INFO] nifi-aws-service-api ............................... SUCCESS [
> > > 8.227 s]
> > > [INFO] nifi-aws-abstract-processors ....................... SUCCESS [
> > > 10.304 s]
> > > [INFO] nifi-aws-processors ................................ SKIPPED
> > > [INFO] nifi-aws-service-api-nar ........................... SUCCESS [
> > > 2.636 s]
> > > [INFO] nifi-aws-nar ....................................... SKIPPED
> > > [INFO] nifi-social-media-bundle ........................... SUCCESS [
> > > 3.346 s]
> > > [INFO] nifi-twitter-processors ............................ SUCCESS [
> > > 45.060 s]
> > > [INFO] nifi-social-media-nar .............................. SUCCESS [
> > > 4.782 s]
> > > [INFO] nifi-enrich-bundle ................................. SUCCESS [
> > > 2.816 s]
> > > [INFO] nifi-enrich-processors ............................. SUCCESS
> > [02:19
> > > min]
> > > [INFO] nifi-enrich-nar .................................... SUCCESS [
> > > 29.436 s]
> > > [INFO] nifi-hl7-bundle .................................... SUCCESS [
> > > 2.758 s]
> > > [INFO] nifi-hl7-processors ................................ SUCCESS [
> > > 57.840 s]
> > > [INFO] nifi-hl7-nar ....................................... SUCCESS [
> > > 12.150 s]
> > > [INFO] nifi-ccda-bundle ................................... SUCCESS [
> > > 3.301 s]
> > > [INFO] nifi-ccda-processors ............................... SUCCESS
> > > [01:52 min]
> > > [INFO] nifi-ccda-nar ...................................... SUCCESS [
> > > 18.049 s]
> > > [INFO] nifi-language-translation-bundle ................... SUCCESS [
> > > 3.515 s]
> > > [INFO] nifi-yandex-processors ............................. SUCCESS [
> > > 52.087 s]
> > > [INFO] nifi-language-translation-nar ...................... SUCCESS [
> > > 10.355 s]
> > > [INFO] nifi-mongodb-bundle ................................ SUCCESS [
> > > 1.554 s]
> > > [INFO] nifi-mongodb-processors ............................ SUCCESS
> > [01:14
> > > min]
> > > [INFO] nifi-mongodb-nar ................................... SUCCESS [
> > > 30.853 s]
> > > [INFO] nifi-flume-bundle .................................. SUCCESS [
> > > 3.457 s]
> > > [INFO] nifi-flume-processors .............................. SUCCESS
> > [01:40
> > > min]
> > > [INFO] nifi-flume-nar ..................................... SUCCESS
> > > [01:18 min]
> > > [INFO] nifi-hbase-bundle .................................. SUCCESS [
> > > 2.768 s]
> > > [INFO] nifi-hbase-processors .............................. SUCCESS
> > [02:10
> > > min]
> > > [INFO] nifi-hbase-nar ..................................... SUCCESS [
> > > 4.693 s]
> > > [INFO] nifi-ambari-bundle ................................. SUCCESS [
> > > 3.534 s]
> > > [INFO] nifi-ambari-reporting-task ......................... SUCCESS [
> > > 54.151 s]
> > > [INFO] nifi-ambari-nar .................................... SUCCESS [
> > > 7.567 s]
> > > [INFO] nifi-media-bundle .................................. SUCCESS [
> > > 2.381 s]
> > > [INFO] nifi-media-processors .............................. SUCCESS
> > [01:56
> > > min]
> > > [INFO] nifi-image-viewer .................................. SUCCESS [
> > > 3.521 s]
> > > [INFO] nifi-media-nar ..................................... SUCCESS
> > > [01:16 min]
> > > [INFO] nifi-avro-bundle ................................... SUCCESS [
> > > 2.722 s]
> > > [INFO] nifi-avro-processors ............................... SUCCESS
> > > [01:04 min]
> > > [INFO] nifi-avro-nar ...................................... SUCCESS [
> > > 5.782 s]
> > > [INFO] nifi-couchbase-bundle .............................. SUCCESS [
> > > 2.768 s]
> > > [INFO] nifi-couchbase-services-api ........................ SUCCESS [
> > > 7.226 s]
> > > [INFO] nifi-couchbase-services-api-nar .................... SUCCESS [
> > > 2.149 s]
> > > [INFO] nifi-couchbase-processors .......................... SUCCESS [
> > > 59.953 s]
> > > [INFO] nifi-couchbase-nar ................................. SUCCESS [
> > > 4.516 s]
> > > [INFO] nifi-azure-bundle .................................. SUCCESS [
> > > 3.261 s]
> > > [INFO] nifi-azure-processors .............................. SUCCESS
> > [01:17
> > > min]
> > > [INFO] nifi-azure-nar ..................................... SUCCESS [
> > > 15.344 s]
> > > [INFO] nifi-ldap-iaa-providers-bundle ..................... SUCCESS [
> > > 2.679 s]
> > > [INFO] nifi-ldap-iaa-providers ............................ SUCCESS [
> > > 27.718 s]
> > > [INFO] nifi-ldap-iaa-providers-nar ........................ SUCCESS [
> > > 1.905 s]
> > > [INFO] nifi-kerberos-iaa-providers-bundle ................. SUCCESS [
> > > 2.676 s]
> > > [INFO] nifi-kerberos-iaa-providers ........................ SUCCESS [
> > > 5.358 s]
> > > [INFO] nifi-kerberos-iaa-providers-nar .................... SUCCESS [
> > > 2.758 s]
> > > [INFO] nifi-riemann-bundle ................................ SUCCESS [
> > > 2.361 s]
> > > [INFO] nifi-riemann-processors ............................ SUCCESS [
> > > 56.210 s]
> > > [INFO] nifi-riemann-nar ................................... SUCCESS [
> > > 4.434 s]
> > > [INFO] nifi-html-bundle ................................... SUCCESS [
> > > 3.423 s]
> > > [INFO] nifi-html-processors ............................... SUCCESS [
> > > 48.144 s]
> > > [INFO] nifi-html-nar ...................................... SUCCESS [
> > > 3.113 s]
> > > [INFO] nifi-scripting-bundle .............................. SUCCESS [
> > > 3.419 s]
> > > [INFO] nifi-scripting-processors .......................... SKIPPED
> > > [INFO] nifi-scripting-nar ................................. SKIPPED
> > > [INFO] nifi-elasticsearch-bundle .......................... SUCCESS [
> > > 2.734 s]
> > > [INFO] nifi-elasticsearch-processors ...................... SKIPPED
> > > [INFO] nifi-elasticsearch-nar ............................. SKIPPED
> > > [INFO] nifi-elasticsearch-5-processors .................... SUCCESS
> > > [01:55 min]
> > > [INFO] nifi-elasticsearch-5-nar ........................... SKIPPED
> > > [INFO] nifi-amqp-bundle ................................... SUCCESS [
> > > 3.435 s]
> > > [INFO] nifi-amqp-processors ............................... SUCCESS
> > > [01:13 min]
> > > [INFO] nifi-amqp-nar ...................................... SUCCESS [
> > > 29.632 s]
> > > [INFO] nifi-splunk-bundle ................................. SUCCESS [
> > > 1.524 s]
> > > [INFO] nifi-splunk-processors ............................. SUCCESS
> > [01:30
> > > min]
> > > [INFO] nifi-splunk-nar .................................... SUCCESS [
> > > 7.467 s]
> > > [INFO] nifi-jms-bundle .................................... SUCCESS [
> > > 2.727 s]
> > > [INFO] nifi-jms-cf-service ................................ SUCCESS [
> > > 4.843 s]
> > > [INFO] nifi-jms-cf-service-nar ............................ SUCCESS [
> > > 1.494 s]
> > > [INFO] nifi-jms-processors ................................ SUCCESS
> > > [01:50 min]
> > > [INFO] nifi-jms-processors-nar ............................ SUCCESS [
> > > 16.339 s]
> > > [INFO] nifi-lumberjack-bundle ............................. SUCCESS [
> > > 2.501 s]
> > > [INFO] nifi-lumberjack-processors ......................... SUCCESS
> > [01:06
> > > min]
> > > [INFO] nifi-lumberjack-nar ................................ SUCCESS [
> > > 34.319 s]
> > > [INFO] nifi-beats-bundle .................................. SUCCESS [
> > > 2.299 s]
> > > [INFO] nifi-beats-processors .............................. SUCCESS
> > [01:02
> > > min]
> > > [INFO] nifi-beats-nar ..................................... SUCCESS [
> > > 34.961 s]
> > > [INFO] nifi-cassandra-bundle .............................. SUCCESS [
> > > 1.649 s]
> > > [INFO] nifi-cassandra-processors .......................... SUCCESS
> > [01:34
> > > min]
> > > [INFO] nifi-cassandra-nar ................................. SUCCESS [
> > > 10.683 s]
> > > [INFO] nifi-spring-bundle ................................. SUCCESS [
> > > 1.433 s]
> > > [INFO] nifi-spring-processors ............................. SUCCESS
> > [01:01
> > > min]
> > > [INFO] nifi-spring-nar .................................... SUCCESS [
> > > 3.295 s]
> > > [INFO] nifi-hive-bundle ................................... SUCCESS [
> > > 1.390 s]
> > > [INFO] nifi-hive-services-api ............................. SUCCESS [
> > > 5.343 s]
> > > [INFO] nifi-hive-services-api-nar ......................... SUCCESS [
> > > 1.390 s]
> > > [INFO] nifi-hive-processors ............................... SKIPPED
> > > [INFO] nifi-hive-nar ...................................... SKIPPED
> > > [INFO] nifi-reporting-utils ............................... SUCCESS [
> > > 7.266 s]
> > > [INFO] nifi-site-to-site-reporting-bundle ................. SUCCESS [
> > > 1.502 s]
> > > [INFO] nifi-site-to-site-reporting-task ................... SUCCESS
> > > [01:47 min]
> > > [INFO] nifi-site-to-site-reporting-nar .................... SUCCESS [
> > > 19.085 s]
> > > [INFO] nifi-mqtt-bundle ................................... SUCCESS [
> > > 1.044 s]
> > > [INFO] nifi-mqtt-processors ............................... SUCCESS
> > > [01:16 min]
> > > [INFO] nifi-mqtt-nar ...................................... SUCCESS [
> > > 9.806 s]
> > > [INFO] nifi-evtx-bundle ................................... SUCCESS [
> > > 1.345 s]
> > > [INFO] nifi-evtx-processors ............................... SUCCESS
> > > [01:42 min]
> > > [INFO] nifi-evtx-nar ...................................... SUCCESS [
> > > 6.011 s]
> > > [INFO] nifi-slack-bundle .................................. SUCCESS [
> > > 1.485 s]
> > > [INFO] nifi-slack-processors .............................. SUCCESS
> > [01:10
> > > min]
> > > [INFO] nifi-slack-nar ..................................... SUCCESS [
> > > 3.751 s]
> > > [INFO] nifi-snmp-bundle ................................... SUCCESS [
> > > 1.300 s]
> > > [INFO] nifi-snmp-processors ............................... SUCCESS [
> > > 37.212 s]
> > > [INFO] nifi-snmp-nar ...................................... SUCCESS [
> > > 3.813 s]
> > > [INFO] nifi-datadog-bundle ................................ SUCCESS [
> > > 1.327 s]
> > > [INFO] nifi-datadog-reporting-task ........................ SUCCESS
> > [01:04
> > > min]
> > > [INFO] nifi-datadog-nar ................................... SUCCESS [
> > > 8.205 s]
> > > [INFO] nifi-windows-event-log-bundle ...................... SUCCESS [
> > > 1.113 s]
> > > [INFO] nifi-windows-event-log-processors .................. SUCCESS
> > > [01:11 min]
> > > [INFO] nifi-windows-event-log-nar ......................... SUCCESS [
> > > 9.562 s]
> > > [INFO] nifi-ignite-bundle ................................. SUCCESS [
> > > 1.020 s]
> > > [INFO] nifi-ignite-processors ............................. SUCCESS
> > [01:34
> > > min]
> > > [INFO] nifi-ignite-nar .................................... SUCCESS [
> > > 18.008 s]
> > > [INFO] nifi-rethinkdb-bundle .............................. SUCCESS [
> > > 0.637 s]
> > > [INFO] nifi-rethinkdb-processors .......................... SUCCESS
> > [01:02
> > > min]
> > > [INFO] nifi-rethinkdb-nar ................................. SUCCESS [
> > > 3.622 s]
> > > [INFO] nifi-email-bundle .................................. SUCCESS [
> > > 1.267 s]
> > > [INFO] nifi-email-processors .............................. SUCCESS
> > [01:32
> > > min]
> > > [INFO] nifi-email-nar ..................................... SUCCESS [
> > > 11.178 s]
> > > [INFO] nifi-groovyx-bundle ................................ SUCCESS [
> > > 1.252 s]
> > > [INFO] nifi-groovyx-processors ............................ SUCCESS
> > [01:56
> > > min]
> > > [INFO] nifi-groovyx-nar ................................... SUCCESS [
> > > 9.924 s]
> > > [INFO] nifi-ranger-bundle ................................. SUCCESS [
> > > 1.400 s]
> > > [INFO] nifi-ranger-plugin ................................. SUCCESS
> > > [02:58 min]
> > > [INFO] nifi-ranger-nar .................................... SUCCESS [
> > > 43.603 s]
> > > [INFO] nifi-ranger-resources .............................. SUCCESS [
> > > 4.681 s]
> > > [INFO] nifi-websocket-bundle .............................. SUCCESS [
> > > 0.939 s]
> > > [INFO] nifi-websocket-services-api ........................ SUCCESS [
> > > 52.527 s]
> > > [INFO] nifi-websocket-processors .......................... SUCCESS
> > [01:04
> > > min]
> > > [INFO] nifi-websocket-services-api-nar .................... SUCCESS [
> > > 16.511 s]
> > > [INFO] nifi-websocket-processors-nar ...................... SUCCESS [
> > > 3.993 s]
> > > [INFO] nifi-websocket-services-jetty ...................... SUCCESS [
> > > 58.238 s]
> > > [INFO] nifi-websocket-services-jetty-nar .................. SUCCESS [
> > > 7.309 s]
> > > [INFO] nifi-tcp-bundle .................................... SUCCESS [
> > > 0.775 s]
> > > [INFO] nifi-tcp-processors ................................ SUCCESS [
> > > 52.017 s]
> > > [INFO] nifi-tcp-nar ....................................... SUCCESS [
> > > 14.938 s]
> > > [INFO] nifi-gcp-bundle .................................... SUCCESS [
> > > 0.936 s]
> > > [INFO] nifi-gcp-services-api .............................. SUCCESS [
> > > 8.243 s]
> > > [INFO] nifi-gcp-services-api-nar .......................... SUCCESS [
> > > 2.454 s]
> > > [INFO] nifi-gcp-processors ................................ SUCCESS
> > > [02:31 min]
> > > [INFO] nifi-gcp-nar ....................................... SKIPPED
> > > [INFO] nifi-registry-bundle ............................... SUCCESS [
> > > 0.710 s]
> > > [INFO] nifi-registry-service .............................. SUCCESS [
> > > 10.487 s]
> > > [INFO] nifi-registry-nar .................................. SUCCESS [
> > > 1.398 s]
> > > [INFO] nifi-stateful-analysis-bundle ...................... SUCCESS [
> > > 0.441 s]
> > > [INFO] nifi-stateful-analysis-processors .................. SUCCESS [
> > > 59.061 s]
> > > [INFO] nifi-stateful-analysis-nar ......................... SUCCESS [
> > > 28.334 s]
> > > [INFO] nifi-poi-bundle .................................... SUCCESS [
> > > 0.723 s]
> > > [INFO] nifi-poi-processors ................................ SKIPPED
> > > [INFO] nifi-poi-nar ....................................... SKIPPED
> > > [INFO] nifi-cdc ........................................... SUCCESS [
> > > 0.733 s]
> > > [INFO] nifi-cdc-api ....................................... SUCCESS [
> > > 6.589 s]
> > > [INFO] nifi-cdc-mysql-bundle .............................. SUCCESS [
> > > 0.308 s]
> > > [INFO] nifi-cdc-mysql-processors .......................... SUCCESS
> > [01:35
> > > min]
> > > [INFO] nifi-cdc-mysql-nar ................................. SUCCESS [
> > > 3.617 s]
> > > [INFO] nifi-cybersecurity-bundle .......................... SUCCESS [
> > > 0.750 s]
> > > [INFO] nifi-cybersecurity-processors ...................... SUCCESS [
> > > 49.993 s]
> > > [INFO] nifi-cybersecurity-nar ............................. SUCCESS [
> > > 2.156 s]
> > > [INFO] nifi-parquet-bundle ................................ SUCCESS [
> > > 0.883 s]
> > > [INFO] nifi-parquet-processors ............................ SUCCESS
> > [02:26
> > > min]
> > > [INFO] nifi-parquet-nar ................................... SUCCESS [
> > > 30.554 s]
> > > [INFO] nifi-redis-bundle .................................. SUCCESS [
> > > 0.741 s]
> > > [INFO] nifi-redis-service-api ............................. SUCCESS [
> > > 7.752 s]
> > > [INFO] nifi-redis-service-api-nar ......................... SUCCESS [
> > > 2.501 s]
> > > [INFO] nifi-redis-extensions .............................. SUCCESS
> > [01:01
> > > min]
> > > [INFO] nifi-redis-nar ..................................... SUCCESS [
> > > 4.477 s]
> > > [INFO] nifi-metrics-reporting-bundle ...................... SUCCESS [
> > > 0.671 s]
> > > [INFO] nifi-metrics-reporter-service-api .................. SUCCESS [
> > > 7.088 s]
> > > [INFO] nifi-metrics-reporting-task ........................ SUCCESS [
> > > 41.701 s]
> > > [INFO] nifi-metrics-reporter-service-api-nar .............. SUCCESS [
> > > 1.401 s]
> > > [INFO] nifi-metrics-reporting-nar ......................... SUCCESS [
> > > 3.758 s]
> > > [INFO] nifi-spark-bundle .................................. SUCCESS [
> > > 3.720 s]
> > > [INFO] nifi-livy-controller-service-api ................... SUCCESS [
> > > 20.732 s]
> > > [INFO] nifi-livy-controller-service-api-nar ............... SUCCESS [
> > > 16.969 s]
> > > [INFO] nifi-livy-controller-service ....................... SUCCESS [
> > > 44.945 s]
> > > [INFO] nifi-livy-processors ............................... SKIPPED
> > > [INFO] nifi-livy-nar ...................................... SKIPPED
> > > [INFO] nifi-atlas-bundle .................................. SUCCESS [
> > > 0.661 s]
> > > [INFO] nifi-atlas-reporting-task .......................... SUCCESS
> > [02:18
> > > min]
> > > [INFO] nifi-atlas-nar ..................................... SKIPPED
> > > [INFO] nifi-druid-bundle .................................. SUCCESS [
> > > 0.610 s]
> > > [INFO] nifi-druid-controller-service-api .................. SUCCESS [
> > > 57.063 s]
> > > [INFO] nifi-druid-controller-service-api-nar .............. SUCCESS [
> > > 4.375 s]
> > > [INFO] nifi-druid-controller-service ...................... SUCCESS
> > [01:54
> > > min]
> > > [INFO] nifi-druid-processors .............................. SUCCESS
> > [01:18
> > > min]
> > > [INFO] nifi-druid-nar ..................................... SUCCESS [
> > > 2.246 s]
> > > [INFO] nifi-docs .......................................... SUCCESS [
> > > 33.186 s]
> > > [INFO] nifi-assembly ...................................... SKIPPED
> > > [INFO] nifi-maven-archetypes .............................. SUCCESS [
> > > 0.307 s]
> > > [INFO] nifi-processor-bundle-archetype .................... SUCCESS [
> > > 9.971 s]
> > > [INFO] nifi-service-bundle-archetype ...................... SUCCESS [
> > > 9.965 s]
> > > [INFO] nifi-external ...................................... SUCCESS [
> > > 0.301 s]
> > > [INFO] nifi-spark-receiver ................................ SUCCESS [
> > > 53.086 s]
> > > [INFO] nifi-storm-spout ................................... SUCCESS
> > > [01:03 min]
> > > [INFO] nifi-example-bundle ................................ SUCCESS [
> > > 0.442 s]
> > > [INFO] nifi-nifi-example-processors ....................... SUCCESS [
> > > 54.987 s]
> > > [INFO] nifi-example-nar ................................... SUCCESS [
> > > 31.803 s]
> > > [INFO] nifi-toolkit ....................................... SUCCESS [
> > > 0.403 s]
> > > [INFO] nifi-toolkit-tls ................................... SKIPPED
> > > [INFO] nifi-toolkit-encrypt-config ........................ SKIPPED
> > > [INFO] nifi-toolkit-s2s ................................... SUCCESS
> > > [01:00 min]
> > > [INFO] nifi-toolkit-admin ................................. SKIPPED
> > > [INFO] nifi-toolkit-zookeeper-migrator .................... SUCCESS [
> > > 35.443 s]
> > > [INFO] nifi-toolkit-flowfile-repo ......................... SUCCESS [
> > > 12.560 s]
> > > [INFO] nifi-toolkit-flowanalyzer .......................... SUCCESS [
> > > 13.680 s]
> > > [INFO] nifi-toolkit-assembly .............................. SKIPPED
> > > [INFO] nifi-docker ........................................ SUCCESS [
> > > 0.306 s]
> > > [INFO] dockermaven ........................................ SUCCESS [
> > > 3.862 s]
> > > [INFO] ------------------------------------------------------------
> > > ------------
> > > [INFO] BUILD FAILURE
> > > [INFO] ------------------------------------------------------------
> > > ------------
> > > [INFO] Total time: 05:48 min (Wall Clock)
> > > [INFO] Finished at: 2018-01-22T12:54:01+01:00
> > > [INFO] Final Memory: 2302M/3653M
> > > [INFO] ------------------------------------------------------------
> > > ------------
> > > [INFO]
> > > [INFO] --- maven-compiler-plugin:3.5.1:testCompile (groovy-tests) @
> > > nifi-solr-processors ---
> > > [INFO] Changes detected - recompiling the module!
> > > [INFO] Nothing to compile - all classes are up to date
> > > [INFO]
> > > [INFO] --- maven-surefire-plugin:2.19.1:test (default-test) @
> > > nifi-solr-processors ---
> > > Tests run: 14, Failures: 0, Errors: 0, Skipped: 0, Time elapsed: 0.691
> > sec
> > > - in org.apache.nifi.processors.aws.cloudwatch.TestPutCloudWatchMetric
> > > Running org.apache.nifi.processors.aws.credentials.provider.service.
> > > AWSCredentialsProviderControllerServiceTest
> > > [ERROR] Failed to execute goal org.apache.maven.plugins:
> > > maven-surefire-plugin:2.19.1:test (default-test) on project
> > > nifi-persistent-provenance-repository: There are test failures.
> > > [ERROR]
> > > [ERROR] Please refer to /home/mmucha/projects/fdp/
> > > nifi/nifi-nar-bundles/nifi-provenance-repository-bundle/
> > > nifi-persistent-provenance-repository/target/surefire-reports for the
> > > individual test results.
> > > [ERROR] -> [Help 1]
> > > [ERROR]
> > > [ERROR] To see the full stack trace of the errors, re-run Maven with
> the
> > > -e switch.
> > > [ERROR] Re-run Maven using the -X switch to enable full debug logging.
> > > [ERROR]
> > > [ERROR] For more information about the errors and possible solutions,
> > > please read the following articles:
> > > [ERROR] [Help 1] http://cwiki.apache.org/confluence/display/MAVEN/
> > > MojoFailureException
> > > [ERROR]
> > > [ERROR] After correcting the problems, you can resume the build with
> the
> > > command
> > > [ERROR]   mvn <goals> -rf :nifi-persistent-provenance-repository
> > >
> > > -------------------------------------------------------
> > >  T E S T S
> > > -------------------------------------------------------
> > > Tests run: 19, Failures: 0, Errors: 0, Skipped: 0, Time elapsed: 0.366
> > sec
> > > - in org.apache.nifi.processors.aws.credentials.provider.service.
> > > AWSCredentialsProviderControllerServiceTest
> > > Running org.apache.nifi.processors.aws.credentials.provider.
> > > service.AWSProcessorProxyTest
> > > Tests run: 4, Failures: 0, Errors: 0, Skipped: 0, Time elapsed: 0.065
> sec
> > > - in org.apache.nifi.processors.aws.credentials.provider.
> > > service.AWSProcessorProxyTest
> > > Running org.apache.nifi.processors.aws.credentials.provider.factory.
> > > TestCredentialsProviderFactory
> > > Tests run: 13, Failures: 0, Errors: 0, Skipped: 2, Time elapsed: 0.944
> > sec
> > > - in org.apache.nifi.processors.elasticsearch.
> TestFetchElasticsearchHttp
> > > Destroying 2 processes
> > > Destroying process..
> > > Destroying process..
> > > Destroyed 2 processes
> > >
> > > Results :
> > >
> > > Tests run: 69, Failures: 0, Errors: 0, Skipped: 8
> > >
> > > [INFO]
> > > [INFO] --- maven-jar-plugin:3.0.0:jar (default-jar) @
> > > nifi-elasticsearch-processors ---
> > >
> > > Results :
> > >
> > > Tests run: 0, Failures: 0, Errors: 0, Skipped: 0
> > >
> > >
> > > Results :
> > >
> > > Tests run: 80, Failures: 0, Errors: 0, Skipped: 1
> > >
> > >
> > > Results :
> > >
> > > Tests run: 0, Failures: 0, Errors: 0, Skipped: 0
> > >
> > >
> > > Results :
> > >
> > > Tests run: 133, Failures: 0, Errors: 0, Skipped: 0
> > >
> > > [INFO] -------------------------------------------------------------
> > > [WARNING] COMPILATION WARNING :
> > > [INFO] -------------------------------------------------------------
> > > [WARNING] /home/mmucha/projects/fdp/nifi/nifi-nar-bundles/nifi-
> > > standard-bundle/nifi-standard-processors/src/main/java/org/
> > > apache/nifi/processors/standard/util/UDPStreamConsumer.java:[31,32]
> > > [deprecation] BufferedOutputStream in org.apache.nifi.stream.io has
> been
> > > deprecated
> > > [WARNING] /home/mmucha/projects/fdp/nifi/nifi-nar-bundles/nifi-
> > > standard-bundle/nifi-standard-processors/src/main/java/org/
> > > apache/nifi/processors/standard/SplitContent.java:[62,32]
> [deprecation]
> > > BufferedInputStream in org.apache.nifi.stream.io has been deprecated
> > > [WARNING] /home/mmucha/projects/fdp/nifi/nifi-nar-bundles/nifi-
> > > standard-bundle/nifi-standard-processors/src/main/java/org/
> > > apache/nifi/processors/standard/ParseCEF.java:[62,32] [deprecation]
> > > BufferedOutputStream in org.apache.nifi.stream.io has been deprecated
> > > [WARNING] /home/mmucha/projects/fdp/nifi/nifi-nar-bundles/nifi-
> > > standard-bundle/nifi-standard-processors/src/main/java/org/
> > > apache/nifi/processors/standard/relp/frame/RELPDecoder.java:[19,32]
> > > [deprecation] ByteArrayOutputStream in org.apache.nifi.stream.io has
> > been
> > > deprecated
> > > [WARNING] /home/mmucha/projects/fdp/nifi/nifi-nar-bundles/nifi-
> > > standard-bundle/nifi-standard-processors/src/main/java/org/
> > > apache/nifi/processors/standard/servlets/
> ListenHTTPServlet.java:[48,32]
> > > [deprecation] BufferedOutputStream in org.apache.nifi.stream.io has
> been
> > > deprecated
> > > [WARNING] /home/mmucha/projects/fdp/nifi/nifi-nar-bundles/nifi-
> > > standard-bundle/nifi-standard-processors/src/main/java/org/
> > > apache/nifi/processors/standard/PostHTTP.java:[41,31] [deprecation]
> > > SSLContextBuilder in org.apache.http.conn.ssl has been deprecated
> > > [WARNING] /home/mmucha/projects/fdp/nifi/nifi-nar-bundles/nifi-
> > > standard-bundle/nifi-standard-processors/src/main/java/org/
> > > apache/nifi/processors/standard/PostHTTP.java:[42,31] [deprecation]
> > > SSLContexts in org.apache.http.conn.ssl has been deprecated
> > > [WARNING] /home/mmucha/projects/fdp/nifi/nifi-nar-bundles/nifi-
> > > standard-bundle/nifi-standard-processors/src/main/java/org/
> > > apache/nifi/processors/standard/PostHTTP.java:[79,32] [deprecation]
> > > BufferedInputStream in org.apache.nifi.stream.io has been deprecated
> > > [WARNING] /home/mmucha/projects/fdp/nifi/nifi-nar-bundles/nifi-
> > > standard-bundle/nifi-standard-processors/src/main/java/org/
> > > apache/nifi/processors/standard/PostHTTP.java:[80,32] [deprecation]
> > > BufferedOutputStream in org.apache.nifi.stream.io has been deprecated
> > > [WARNING] /home/mmucha/projects/fdp/nifi/nifi-nar-bundles/nifi-
> > > standard-bundle/nifi-standard-processors/src/main/java/org/
> > > apache/nifi/processors/standard/JmsConsumer.java:[63,32] [deprecation]
> > > BufferedOutputStream in org.apache.nifi.stream.io has been deprecated
> > > [WARNING] /home/mmucha/projects/fdp/nifi/nifi-nar-bundles/nifi-
> > > standard-bundle/nifi-standard-processors/src/main/java/org/
> > > apache/nifi/processors/standard/PutFileTransfer.java:[21,32]
> > > [deprecation] BufferedInputStream in org.apache.nifi.stream.io has
> been
> > > deprecated
> > > [WARNING] /home/mmucha/projects/fdp/nifi/nifi-nar-bundles/nifi-
> > > standard-bundle/nifi-standard-processors/src/main/java/org/
> > > apache/nifi/processors/standard/AbstractJsonPathProcessor.java:[33,32]
> > > [deprecation] BufferedInputStream in org.apache.nifi.stream.io has
> been
> > > deprecated
> > > [WARNING] /home/mmucha/projects/fdp/nifi/nifi-nar-bundles/nifi-
> > > standard-bundle/nifi-standard-processors/src/main/java/org/
> > > apache/nifi/processors/standard/UnpackContent.java:[67,32]
> [deprecation]
> > > BufferedInputStream in org.apache.nifi.stream.io has been deprecated
> > > [WARNING] /home/mmucha/projects/fdp/nifi/nifi-nar-bundles/nifi-
> > > standard-bundle/nifi-standard-processors/src/main/java/org/
> > > apache/nifi/processors/standard/UnpackContent.java:[68,32]
> [deprecation]
> > > BufferedOutputStream in org.apache.nifi.stream.io has been deprecated
> > > [WARNING] /home/mmucha/projects/fdp/nifi/nifi-nar-bundles/nifi-
> > > standard-bundle/nifi-standard-processors/src/main/java/org/
> > > apache/nifi/processors/standard/SplitXml.java:[36,31] [deprecation]
> > > StringEscapeUtils in org.apache.commons.lang3 has been deprecated
> > > [WARNING] /home/mmucha/projects/fdp/nifi/nifi-nar-bundles/nifi-
> > > standard-bundle/nifi-standard-processors/src/main/java/org/
> > > apache/nifi/processors/standard/SplitXml.java:[57,32] [deprecation]
> > > BufferedInputStream in org.apache.nifi.stream.io has been deprecated
> > > [WARNING] /home/mmucha/projects/fdp/nifi/nifi-nar-bundles/nifi-
> > > standard-bundle/nifi-standard-processors/src/main/java/org/
> > > apache/nifi/processors/standard/EvaluateXQuery.java:[69,32]
> > [deprecation]
> > > BufferedInputStream in org.apache.nifi.stream.io has been deprecated
> > > [WARNING] /home/mmucha/projects/fdp/nifi/nifi-nar-bundles/nifi-
> > > standard-bundle/nifi-standard-processors/src/main/java/org/
> > > apache/nifi/processors/standard/EvaluateXQuery.java:[70,32]
> > [deprecation]
> > > BufferedOutputStream in org.apache.nifi.stream.io has been deprecated
> > > [WARNING] /home/mmucha/projects/fdp/nifi/nifi-nar-bundles/nifi-
> > > standard-bundle/nifi-standard-processors/src/main/java/org/
> > > apache/nifi/processors/standard/ScanContent.java:[56,32] [deprecation]
> > > BufferedInputStream in org.apache.nifi.stream.io has been deprecated
> > > [WARNING] /home/mmucha/projects/fdp/nifi/nifi-nar-bundles/nifi-
> > > standard-bundle/nifi-standard-processors/src/main/java/org/
> > > apache/nifi/processors/standard/util/JmsFactory.java:[71,32]
> > > [deprecation] ByteArrayOutputStream in org.apache.nifi.stream.io has
> > been
> > > deprecated
> > > [WARNING] /home/mmucha/projects/fdp/nifi/nifi-nar-bundles/nifi-
> > > standard-bundle/nifi-standard-processors/src/main/java/org/
> > > apache/nifi/processors/standard/TransformXml.java:[64,32]
> [deprecation]
> > > BufferedInputStream in org.apache.nifi.stream.io has been deprecated
> > > [WARNING] /home/mmucha/projects/fdp/nifi/nifi-nar-bundles/nifi-
> > > standard-bundle/nifi-standard-processors/src/main/java/org/
> > > apache/nifi/processors/standard/EvaluateXPath.java:[78,32]
> [deprecation]
> > > BufferedInputStream in org.apache.nifi.stream.io has been deprecated
> > > [WARNING] /home/mmucha/projects/fdp/nifi/nifi-nar-bundles/nifi-
> > > standard-bundle/nifi-standard-processors/src/main/java/org/
> > > apache/nifi/processors/standard/EvaluateXPath.java:[79,32]
> [deprecation]
> > > BufferedOutputStream in org.apache.nifi.stream.io has been deprecated
> > > [WARNING] /home/mmucha/projects/fdp/nifi/nifi-nar-bundles/nifi-
> > > standard-bundle/nifi-standard-processors/src/main/java/org/
> > > apache/nifi/processors/standard/CompressContent.java:[56,32]
> > > [deprecation] BufferedInputStream in org.apache.nifi.stream.io has
> been
> > > deprecated
> > > [WARNING] /home/mmucha/projects/fdp/nifi/nifi-nar-bundles/nifi-
> > > standard-bundle/nifi-standard-processors/src/main/java/org/
> > > apache/nifi/processors/standard/CompressContent.java:[57,32]
> > > [deprecation] BufferedOutputStream in org.apache.nifi.stream.io has
> been
> > > deprecated
> > > [WARNING] warning: unknown enum constant ThreadingBehavior.IMMUTABLE
> > >   reason: class file for org.apache.http.annotation.ThreadingBehavior
> > not
> > > found
> > > warning: unknown enum constant ThreadingBehavior.IMMUTABLE
> > > warning: unknown enum constant ThreadingBehavior.IMMUTABLE
> > > warning: unknown enum constant ThreadingBehavior.IMMUTABLE
> > > warning: unknown enum constant ThreadingBehavior.SAFE
> > > warning: unknown enum constant ThreadingBehavior.IMMUTABLE
> > > warning: unknown enum constant ThreadingBehavior.SAFE
> > > warning: unknown enum constant ThreadingBehavior.SAFE
> > > warning: unknown enum constant ThreadingBehavior.SAFE_CONDITIONAL
> > > warning: unknown enum constant ThreadingBehavior.SAFE_CONDITIONAL
> > > /home/mmucha/projects/fdp/nifi/nifi-nar-bundles/nifi-
> > > standard-bundle/nifi-standard-processors/src/main/java/org/
> > > apache/nifi/processors/standard/ListFileTransfer.java:[107,19]
> > > [deprecation] closeQuietly(Closeable) in IOUtils has been deprecated
> > > [INFO] 26 warnings
> > > [INFO] -------------------------------------------------------------
> > >
> > > Results :
> > >
> > > Tests run: 33, Failures: 0, Errors: 0, Skipped: 1
> > >
> > >
> > >
> > >
> >
>

Mime
  • Unnamed multipart/alternative (inline, None, 0 bytes)
View raw message