nifi-commits mailing list archives

Site index · List index
Message view « Date » · « Thread »
Top « Date » · « Thread »
From "Aldrin Piri (JIRA)" <j...@apache.org>
Subject [jira] [Created] (NIFI-705) TestHandleHttpRequest#testRequestAddedToService fails in Ubuntu 14.04
Date Fri, 19 Jun 2015 20:41:00 GMT
Aldrin Piri created NIFI-705:
--------------------------------

             Summary: TestHandleHttpRequest#testRequestAddedToService fails in Ubuntu 14.04
                 Key: NIFI-705
                 URL: https://issues.apache.org/jira/browse/NIFI-705
             Project: Apache NiFi
          Issue Type: Bug
          Components: Extensions
    Affects Versions: 0.1.0
            Reporter: Aldrin Piri
            Assignee: Aldrin Piri


Tests run: 1, Failures: 1, Errors: 0, Skipped: 0, Time elapsed: 6.675 sec <<< FAILURE!
- in org.apache.nifi.processors.standard.TestHandleHttpRequest testRequestAddedToService(org.apache.nifi.processors.standard.TestHandleHttpRequest)
 Time elapsed: 6.675 sec  <<< FAILURE! java.lang.AssertionError: Could not invoke
methods annotated with @OnScheduled annotation due to: java.lang.reflect.InvocationTargetException
        at org.junit.Assert.fail(Assert.java:88)         at org.apache.nifi.util.StandardProcessorTestRunner.run(StandardProcessorTestRunner.java:199)
        at org.apache.nifi.util.StandardProcessorTestRunner.run(StandardProcessorTestRunner.java:182)
        at org.apache.nifi.processors.standard.TestHandleHttpRequest.testRequestAddedToService(TestHandleHttpRequest.java:100)
...



--
This message was sent by Atlassian JIRA
(v6.3.4#6332)

Mime
View raw message