myfaces-notifications mailing list archives

Site index · List index
Message view « Date » · « Thread »
Top « Date » · « Thread »
From "Continuum@myfaces.zones.apache.org" <notificati...@myfaces.apache.org>
Subject [continuum] BUILD FAILURE: Apache MyFaces Site
Date Mon, 19 Apr 2010 18:01:34 GMT
Online report : http://myfaces.zones.apache.org:8080/continuum/buildResult.action?buildId=26358&projectId=83

Build statistics:
  State: Failed
  Previous State: Failed
  Started at: Mon 19 Apr 2010 18:00:39 +0000
  Finished at: Mon 19 Apr 2010 18:01:23 +0000
  Total time: 44s
  Build Trigger: Schedule
  Build Number: 736
  Exit code: 1
  Building machine hostname: myfaces.zones.apache.org
  Operating system : SunOS(unknown)
  Java Home version : 
          java version "1.5.0_22"
          Java(TM) 2 Runtime Environment, Standard Edition (build 1.5.0_22-b03)
          Java HotSpot(TM) Server VM (build 1.5.0_22-b03, mixed mode)
        
  Builder version :
          Maven version: 2.0.10
          Java version: 1.5.0_22
          OS name: "sunos" version: "5.10" arch: "x86" Family: "unix"
    
****************************************************************************
SCM Changes:
****************************************************************************
Changed: no author @ no date
Comment: no comment
Files changed:
  83/src/site/site.xml ( no revision )
  83/src/site/apt/jsfintro.apt ( no revision )
  83/src/site/apt/download.apt ( no revision )
  83/src/site/apt/index.apt ( no revision )
  83/src/site/apt/format.apt ( no revision )
  83/src/site/apt/news-archive.apt ( no revision )
  83/src/site/apt/otherProjects.apt ( no revision )
  83/src/site/resources/doap_MyFaces.rdf ( no revision )
  83/src/site/resources/images/logo.png ( no revision )
  83/src/site/resources/images/external.png ( no revision )
  83/src/site/resources/images/transparent.gif ( no revision )
  83/src/site/resources/images/easter.png ( no revision )
  83/src/site/resources/images/myfaces-logo.png ( no revision )
  83/src/site/resources/images/javaone2005/session/CIMG0298.jpg ( no revision )
  83/src/site/resources/images/javaone2005/session/CIMG0311.jpg ( no revision )
  83/src/site/resources/images/javaone2005/session/CIMG0314.jpg ( no revision )
  83/src/site/resources/images/javaone2005/session/CIMG0306.jpg ( no revision )
  83/src/site/resources/images/javaone2005/cometogether/IMG_0798.jpg ( no revision )
  83/src/site/resources/images/javaone2005/cometogether/IMG_0800.jpg ( no revision )
  83/src/site/resources/images/javaone2005/cometogether/IMG_0799.jpg ( no revision )
  83/src/site/resources/images/javaone2005/cometogether/IMG_0801.jpg ( no revision )
  83/src/site/resources/images/javaone2005/cometogether/IMG_0802.jpg ( no revision )
  83/src/site/resources/images/javaone2005/cometogether/IMG_0803.jpg ( no revision )
  83/src/site/resources/images/javaone2005/cometogether/IMG_0804.jpg ( no revision )
  83/src/site/resources/images/javaone2005/cometogether/CIMG0325.jpg ( no revision )
  83/src/site/resources/images/javaone2005/cometogether/CIMG0326.jpg ( no revision )
  83/src/site/resources/images/javaone2005/cometogether/CIMG0328.jpg ( no revision )
  83/src/site/resources/images/javaone2005/cometogether/CIMG0329.jpg ( no revision )
  83/src/site/resources/images/dl.jpg ( no revision )
  83/src/site/resources/notes/tomahawk_1_1_3.txt ( no revision )
  83/src/site/resources/archetype-catalog.xml ( no revision )
  83/src/site/xdoc/buildhowto.xml ( no revision )
  83/src/site/xdoc/source.xml ( no revision )
  83/src/site/xdoc/project_management/bylaws.xml ( no revision )
  83/src/site/xdoc/project_management/legal.xml ( no revision )
  83/src/site/xdoc/project_management/contributors.xml ( no revision )
  83/src/site/xdoc/community/poweredbymyfaces.xml ( no revision )
  83/src/site/xdoc/community/javaone2005.xml ( no revision )
  83/src/site/xdoc/community/javaone2005_session.xml ( no revision )
  83/src/site/xdoc/community/javaone2005_cometogether.xml ( no revision )
  83/src/site/xdoc/svn.xml ( no revision )
  83/src/site/xdoc/tomcat.xml ( no revision )
  83/src/site/xdoc/cardemoweb.xml ( no revision )
  83/src/site/xdoc/gettingstarted.xml ( no revision )
  83/src/site/xdoc/issue.xml ( no revision )
  83/src/site/xdoc/docs/tomcat55.xml ( no revision )
  83/src/site/xdoc/docs/tomcat4x.xml ( no revision )
  83/src/site/xdoc/docs/sf.xml ( no revision )
  83/src/site/xdoc/docs/portlet.xml ( no revision )
  83/src/site/xdoc/docs/bootstrap.xml ( no revision )
  83/src/site/xdoc/docs/jars.xml ( no revision )
  83/src/site/xdoc/xdoc.xml ( no revision )
  83/src/site/xdoc/mailinglists.xml ( no revision )
  83/src/site/xdoc/risamples.xml ( no revision )
  83/src/site/fml/faq.fml ( no revision )
  83/pom.xml ( no revision )
  83/bis_MYFACES.rdf ( no revision )

****************************************************************************
Dependencies Changes:
****************************************************************************
No dependencies changed

****************************************************************************
Test Summary:
****************************************************************************
Tests: 0
Failures: 0
Total time: 0

****************************************************************************
Output:
****************************************************************************
[INFO] Scanning for projects...
[INFO] ------------------------------------------------------------------------
[INFO] Building Apache MyFaces Site
[INFO]    task-segment: [clean, site-deploy]
[INFO] ------------------------------------------------------------------------
[INFO] [clean:clean]
[INFO] Setting property: classpath.resource.loader.class => 'org.codehaus.plexus.velocity.ContextClassLoaderResourceLoader'.
[INFO] Setting property: velocimacro.messages.on => 'false'.
[INFO] Setting property: resource.loader => 'classpath'.
[INFO] Setting property: resource.manager.logwhenfound => 'false'.
[INFO] ************************************************************** 
[INFO] Starting Jakarta Velocity v1.4
[INFO] RuntimeInstance initializing.
[INFO] Default Properties File: org/apache/velocity/runtime/defaults/velocity.properties
[INFO] Default ResourceManager initializing. (class org.apache.velocity.runtime.resource.ResourceManagerImpl)
[INFO] Resource Loader Instantiated: org.codehaus.plexus.velocity.ContextClassLoaderResourceLoader
[INFO] ClasspathResourceLoader : initialization starting.
[INFO] ClasspathResourceLoader : initialization complete.
[INFO] ResourceCache : initialized. (class org.apache.velocity.runtime.resource.ResourceCacheImpl)
[INFO] Default ResourceManager initialization complete.
[INFO] Loaded System Directive: org.apache.velocity.runtime.directive.Literal
[INFO] Loaded System Directive: org.apache.velocity.runtime.directive.Macro
[INFO] Loaded System Directive: org.apache.velocity.runtime.directive.Parse
[INFO] Loaded System Directive: org.apache.velocity.runtime.directive.Include
[INFO] Loaded System Directive: org.apache.velocity.runtime.directive.Foreach
[INFO] Created: 20 parsers.
[INFO] Velocimacro : initialization starting.
[INFO] Velocimacro : adding VMs from VM library template : VM_global_library.vm
[ERROR] ResourceManager : unable to find resource 'VM_global_library.vm' in any resource loader.
[INFO] Velocimacro : error using  VM library template VM_global_library.vm : org.apache.velocity.exception.ResourceNotFoundException:
Unable to find resource 'VM_global_library.vm'
[INFO] Velocimacro :  VM library template macro registration complete.
[INFO] Velocimacro : allowInline = true : VMs can be defined inline in templates
[INFO] Velocimacro : allowInlineToOverride = false : VMs defined inline may NOT replace previous
VM definitions
[INFO] Velocimacro : allowInlineLocal = false : VMs defined inline will be  global in scope
if allowed.
[INFO] Velocimacro : initialization complete.
[INFO] Velocity successfully started.
[INFO] Preparing findbugs:findbugs
[INFO] Setting property: classpath.resource.loader.class => 'org.codehaus.plexus.velocity.ContextClassLoaderResourceLoader'.
[INFO] Setting property: velocimacro.messages.on => 'false'.
[INFO] Setting property: resource.loader => 'classpath'.
[INFO] Setting property: resource.manager.logwhenfound => 'false'.
[INFO] [remote-resources:process {execution: default}]
[INFO] Preparing jdepend:generate
[INFO] [remote-resources:process {execution: default}]
[INFO] [site:site]
[INFO] Unable to load parent project from a relative path: Could not find the model file '/local/continuum-1.1-beta-2/working-directory/pom.xml'.
for project unknown
[INFO] Parent project loaded from repository.
[INFO] Parent project loaded from repository.
[INFO] Skipped "About" report, file "index.html" already exists for the English version.
[INFO] Generating "Issue Tracking" report.
[INFO] Generating "Project Summary" report.
[INFO] Generating "CPD Report" report.
[WARNING] Unable to locate Source XRef to link to - DISABLED
[INFO] Generating "Plugin Management" report.
[INFO] Generating "Continuous Integration" report.
[INFO] Generating "Dependencies" report.
[INFO] Generating "Project Plugins" report.
[INFO] Generating "PMD Report" report.
[WARNING] Unable to locate Source XRef to link to - DISABLED
[INFO] Generating "Mailing Lists" report.
[INFO] Generating "Source Repository" report.
[INFO] Generating "Project Team" report.
[INFO] Generating "Project License" report.
[INFO] Generating "Dependency Management" report.
[INFO] [site:deploy]
scpexe://minotaur.apache.org/www/myfaces.apache.org - Session: Opened  
Using private key: /export/home/mrmaven/.m2/identity
Executing command: /bin/sh -c ssh -i /export/home/mrmaven/.m2/identity -o 'BatchMode yes'
schof@minotaur.apache.org 'mkdir -p /www/myfaces.apache.org/.'

WARNING: DSA key found for host minotaur.apache.org
in /export/home/mrmaven/.ssh/known_hosts:2
DSA key fingerprint 79:7c:cb:6a:44:47:b2:ef:5c:66:28:d7:40:0d:b1:f9.
Host key verification failed.

scpexe://minotaur.apache.org/www/myfaces.apache.org - Session: Disconnecting  
scpexe://minotaur.apache.org/www/myfaces.apache.org - Session: Disconnected
[INFO] ------------------------------------------------------------------------
[ERROR] BUILD ERROR
[INFO] ------------------------------------------------------------------------
[INFO] Error uploading site

Embedded error: Error performing commands for file transfer
Exit code 255 - WARNING: DSA key found for host minotaur.apache.org
in /export/home/mrmaven/.ssh/known_hosts:2
DSA key fingerprint 79:7c:cb:6a:44:47:b2:ef:5c:66:28:d7:40:0d:b1:f9.
Host key verification failed.

[INFO] ------------------------------------------------------------------------
[INFO] For more information, run Maven with the -e switch
[INFO] ------------------------------------------------------------------------
[INFO] Total time: 41 seconds
[INFO] Finished at: Mon Apr 19 18:01:22 GMT+00:00 2010
[INFO] Final Memory: 38M/93M
[INFO] ------------------------------------------------------------------------

****************************************************************************



Mime
View raw message