myfaces-dev mailing list archives

Site index · List index
Message view « Date » · « Thread »
Top « Date » · « Thread »
From Leonardo Uribe <lu4...@gmail.com>
Subject Re: MyFaces 2.2.9?
Date Mon, 16 Nov 2015 21:54:15 GMT
Hi

Nevermind, I have found the issue on jira:

https://issues.apache.org/jira/browse/INFRA-10298

regards,

Leonardo Uribe

2015-11-16 16:16 GMT-05:00 Leonardo Uribe <lu4242@gmail.com>:

> Hi
>
> I tried to release master pom and I have this bug when I tried
> release:perform :
>
> Failed to execute goal
> org.apache.maven.plugins:maven-deploy-plugin:2.8.2:deploy
> (default-deploy) on project myfaces: Failed to deploy artifacts: Could
> not transfer artifact org.apache.myfaces:myfaces:pom:16 from/to
> apache.releases.https
> (https://repository.apache.org/service/local/staging/deploy/maven2):
> java.lang.RuntimeException: Could not generate DH keypair: Prime size
> must be multiple of 64, and can only range from 512 to 1024
> (inclusive) -> [Help 1]
>
> Something changed on nexus. Does anybody knows what could be? I tried
> to change to bountycastle and it doesn't work to:
>
> [INFO] [INFO] --- maven-deploy-plugin:2.7:deploy (default-deploy) @
> myfaces ---
> [INFO] Nov 16, 2015 3:56:12 PM
> org.sonatype.guice.bean.reflect.Logs$JULSink warn
> [INFO] WARNING: Error injecting:
> org.apache.maven.wagon.providers.http.HttpWagon$__plexus1
> [INFO] java.lang.ExceptionInInitializerError
> [INFO]  at sun.reflect.NativeConstructorAccessorImpl.newInstance0(Native
> Method)
> [INFO]  at
> sun.reflect.NativeConstructorAccessorImpl.newInstance(NativeConstructorAccessorImpl.java:39)
> [INFO]  at
> sun.reflect.DelegatingConstructorAccessorImpl.newInstance(DelegatingConstructorAccessorImpl.java:27)
> [INFO]  at java.lang.reflect.Constructor.newInstance(Constructor.java:513)
> [INFO]  at
> com.google.inject.internal.DefaultConstructionProxyFactory$1.newInstance(DefaultConstructionProxyFactory.java:86)
> [INFO]  at
> com.google.inject.internal.ConstructorInjector.provision(ConstructorInjector.java:108)
> [INFO]  at
> com.google.inject.internal.ConstructorInjector.access$000(ConstructorInjector.java:32)
> [INFO]  at
> com.google.inject.internal.ConstructorInjector$1.call(ConstructorInjector.java:91)
> [INFO]  at
> com.google.inject.internal.ProvisionListenerStackCallback$Provision.provision(ProvisionListenerStackCallback.java:100)
> [INFO]  at
> com.google.inject.internal.ProvisionListenerStackCallback$Provision.provision(ProvisionListenerStackCallback.java:115)
> [INFO]  at
> com.google.inject.internal.ProvisionListenerStackCallback.provision(ProvisionListenerStackCallback.java:55)
> [INFO]  at
> com.google.inject.internal.ConstructorInjector.construct(ConstructorInjector.java:89)
> [INFO]  at
> com.google.inject.internal.ConstructorBindingImpl$Factory.get(ConstructorBindingImpl.java:259)
> [INFO]  at
> com.google.inject.internal.InjectorImpl$3$1.call(InjectorImpl.java:965)
> [INFO]  at
> com.google.inject.internal.InjectorImpl.callInContext(InjectorImpl.java:1018)
> [INFO]  at
> com.google.inject.internal.InjectorImpl$3.get(InjectorImpl.java:961)
> [INFO]  at
> com.google.inject.internal.InjectorImpl.getInstance(InjectorImpl.java:1000)
> [INFO]  at
> org.sonatype.guice.bean.reflect.AbstractDeferredClass.get(AbstractDeferredClass.java:45)
> [INFO]  at
> com.google.inject.internal.ProviderInternalFactory.provision(ProviderInternalFactory.java:84)
> [INFO]  at
> com.google.inject.internal.InternalFactoryToInitializableAdapter.provision(InternalFactoryToInitializableAdapter.java:52)
> [INFO]  at
> com.google.inject.internal.ProviderInternalFactory$1.call(ProviderInternalFactory.java:70)
> [INFO]  at
> com.google.inject.internal.ProvisionListenerStackCallback$Provision.provision(ProvisionListenerStackCallback.java:100)
> [INFO]  at
> org.sonatype.guice.plexus.lifecycles.PlexusLifecycleManager.onProvision(PlexusLifecycleManager.java:138)
> [INFO]  at
> com.google.inject.internal.ProvisionListenerStackCallback$Provision.provision(ProvisionListenerStackCallback.java:108)
> [INFO]  at
> com.google.inject.internal.ProvisionListenerStackCallback.provision(ProvisionListenerStackCallback.java:55)
> [INFO]  at
> com.google.inject.internal.ProviderInternalFactory.circularGet(ProviderInternalFactory.java:68)
> [INFO]  at
> com.google.inject.internal.InternalFactoryToInitializableAdapter.get(InternalFactoryToInitializableAdapter.java:45)
> [INFO]  at
> com.google.inject.internal.InjectorImpl$3$1.call(InjectorImpl.java:965)
> [INFO]  at
> com.google.inject.internal.InjectorImpl.callInContext(InjectorImpl.java:1011)
> [INFO]  at
> com.google.inject.internal.InjectorImpl$3.get(InjectorImpl.java:961)
> [INFO]  at com.google.inject.Scopes$1$1.get(Scopes.java:59)
> [INFO]  at
> org.sonatype.guice.bean.locators.LazyBeanEntry.getValue(LazyBeanEntry.java:83)
> [INFO]  at
> org.sonatype.guice.plexus.locators.LazyPlexusBean.getValue(LazyPlexusBean.java:49)
> [INFO]  at
> org.codehaus.plexus.DefaultPlexusContainer.lookup(DefaultPlexusContainer.java:253)
> [INFO]  at
> org.codehaus.plexus.DefaultPlexusContainer.lookup(DefaultPlexusContainer.java:245)
> [INFO]  at
> org.sonatype.aether.connector.wagon.PlexusWagonProvider.lookup(PlexusWagonProvider.java:32)
> [INFO]  at
> org.sonatype.aether.connector.wagon.WagonRepositoryConnector.lookupWagon(WagonRepositoryConnector.java:282)
> [INFO]  at
> org.sonatype.aether.connector.wagon.WagonRepositoryConnector.<init>(WagonRepositoryConnector.java:154)
> [INFO]  at
> org.sonatype.aether.connector.wagon.WagonRepositoryConnectorFactory.newInstance(WagonRepositoryConnectorFactory.java:142)
> [INFO]  at
> org.sonatype.aether.impl.internal.DefaultRemoteRepositoryManager.getRepositoryConnector(DefaultRemoteRepositoryManager.java:346)
> [INFO]  at
> org.sonatype.aether.impl.internal.DefaultDeployer.deploy(DefaultDeployer.java:231)
> [INFO]  at
> org.sonatype.aether.impl.internal.DefaultDeployer.deploy(DefaultDeployer.java:211)
> [INFO]  at
> org.sonatype.aether.impl.internal.DefaultRepositorySystem.deploy(DefaultRepositorySystem.java:443)
> [INFO]  at
> org.apache.maven.artifact.deployer.DefaultArtifactDeployer.deploy(DefaultArtifactDeployer.java:137)
> [INFO]  at
> org.apache.maven.plugin.deploy.AbstractDeployMojo.deploy(AbstractDeployMojo.java:167)
> [INFO]  at
> org.apache.maven.plugin.deploy.DeployMojo.execute(DeployMojo.java:149)
> [INFO] [INFO] [INFO]
> ------------------------------------------------------------------------
>         at
> org.apache.maven.plugin.DefaultBuildPluginManager.executeMojo(DefaultBuildPluginManager.java:101)
> [INFO]  at
> org.apache.maven.lifecycle.internal.MojoExecutor.execute(MojoExecutor.java:209)
> [INFO]  at
> org.apache.maven.lifecycle.internal.MojoExecutor.execute(MojoExecutor.java:153)
> [INFO]  at
> org.apache.maven.lifecycle.internal.MojoExecutor.execute(MojoExecutor.java:145)
> [INFO] [INFO] BUILD FAILURE
> [INFO]  at
> org.apache.maven.lifecycle.internal.LifecycleModuleBuilder.buildProject(LifecycleModuleBuilder.java:84)
> [INFO]  at
> org.apache.maven.lifecycle.internal.LifecycleModuleBuilder.buildProject(LifecycleModuleBuilder.java:59)
> [INFO]  at
> org.apache.maven.lifecycle.internal.LifecycleStarter.singleThreadedBuild(LifecycleStarter.java:183)
> [INFO] [INFO]
> ------------------------------------------------------------------------
> [INFO]  at
> org.apache.maven.lifecycle.internal.LifecycleStarter.execute(LifecycleStarter.java:161)
> [INFO]  at org.apache.maven.DefaultMaven.doExecute(DefaultMaven.java:320)
> [INFO]  at org.apache.maven.DefaultMaven.execute(DefaultMaven.java:156)
> [INFO]  at org.apache.maven.cli.MavenCli.execute(MavenCli.java:537)
> [INFO]  at org.apache.maven.cli.MavenCli.doMain(MavenCli.java:196)
> [INFO]  at org.apache.maven.cli.MavenCli.main(MavenCli.java:141)
> [INFO]  at sun.reflect.NativeMethodAccessorImpl.invoke0(Native Method)
> [INFO]  at
> sun.reflect.NativeMethodAccessorImpl.invoke(NativeMethodAccessorImpl.java:39)
> [INFO]  at
> sun.reflect.DelegatingMethodAccessorImpl.invoke(DelegatingMethodAccessorImpl.java:25)
> [INFO]  at java.lang.reflect.Method.invoke(Method.java:597)
> [INFO]  at
> org.codehaus.plexus.classworlds.launcher.Launcher.launchEnhanced(Launcher.java:290)
> [INFO]  at
> org.codehaus.plexus.classworlds.launcher.Launcher.launch(Launcher.java:230)
> [INFO] [INFO] Total time: 31.852s
> [INFO]  at
> org.codehaus.plexus.classworlds.launcher.Launcher.mainWithExitCode(Launcher.java:409)
> [INFO]  at
> org.codehaus.plexus.classworlds.launcher.Launcher.main(Launcher.java:352)
> [INFO] Caused by: java.lang.IllegalStateException: Failure
> initializing default SSL context
> [INFO]  at
> org.apache.maven.wagon.providers.http.httpclient.conn.ssl.SSLSocketFactory.createDefaultSSLContext(SSLSocketFactory.java:211)
> [INFO]  at
> org.apache.maven.wagon.providers.http.httpclient.conn.ssl.SSLSocketFactory.<init>(SSLSocketFactory.java:333)
> [INFO] [INFO] Finished at: Mon Nov 16 15:56:12 GMT 2015
> [INFO]  at
> org.apache.maven.wagon.providers.http.httpclient.conn.ssl.SSLSocketFactory.getSocketFactory(SSLSocketFactory.java:165)
> [INFO]  at
> org.apache.maven.wagon.providers.http.httpclient.impl.conn.SchemeRegistryFactory.createDefault(SchemeRegistryFactory.java:45)
> [INFO]  at
> org.apache.maven.wagon.providers.http.httpclient.impl.conn.tsccm.ThreadSafeClientConnManager.<init>(ThreadSafeClientConnManager.java:98)
> [INFO]  at
> org.apache.maven.wagon.shared.http4.AbstractHttpClientWagon.<clinit>(AbstractHttpClientWagon.java:267)
> [INFO]  ... 67 more
> [INFO] Caused by: java.security.KeyStoreException: problem accessing
> trust storejava.security.KeyStoreException: jks not found
> [INFO]  at
> com.sun.net.ssl.internal.ssl.TrustManagerFactoryImpl.engineInit(TrustManagerFactoryImpl.java:55)
> [INFO]  at
> javax.net.ssl.TrustManagerFactory.init(TrustManagerFactory.java:230)
> [INFO]  at
> org.apache.maven.wagon.providers.http.httpclient.conn.ssl.SSLSocketFactory.createSSLContext(SSLSocketFactory.java:190)
> [INFO]  at
> org.apache.maven.wagon.providers.http.httpclient.conn.ssl.SSLSocketFactory.createDefaultSSLContext(SSLSocketFactory.java:209)
> [INFO]  ... 72 more
> [INFO] [INFO] Final Memory: 23M/437M
> [INFO] [INFO]
> ------------------------------------------------------------------------
> [INFO] [ERROR] Failed to execute goal
> org.apache.maven.plugins:maven-deploy-plugin:2.7:deploy
> (default-deploy) on project myfaces: Execution default-deploy of goal
> org.apache.maven.plugins:maven-deploy-plugin:2.7:deploy failed: An API
> incompatibility was encountered while executing
> org.apache.maven.plugins:maven-deploy-plugin:2.7:deploy:
> java.lang.ExceptionInInitializerError: null
> [INFO] [ERROR] -----------------------------------------------------
> [INFO] [ERROR] realm =
> plugin>org.apache.maven.plugins:maven-deploy-plugin:2.7
> [INFO] [ERROR] strategy =
> org.codehaus.plexus.classworlds.strategy.SelfFirstStrategy
> [INFO] [ERROR] urls[0] =
>
> file:/home/lu4242/.m2/repository/org/apache/maven/plugins/maven-deploy-plugin/2.7/maven-deploy-plugin-2.7.jar
> [INFO] [ERROR] urls[1] =
> file:/home/lu4242/.m2/repository/junit/junit/3.8.1/junit-3.8.1.jar
> [INFO] [ERROR] urls[2] =
>
> file:/home/lu4242/.m2/repository/org/codehaus/plexus/plexus-utils/1.5.6/plexus-utils-1.5.6.jar
> [INFO] [ERROR] Number of foreign imports: 1
> [INFO] [ERROR] import: Entry[import  from realm ClassRealm[maven.api,
> parent: null]]
> [INFO] [ERROR]
> [INFO] [ERROR] -----------------------------------------------------:
> Failure initializing default SSL context: problem accessing trust
> storejava.security.KeyStoreException: jks not found
> [INFO] [ERROR] -> [Help 1]
> [INFO] [ERROR]
> [INFO] [ERROR] To see the full stack trace of the errors, re-run Maven
> with the -e switch.
> [INFO] [ERROR] Re-run Maven using the -X switch to enable full debug
> logging.
> [INFO] [ERROR]
> [INFO] [ERROR] For more information about the errors and possible
> solutions, please read the following articles:
> [INFO] [ERROR] [Help 1]
> http://cwiki.apache.org/confluence/display/MAVEN/PluginContainerException
> [INFO]
> ------------------------------------------------------------------------
> [INFO] BUILD FAILURE
> [INFO]
> ------------------------------------------------------------------------
> [INFO] Total time: 46.496s
> [INFO] Finished at: Mon Nov 16 15:56:12 GMT 2015
> [INFO] Final Memory: 13M/309M
> [INFO]
> ------------------------------------------------------------------------
> [ERROR] Failed to execute goal
> org.apache.maven.plugins:maven-release-plugin:2.2.1:perform
> (default-cli) on project myfaces: Maven execution failed, exit code:
> '1' -> [Help 1]
> [ERROR]
> [ERROR] To see the full stack trace of the errors, re-run Maven with
> the -e switch.
> [ERROR] Re-run Maven using the -X switch to enable full debug logging.
> [ERROR]
> [ERROR] For more information about the errors and possible solutions,
> please read the following articles:
> [ERROR] [Help 1]
> http://cwiki.apache.org/confluence/display/MAVEN/MojoExecutionException
>
> regards,
>
> Leonardo Uribe
>
> 2015-11-16 15:38 GMT, Dennis Kieselhorst <mail@dekies.de>:
> > +1
> >
> > We should also release master-pom, I fixed hudson and mailinglist links.
> >
>

Mime
View raw message