myfaces-dev mailing list archives

Site index · List index
Message view « Date » · « Thread »
Top « Date » · « Thread »
From "Cagatay Civici" <cagatay.civ...@gmail.com>
Subject Re: Tomahawk test failure
Date Wed, 09 Aug 2006 08:48:07 GMT
Done, test should pass at any time now.

On 8/8/06, Matthias Wessendorf <matzew@apache.org> wrote:
>
> cool
>
> On 8/8/06, Cagatay Civici <cagatay.civici@gmail.com> wrote:
> > The test has some daylight problems, failure/success changes during the
> day.
> >
> > Mario has made some changes but seems the problem continues.
> >
> > I'm working on to fix it now.
> >
> > Cagatay
> >
> >
> >  On 8/8/06, Matthias Wessendorf <matzew@apache.org> wrote:
> > > continuum test to a special time,
> > > when this test passes.
> > >
> > > try tomorrow morning...
> > > I was not able to look into it yet,
> > > but Sean, Mario and me already noticed the same.
> > >
> > > I was about to uncomment it first
> > >
> > > On 8/7/06, Wendy Smoak <wsmoak@gmail.com> wrote:
> > > > I don't see Continuum complaining.  Does anyone else see a test
> > > > failure in Tomahawk?
> > > >
> > > > $ mvn clean install
> > > > ...
> > > > Compiling 22 source files to
> > > >
> > c:\svn\myfaces\current\tomahawk\core\target\test-classes
> > > > [INFO] [surefire:test]
> > > > [INFO] Surefire report directory:
> > > >
> > c:\svn\myfaces\current\tomahawk\core\target\surefire-reports
> > > > ...
> > > > Running org.apache.myfaces.custom.date.UserDataTest
> > > > Tests run: 12, Failures: 1, Errors: 0, Skipped: 0, Time elapsed:
> 0.031
> > > > sec <<< FAILURE!
> > > >
> > > > From tomahawk/core/target/surefire-reports:
> > > > Test set: org.apache.myfaces.custom.date.UserDataTest
> > > >
> >
> -------------------------------------------------------------------------------
> > > > Tests run: 12, Failures: 1, Errors: 0, Skipped: 0, Time elapsed:
> 0.047
> > > > sec <<< FAILURE!
> > > >
> > testParseGivesCorrectDateWhenValidDataIsEnteredForTypeDate(
> org.apache.myfaces.cu
> > > > stom.date.UserDataTest)  Time elapsed: 0 sec  <<< FAILURE!
> > > > junit.framework.ComparisonFailure: expected:<20...> but
> > was:<19...>
> > > >         at
> > junit.framework.Assert.assertEquals(Assert.java:81)
> > > >         at
> > junit.framework.Assert.assertEquals(Assert.java :87)
> > > >         at
> > org.apache.myfaces.custom.date.UserDataTest.testParseGivesCorrectDate
> > > > WhenValidDataIsEnteredForTypeDate(UserDataTest.java:66)
> > > >
> > > > Thanks,
> > > > Wendy
> > > >
> > >
> > >
> > > --
> > > Matthias Wessendorf
> > >
> > > further stuff:
> > > blog: http://jroller.com/page/mwessendorf
> > > mail: mwessendorf-at-gmail-dot-com
> > >
> >
> >
>
>
> --
> Matthias Wessendorf
>
> further stuff:
> blog: http://jroller.com/page/mwessendorf
> mail: mwessendorf-at-gmail-dot-com
>

Mime
View raw message