myfaces-dev mailing list archives

Site index · List index
Message view « Date » · « Thread »
Top « Date » · « Thread »
From "Dennis Byrne" <den...@dbyrne.net>
Subject Re: [continuum] BUILD FAILURE: MyFaces Shared Core
Date Tue, 18 Jul 2006 06:48:09 GMT
This works fine after a fresh co and a "mvn clean install" now.  How does one go about slapping
Continuum in order to make this stop?

Dennis Byrne

>-----Original Message-----
>From: Continuum@myfaces.zones.apache.org [mailto:mrmaven@myfaces.zones.apache.org]
>Sent: Tuesday, July 18, 2006 02:38 AM
>To: commits@myfaces.apache.org
>Subject: [continuum] BUILD FAILURE: MyFaces Shared Core
>
>Online report : http://myfaces.zones.apache.org:8080/continuum/servlet/continuum/target/ProjectBuild.vm/view/ProjectBuild/id/76/buildId/2866
>Build statistics:
>  State: Failed
>  Previous State: Failed
>  Started at: Tue, 18 Jul 2006 06:38:28 +0000
>  Finished at: Tue, 18 Jul 2006 06:38:34 +0000
>  Total time: 6s
>  Build Trigger: Forced
>  Exit code: 1
>  Building machine hostname: myfaces.zones.apache.org
>  Operating system : SunOS(unknown)
>  Java version : 1.5.0_06(Sun Microsystems Inc.)
>
>Changes
>      No files changed
>  
>****************************************************************************
>Output:
>****************************************************************************
>[INFO] Scanning for projects...
>[INFO] ----------------------------------------------------------------------------
>[INFO] Building MyFaces Shared Core
>[INFO]    task-segment: [clean, install]
>[INFO] ----------------------------------------------------------------------------
>[INFO] [clean:clean]
>[INFO] Deleting directory /local/continuum-1.0.3-SNAPSHOT/apps/continuum/working-directory/76/target
>[INFO] Deleting directory /local/continuum-1.0.3-SNAPSHOT/apps/continuum/working-directory/76/target/classes
>[INFO] Deleting directory /local/continuum-1.0.3-SNAPSHOT/apps/continuum/working-directory/76/target/test-classes
>[INFO] [resources:resources]
>[INFO] Using default encoding to copy filtered resources.
>[INFO] [compiler:compile]
>Compiling 94 source files to /local/continuum-1.0.3-SNAPSHOT/apps/continuum/working-directory/76/target/classes
>[INFO] ------------------------------------------------------------------------
>[ERROR] BUILD FAILURE
>[INFO] ------------------------------------------------------------------------
>[INFO] Compilation failure
>
>/local/continuum-1.0.3-SNAPSHOT/apps/continuum/working-directory/76/src/main/java/org/apache/myfaces/shared/util/SelectItemsIterator.java:[78,38]
cannot find symbol
>symbol  : method isItemEscaped()
>location: class javax.faces.component.UISelectItem
>
>/local/continuum-1.0.3-SNAPSHOT/apps/continuum/working-directory/76/src/main/java/org/apache/myfaces/shared/util/SelectItemsIterator.java:[83,27]
cannot find symbol
>symbol  : constructor SelectItem(java.lang.Object,java.lang.String,java.lang.String,boolean,boolean)
>location: class javax.faces.model.SelectItem
>
>/local/continuum-1.0.3-SNAPSHOT/apps/continuum/working-directory/76/src/main/java/org/apache/myfaces/shared/renderkit/html/HtmlRendererUtils.java:[441,40]
cannot find symbol
>symbol  : method isEscape()
>location: class javax.faces.model.SelectItem
>
>
>[INFO] ------------------------------------------------------------------------
>[INFO] For more information, run Maven with the -e switch
>[INFO] ------------------------------------------------------------------------
>[INFO] Total time: 5 seconds
>[INFO] Finished at: Tue Jul 18 06:38:34 GMT+00:00 2006
>[INFO] Final Memory: 10M/326M
>[INFO] ------------------------------------------------------------------------
>
>****************************************************************************
>
>
>



Mime
View raw message