myfaces-commits mailing list archives

Site index · List index
Message view « Date » · « Thread »
Top « Date » · « Thread »
From Apache Jenkins Server <jenk...@builds.apache.org>
Subject Build failed in Jenkins: myfaces-current22-1 #2154
Date Sun, 23 Aug 2015 20:09:53 GMT
See <https://builds.apache.org/job/myfaces-current22-1/2154/>

------------------------------------------
[...truncated 164 lines...]
[INFO] 
[INFO] Apache MyFaces Shared For JSF 2.2 - Project ....... SUCCESS [0.169s]
[INFO] Apache MyFaces Shared For JSF 2.2 - Core Mirror ... SUCCESS [0.035s]
[INFO] MyFaces Shared Tomahawk ........................... SUCCESS [0.004s]
[INFO] Apache MyFaces JSF-2.2 Core Project ............... SUCCESS [0.070s]
[INFO] Apache MyFaces JSF-2.2 Core API ................... SUCCESS [0.609s]
[INFO] Apache MyFaces Shared Public API For JSF 2.2 - Core  SUCCESS [0.003s]
[INFO] Apache MyFaces Core For JSF 2.2 - Shared .......... SUCCESS [0.002s]
[INFO] Apache MyFaces JSF-2.2 Core Impl .................. SUCCESS [0.005s]
[INFO] Apache MyFaces JSF-2.2 Core OSGi Bundle ........... SUCCESS [0.021s]
[INFO] Apache MyFaces JSF-2.2 Impl Test .................. SUCCESS [0.003s]
[INFO] Apache MyFaces JSF-2.2 Core Module ................ SUCCESS [0.002s]
[INFO] Apache MyFaces Composite Build .................... SUCCESS [0.093s]
[INFO] ------------------------------------------------------------------------
[INFO] BUILD SUCCESS
[INFO] ------------------------------------------------------------------------
[INFO] Total time: 2.964s
[INFO] Finished at: Sun Aug 23 20:10:37 UTC 2015
[INFO] Final Memory: 12M/154M
[INFO] ------------------------------------------------------------------------
Parsing POMs
maven3-agent.jar already up to date
maven3-interceptor.jar already up to date
maven3-interceptor-commons.jar already up to date
[current22] $ /home/jenkins/tools/java/latest1.6/bin/java -Xmx2048m -Xms128m -XX:MaxPermSize=256m
-cp /home/jenkins/jenkins-slave/maven3-agent.jar:/home/jenkins/tools/maven/apache-maven-3.0.4/boot/plexus-classworlds-2.4.jar
org.jvnet.hudson.maven3.agent.Maven3Main /home/jenkins/tools/maven/apache-maven-3.0.4 /x1/jenkins/jenkins-slave/slave.jar
/home/jenkins/jenkins-slave/maven3-interceptor.jar /home/jenkins/jenkins-slave/maven3-interceptor-commons.jar
35090
<===[JENKINS REMOTING CAPACITY]===>   channel started
Executing Maven:  -B -f <https://builds.apache.org/job/myfaces-current22-1/ws/current22/pom.xml>
-Dmaven.repo.local=/home/jenkins/jenkins-slave/maven-repositories/2 clean install deploy
[INFO] Scanning for projects...
[WARNING] 
[WARNING] Some problems were encountered while building the effective model for org.apache.myfaces.shared:myfaces-shared-core:jar:4.2.7-SNAPSHOT
[WARNING] 'reporting.plugins.plugin.version' for org.codehaus.mojo:jxr-maven-plugin is missing.
@ line 264, column 15
[WARNING] 
[WARNING] Some problems were encountered while building the effective model for org.apache.myfaces.shared:myfaces-shared-project:pom:4.2.7-SNAPSHOT
[WARNING] 'parent.relativePath' points at org.apache.myfaces:myfaces-base instead of org.apache.myfaces:myfaces,
please verify your project structure @ line 39, column 11
[WARNING] 
[WARNING] Some problems were encountered while building the effective model for org.apache.myfaces.core:myfaces-core-project:pom:2.2.9-SNAPSHOT
[WARNING] 'reporting.plugins.plugin.version' for org.codehaus.mojo:cobertura-maven-plugin
is missing. @ line 315, column 21
[WARNING] 
[WARNING] Some problems were encountered while building the effective model for org.apache.myfaces.core:myfaces-api:jar:2.2.9-SNAPSHOT
[WARNING] 'build.plugins.plugin.version' for de.berlios.jsunit:jsunit-maven2-plugin is missing.
@ line 323, column 21
[WARNING] 'reporting.plugins.plugin.version' for org.codehaus.mojo:cobertura-maven-plugin
is missing. @ org.apache.myfaces.core:myfaces-core-project:2.2.9-SNAPSHOT, <https://builds.apache.org/job/myfaces-current22-1/ws/current22/core/parent/pom.xml,>
line 315, column 21
[WARNING] 'reporting.plugins.plugin.version' for org.apache.maven.plugins:maven-javadoc-plugin
is missing. @ line 706, column 21
[WARNING] 'reporting.plugins.plugin.version' for org.apache.maven.plugins:maven-changelog-plugin
is missing. @ line 716, column 21
[WARNING] 'reporting.plugins.plugin.version' for org.apache.maven.plugins:maven-jxr-plugin
is missing. @ line 734, column 21
[WARNING] 'reporting.plugins.plugin.version' for org.apache.maven.plugins:maven-surefire-report-plugin
is missing. @ line 738, column 21
[WARNING] 'reporting.plugins.plugin.version' for org.codehaus.mojo:taglist-maven-plugin is
missing. @ line 742, column 21
[WARNING] 
[WARNING] Some problems were encountered while building the effective model for org.apache.myfaces.core.internal:myfaces-impl-shared-public:jar:2.2.9-SNAPSHOT
[WARNING] 'reporting.plugins.plugin.version' for org.codehaus.mojo:cobertura-maven-plugin
is missing. @ org.apache.myfaces.core:myfaces-core-project:2.2.9-SNAPSHOT, <https://builds.apache.org/job/myfaces-current22-1/ws/current22/core/parent/pom.xml,>
line 315, column 21
[WARNING] 'reporting.plugins.plugin.version' for org.apache.maven.plugins:maven-javadoc-plugin
is missing. @ line 141, column 15
[WARNING] 'reporting.plugins.plugin.version' for org.apache.maven.plugins:maven-jxr-plugin
is missing. @ line 144, column 15
[WARNING] 'reporting.plugins.plugin.version' for org.apache.maven.plugins:maven-changelog-plugin
is missing. @ line 147, column 15
[WARNING] 'reporting.plugins.plugin.version' for org.codehaus.mojo:taglist-maven-plugin is
missing. @ line 170, column 15
[WARNING] 
[WARNING] Some problems were encountered while building the effective model for org.apache.myfaces.core.internal:myfaces-impl-shared:jar:2.2.9-SNAPSHOT
[WARNING] 'reporting.plugins.plugin.version' for org.codehaus.mojo:cobertura-maven-plugin
is missing. @ org.apache.myfaces.core:myfaces-core-project:2.2.9-SNAPSHOT, <https://builds.apache.org/job/myfaces-current22-1/ws/current22/core/parent/pom.xml,>
line 315, column 21
[WARNING] 'reporting.plugins.plugin.version' for org.apache.maven.plugins:maven-javadoc-plugin
is missing. @ line 262, column 15
[WARNING] 'reporting.plugins.plugin.version' for org.apache.maven.plugins:maven-jxr-plugin
is missing. @ line 265, column 15
[WARNING] 'reporting.plugins.plugin.version' for org.apache.maven.plugins:maven-changelog-plugin
is missing. @ line 268, column 15
[WARNING] 'reporting.plugins.plugin.version' for org.codehaus.mojo:taglist-maven-plugin is
missing. @ line 291, column 15
[WARNING] 
[WARNING] Some problems were encountered while building the effective model for org.apache.myfaces.core:myfaces-impl:jar:2.2.9-SNAPSHOT
[WARNING] 'build.plugins.plugin.(groupId:artifactId)' must be unique but found duplicate declaration
of plugin org.apache.maven.plugins:maven-jar-plugin @ line 522, column 21
[WARNING] 'reporting.plugins.plugin.version' for org.codehaus.mojo:cobertura-maven-plugin
is missing. @ org.apache.myfaces.core:myfaces-core-project:2.2.9-SNAPSHOT, <https://builds.apache.org/job/myfaces-current22-1/ws/current22/core/parent/pom.xml,>
line 315, column 21
[WARNING] 'reporting.plugins.plugin.version' for org.apache.maven.plugins:maven-javadoc-plugin
is missing. @ line 1266, column 21
[WARNING] 'reporting.plugins.plugin.version' for org.apache.maven.plugins:maven-changelog-plugin
is missing. @ line 1272, column 21
[WARNING] 'reporting.plugins.plugin.version' for org.apache.maven.plugins:maven-jxr-plugin
is missing. @ line 1290, column 21
[WARNING] 'reporting.plugins.plugin.version' for org.apache.maven.plugins:maven-surefire-report-plugin
is missing. @ line 1294, column 21
[WARNING] 'reporting.plugins.plugin.version' for org.codehaus.mojo:taglist-maven-plugin is
missing. @ line 1298, column 21
[WARNING] 
[WARNING] Some problems were encountered while building the effective model for org.apache.myfaces.core:myfaces-bundle:bundle:2.2.9-SNAPSHOT
[WARNING] 'reporting.plugins.plugin.version' for org.codehaus.mojo:cobertura-maven-plugin
is missing. @ org.apache.myfaces.core:myfaces-core-project:2.2.9-SNAPSHOT, <https://builds.apache.org/job/myfaces-current22-1/ws/current22/core/parent/pom.xml,>
line 315, column 21
[WARNING] 
[WARNING] Some problems were encountered while building the effective model for org.apache.myfaces.core:myfaces-impl-test:jar:2.2.9-SNAPSHOT
[WARNING] 'reporting.plugins.plugin.version' for org.codehaus.mojo:cobertura-maven-plugin
is missing. @ org.apache.myfaces.core:myfaces-core-project:2.2.9-SNAPSHOT, <https://builds.apache.org/job/myfaces-current22-1/ws/current22/core/parent/pom.xml,>
line 315, column 21
[WARNING] 
[WARNING] It is highly recommended to fix these problems because they threaten the stability
of your build.
[WARNING] 
[WARNING] For this reason, future Maven versions might no longer support building such malformed
projects.
[WARNING] 
[INFO] ------------------------------------------------------------------------
[INFO] Reactor Build Order:
[INFO] 
[INFO] Apache MyFaces Shared For JSF 2.2 - Project
[INFO] Apache MyFaces Shared For JSF 2.2 - Core Mirror
[INFO] MyFaces Shared Tomahawk
[INFO] Apache MyFaces JSF-2.2 Core Project
[INFO] Apache MyFaces JSF-2.2 Core API
[INFO] Apache MyFaces Shared Public API For JSF 2.2 - Core
[INFO] Apache MyFaces Core For JSF 2.2 - Shared
[INFO] Apache MyFaces JSF-2.2 Core Impl
[INFO] Apache MyFaces JSF-2.2 Core OSGi Bundle
[INFO] Apache MyFaces JSF-2.2 Impl Test
[INFO] Apache MyFaces JSF-2.2 Core Module
[INFO] Apache MyFaces Composite Build
[INFO]                                                                         
[INFO] ------------------------------------------------------------------------
[INFO] Building Apache MyFaces Shared For JSF 2.2 - Project 4.2.7-SNAPSHOT
[INFO] ------------------------------------------------------------------------
[INFO] 
[INFO] --- maven-clean-plugin:2.5:clean (default-clean) @ myfaces-shared-project ---
[INFO] 
[INFO] --- maven-remote-resources-plugin:1.4:process (default) @ myfaces-shared-project ---
[INFO] 
[INFO] --- maven-site-plugin:3.2:attach-descriptor (attach-descriptor) @ myfaces-shared-project
---
[INFO] 
[INFO] --- maven-checkstyle-plugin:2.6:check (verify-style) @ myfaces-shared-project ---
[INFO] Starting audit...
Audit done.

[INFO] 
[INFO] --- maven-install-plugin:2.3.1:install (default-install) @ myfaces-shared-project ---
[INFO] Installing <https://builds.apache.org/job/myfaces-current22-1/ws/current22/shared/pom.xml>
to /home/jenkins/jenkins-slave/maven-repositories/2/org/apache/myfaces/shared/myfaces-shared-project/4.2.7-SNAPSHOT/myfaces-shared-project-4.2.7-SNAPSHOT.pom
[INFO] Installing <https://builds.apache.org/job/myfaces-current22-1/ws/current22/shared/target/myfaces-shared-project-4.2.7-SNAPSHOT-site.xml>
to /home/jenkins/jenkins-slave/maven-repositories/2/org/apache/myfaces/shared/myfaces-shared-project/4.2.7-SNAPSHOT/myfaces-shared-project-4.2.7-SNAPSHOT-site.xml
[INFO] 
[INFO] --- maven-remote-resources-plugin:1.4:process (default) @ myfaces-shared-project ---
[INFO] 
[INFO] --- maven-site-plugin:3.2:attach-descriptor (attach-descriptor) @ myfaces-shared-project
---
[WARNING] Artifact org.apache.myfaces.shared:myfaces-shared-project:xml:site:4.2.7-SNAPSHOT
already attached to project, ignoring duplicate
[INFO] 
[INFO] --- maven-checkstyle-plugin:2.6:check (verify-style) @ myfaces-shared-project ---
[INFO] Starting audit...
Audit done.

[INFO] 
[INFO] --- maven-install-plugin:2.3.1:install (default-install) @ myfaces-shared-project ---
[INFO] Installing <https://builds.apache.org/job/myfaces-current22-1/ws/current22/shared/pom.xml>
to /home/jenkins/jenkins-slave/maven-repositories/2/org/apache/myfaces/shared/myfaces-shared-project/4.2.7-SNAPSHOT/myfaces-shared-project-4.2.7-SNAPSHOT.pom
[INFO] Installing <https://builds.apache.org/job/myfaces-current22-1/ws/current22/shared/target/myfaces-shared-project-4.2.7-SNAPSHOT-site.xml>
to /home/jenkins/jenkins-slave/maven-repositories/2/org/apache/myfaces/shared/myfaces-shared-project/4.2.7-SNAPSHOT/myfaces-shared-project-4.2.7-SNAPSHOT-site.xml
[INFO] 
[INFO] --- maven-deploy-plugin:2.7:deploy (default-deploy) @ myfaces-shared-project ---
Downloading: https://repository.apache.org/content/repositories/snapshots/org/apache/myfaces/shared/myfaces-shared-project/4.2.7-SNAPSHOT/maven-metadata.xml
[WARNING] Could not transfer metadata org.apache.myfaces.shared:myfaces-shared-project:4.2.7-SNAPSHOT/maven-metadata.xml
from/to apache.snapshots.https (https://repository.apache.org/content/repositories/snapshots):
java.lang.RuntimeException: Could not generate DH keypair
[INFO] ------------------------------------------------------------------------
[INFO] Reactor Summary:
[INFO] 
[INFO] Apache MyFaces Shared For JSF 2.2 - Project ....... FAILURE [3.464s]
[INFO] Apache MyFaces Shared For JSF 2.2 - Core Mirror ... SKIPPED
[INFO] MyFaces Shared Tomahawk ........................... SKIPPED
[INFO] Apache MyFaces JSF-2.2 Core Project ............... SKIPPED
[INFO] Apache MyFaces JSF-2.2 Core API ................... SKIPPED
[INFO] Apache MyFaces Shared Public API For JSF 2.2 - Core  SKIPPED
[INFO] Apache MyFaces Core For JSF 2.2 - Shared .......... SKIPPED
[INFO] Apache MyFaces JSF-2.2 Core Impl .................. SKIPPED
[INFO] Apache MyFaces JSF-2.2 Core OSGi Bundle ........... SKIPPED
[INFO] Apache MyFaces JSF-2.2 Impl Test .................. SKIPPED
[INFO] Apache MyFaces JSF-2.2 Core Module ................ SKIPPED
[INFO] Apache MyFaces Composite Build .................... SKIPPED
[INFO] ------------------------------------------------------------------------
[INFO] BUILD FAILURE
[INFO] ------------------------------------------------------------------------
[INFO] Total time: 6.844s
[INFO] Finished at: Sun Aug 23 20:10:48 UTC 2015
[INFO] Final Memory: 21M/192M
[INFO] ------------------------------------------------------------------------
Waiting for Jenkins to finish collecting data
[ERROR] Failed to execute goal org.apache.maven.plugins:maven-deploy-plugin:2.7:deploy (default-deploy)
on project myfaces-shared-project: Failed to retrieve remote metadata org.apache.myfaces.shared:myfaces-shared-project:4.2.7-SNAPSHOT/maven-metadata.xml:
Could not transfer metadata org.apache.myfaces.shared:myfaces-shared-project:4.2.7-SNAPSHOT/maven-metadata.xml
from/to apache.snapshots.https (https://repository.apache.org/content/repositories/snapshots):
java.lang.RuntimeException: Could not generate DH keypair: Prime size must be multiple of
64, and can only range from 512 to 1024 (inclusive) -> [Help 1]
[ERROR] 
[ERROR] To see the full stack trace of the errors, re-run Maven with the -e switch.
[ERROR] Re-run Maven using the -X switch to enable full debug logging.
[ERROR] 
[ERROR] For more information about the errors and possible solutions, please read the following
articles:
[ERROR] [Help 1] http://cwiki.apache.org/confluence/display/MAVEN/MojoExecutionException
[JENKINS] Archiving <https://builds.apache.org/job/myfaces-current22-1/ws/current22/shared/shared-tomahawk/pom.xml>
to org.apache.myfaces.shared/myfaces-shared-tomahawk/4.2.7-SNAPSHOT/myfaces-shared-tomahawk-4.2.7-SNAPSHOT.pom
Sending artifact delta relative to myfaces-current22-1 ? MyFaces Shared Tomahawk #2134
Archived 1 artifacts
Archive block size is 32768
Received 0 blocks and 7974 bytes
Compression is 0.0%
Took 0.12 sec
[JENKINS] Archiving <https://builds.apache.org/job/myfaces-current22-1/ws/current22/core/shared-public/pom.xml>
to org.apache.myfaces.core.internal/myfaces-impl-shared-public/2.2.9-SNAPSHOT/myfaces-impl-shared-public-2.2.9-SNAPSHOT.pom
Sending artifact delta relative to myfaces-current22-1 ? Apache MyFaces Shared Public API
For JSF 2.2 - Core #2134
Archived 1 artifacts
Archive block size is 32768
Received 0 blocks and 7047 bytes
Compression is 0.0%
Took 0.1 sec
[JENKINS] Archiving <https://builds.apache.org/job/myfaces-current22-1/ws/current22/core/impl-test/pom.xml>
to org.apache.myfaces.core/myfaces-impl-test/2.2.9-SNAPSHOT/myfaces-impl-test-2.2.9-SNAPSHOT.pom
Sending artifact delta relative to myfaces-current22-1 ? Apache MyFaces JSF-2.2 Impl Test
#2134
Archived 1 artifacts
Archive block size is 32768
Received 0 blocks and 9288 bytes
Compression is 0.0%
Took 60 ms
[JENKINS] Archiving <https://builds.apache.org/job/myfaces-current22-1/ws/current22/core/impl/pom.xml>
to org.apache.myfaces.core/myfaces-impl/2.2.9-SNAPSHOT/myfaces-impl-2.2.9-SNAPSHOT.pom
Sending artifact delta relative to myfaces-current22-1 ? Apache MyFaces JSF-2.2 Core Impl
#2134
Archived 1 artifacts
Archive block size is 32768
Received 0 blocks and 63315 bytes
Compression is 0.0%
Took 0.3 sec
[JENKINS] Archiving <https://builds.apache.org/job/myfaces-current22-1/ws/current22/shared/core/pom.xml>
to org.apache.myfaces.shared/myfaces-shared-core/4.2.7-SNAPSHOT/myfaces-shared-core-4.2.7-SNAPSHOT.pom
Sending artifact delta relative to myfaces-current22-1 ? Apache MyFaces Shared For JSF 2.2
- Core Mirror #2134
Archived 1 artifacts
Archive block size is 32768
Received 0 blocks and 12498 bytes
Compression is 0.0%
Took 0.38 sec
[JENKINS] Archiving <https://builds.apache.org/job/myfaces-current22-1/ws/current22/core/bundle/pom.xml>
to org.apache.myfaces.core/myfaces-bundle/2.2.9-SNAPSHOT/myfaces-bundle-2.2.9-SNAPSHOT.pom
Sending artifact delta relative to myfaces-current22-1 ? Apache MyFaces JSF-2.2 Core OSGi
Bundle #2134
Archived 1 artifacts
Archive block size is 32768
Received 0 blocks and 8578 bytes
Compression is 0.0%
Took 0.1 sec
[JENKINS] Archiving <https://builds.apache.org/job/myfaces-current22-1/ws/current22/core/api/pom.xml>
to org.apache.myfaces.core/myfaces-api/2.2.9-SNAPSHOT/myfaces-api-2.2.9-SNAPSHOT.pom
Sending artifact delta relative to myfaces-current22-1 ? Apache MyFaces JSF-2.2 Core API #2134
Archived 1 artifacts
Archive block size is 32768
Received 0 blocks and 33946 bytes
Compression is 0.0%
Took 76 ms
[JENKINS] Archiving <https://builds.apache.org/job/myfaces-current22-1/ws/current22/shared/pom.xml>
to org.apache.myfaces.shared/myfaces-shared-project/4.2.7-SNAPSHOT/myfaces-shared-project-4.2.7-SNAPSHOT.pom
[JENKINS] Archiving <https://builds.apache.org/job/myfaces-current22-1/ws/current22/shared/target/myfaces-shared-project-4.2.7-SNAPSHOT-site.xml>
to org.apache.myfaces.shared/myfaces-shared-project/4.2.7-SNAPSHOT/myfaces-shared-project-4.2.7-SNAPSHOT-site.xml
Sending artifact delta relative to myfaces-current22-1 ? Apache MyFaces Shared For JSF 2.2
- Project #2134
Archived 2 artifacts
Archive block size is 32768
Received 0 blocks and 11310 bytes
Compression is 0.0%
Took 21 ms
[JENKINS] Archiving <https://builds.apache.org/job/myfaces-current22-1/ws/current22/core/parent/pom.xml>
to org.apache.myfaces.core/myfaces-core-project/2.2.9-SNAPSHOT/myfaces-core-project-2.2.9-SNAPSHOT.pom
Sending artifact delta relative to myfaces-current22-1 ? Apache MyFaces JSF-2.2 Core Project
#2134
Archived 1 artifacts
Archive block size is 32768
Received 0 blocks and 25920 bytes
Compression is 0.0%
Took 54 ms
[JENKINS] Archiving <https://builds.apache.org/job/myfaces-current22-1/ws/current22/core/pom.xml>
to org.apache.myfaces.core/myfaces-core-module/2.2.9-SNAPSHOT/myfaces-core-module-2.2.9-SNAPSHOT.pom
Sending artifact delta relative to myfaces-current22-1 ? Apache MyFaces JSF-2.2 Core Module
#2134
Archived 1 artifacts
Archive block size is 32768
Received 0 blocks and 8428 bytes
Compression is 0.0%
Took 58 ms
[JENKINS] Archiving <https://builds.apache.org/job/myfaces-current22-1/ws/current22/pom.xml>
to org.apache.myfaces/myfaces-base/2.2.0-SNAPSHOT/myfaces-base-2.2.0-SNAPSHOT.pom
Sending artifact delta relative to myfaces-current22-1 ? Apache MyFaces Composite Build #2134
Archived 1 artifacts
Archive block size is 32768
Received 0 blocks and 2225 bytes
Compression is 0.0%
Took 31 ms
[JENKINS] Archiving <https://builds.apache.org/job/myfaces-current22-1/ws/current22/core/shared/pom.xml>
to org.apache.myfaces.core.internal/myfaces-impl-shared/2.2.9-SNAPSHOT/myfaces-impl-shared-2.2.9-SNAPSHOT.pom
Sending artifact delta relative to myfaces-current22-1 ? Apache MyFaces Core For JSF 2.2 -
Shared #2134
Archived 1 artifacts
Archive block size is 32768
Received 0 blocks and 12075 bytes
Compression is 0.0%
Took 61 ms
Sending e-mails to: commits@myfaces.apache.org grantsmith@apache.org
channel stopped

Mime
View raw message