myfaces-commits mailing list archives

Site index · List index
Message view « Date » · « Thread »
Top « Date » · « Thread »
From Apache Jenkins Server <jenk...@builds.apache.org>
Subject Build failed in Jenkins: myfaces-current21 #2190
Date Wed, 02 Jul 2014 08:19:03 GMT
See <https://builds.apache.org/job/myfaces-current21/2190/>

------------------------------------------
[...truncated 6944 lines...]

Tests run: 0, Failures: 0, Errors: 0, Skipped: 0

[JENKINS] Recording test results
[INFO] [bundle:bundle {execution: default-bundle}]
[INFO] Preparing source:jar
[WARNING] Removing: jar from forked lifecycle, to prevent recursive invocation.
[INFO] No goals needed for project - skipping
[INFO] [source:jar {execution: attach-source}]
[INFO] Building jar: <https://builds.apache.org/job/myfaces-current21/ws/current21/core/bundle/target/myfaces-bundle-2.1.16-SNAPSHOT-sources.jar>
[INFO] [checkstyle:check {execution: verify-style}]
[INFO] Starting audit...
Audit done.

[INFO] [install:install {execution: default-install}]
[INFO] Installing <https://builds.apache.org/job/myfaces-current21/ws/current21/core/bundle/target/myfaces-bundle-2.1.16-SNAPSHOT.jar>
to /home/jenkins/jenkins-slave/maven-repositories/0/org/apache/myfaces/core/myfaces-bundle/2.1.16-SNAPSHOT/myfaces-bundle-2.1.16-SNAPSHOT.jar
[INFO] Installing <https://builds.apache.org/job/myfaces-current21/ws/current21/core/bundle/target/myfaces-bundle-2.1.16-SNAPSHOT-sources.jar>
to /home/jenkins/jenkins-slave/maven-repositories/0/org/apache/myfaces/core/myfaces-bundle/2.1.16-SNAPSHOT/myfaces-bundle-2.1.16-SNAPSHOT-sources.jar
[INFO] [bundle:install {execution: default-install}]
[INFO] Installing org/apache/myfaces/core/myfaces-bundle/2.1.16-SNAPSHOT/myfaces-bundle-2.1.16-SNAPSHOT.jar
[INFO] Writing OBR metadata
[INFO] ------------------------------------------------------------------------
[INFO] Building Apache MyFaces JSF-2.1 Core Module
[INFO]    task-segment: [install]
[INFO] ------------------------------------------------------------------------
[INFO] [remote-resources:process {execution: default}]
[INFO] [site:attach-descriptor {execution: default-attach-descriptor}]
[INFO] [checkstyle:check {execution: verify-style}]
[INFO] Starting audit...
Audit done.

[INFO] [install:install {execution: default-install}]
[INFO] Installing <https://builds.apache.org/job/myfaces-current21/ws/current21/core/pom.xml>
to /home/jenkins/jenkins-slave/maven-repositories/0/org/apache/myfaces/core/myfaces-core-module/2.1.16-SNAPSHOT/myfaces-core-module-2.1.16-SNAPSHOT.pom
[INFO] ------------------------------------------------------------------------
[INFO] Building Apache MyFaces Composite Build
[INFO]    task-segment: [install]
[INFO] ------------------------------------------------------------------------
[INFO] [remote-resources:process {execution: default}]
[INFO] [site:attach-descriptor {execution: default-attach-descriptor}]
[INFO] [checkstyle:check {execution: verify-style}]
[INFO] 
[INFO] [install:install {execution: default-install}]
[INFO] Installing <https://builds.apache.org/job/myfaces-current21/ws/current21/pom.xml>
to /home/jenkins/jenkins-slave/maven-repositories/0/org/apache/myfaces/myfaces-base/2.1.0-SNAPSHOT/myfaces-base-2.1.0-SNAPSHOT.pom
[INFO] 
[INFO] 
[INFO] ------------------------------------------------------------------------
[INFO] Reactor Summary:
[INFO] ------------------------------------------------------------------------
[INFO] Apache MyFaces JSF-2.1 Core Project ................... SUCCESS [11.507s]
[INFO] Apache MyFaces JSF-2.1 Core API ....................... SUCCESS [44.172s]
[INFO] Apache MyFaces Shared For JSF 2.1 - Project ........... SUCCESS [2.339s]
[INFO] Apache MyFaces Shared For JSF 2.1 - Core Mirror ....... SUCCESS [12.084s]
[INFO] MyFaces Shared Tomahawk ............................... SUCCESS [21.749s]
[INFO] Apache MyFaces Shared Public API For JSF 2.1 - Core ... SUCCESS [8.168s]
[INFO] Apache MyFaces Core For JSF 2.1 - Shared .............. SUCCESS [19.698s]
[INFO] Apache MyFaces JSF-2.1 Core Impl ...................... SUCCESS [1:17.456s]
[INFO] Apache MyFaces JSF-2.1 Core OSGi Bundle ............... SUCCESS [7.623s]
[INFO] Apache MyFaces JSF-2.1 Core Module .................... SUCCESS [0.374s]
[INFO] Apache MyFaces Composite Build ........................ SUCCESS [1.643s]
[INFO] ------------------------------------------------------------------------
[INFO] ------------------------------------------------------------------------
[INFO] BUILD SUCCESSFUL
[INFO] ------------------------------------------------------------------------
[INFO] Total time: 3 minutes 50 seconds
[INFO] Finished at: Wed Jul 02 08:15:48 UTC 2014
[INFO] Final Memory: 178M/544M
[INFO] ------------------------------------------------------------------------
[JENKINS] Archiving <https://builds.apache.org/job/myfaces-current21/ws/current21/shared/shared-tomahawk/pom.xml>
to org.apache.myfaces.shared/myfaces-shared-tomahawk/4.1.13-SNAPSHOT/myfaces-shared-tomahawk-4.1.13-SNAPSHOT.pom
[JENKINS] Archiving <https://builds.apache.org/job/myfaces-current21/ws/current21/shared/shared-tomahawk/target/myfaces-shared-tomahawk-4.1.13-SNAPSHOT.jar>
to org.apache.myfaces.shared/myfaces-shared-tomahawk/4.1.13-SNAPSHOT/myfaces-shared-tomahawk-4.1.13-SNAPSHOT.jar
[JENKINS] Archiving <https://builds.apache.org/job/myfaces-current21/ws/current21/shared/shared-tomahawk/target/myfaces-shared-tomahawk-4.1.13-SNAPSHOT-sources.jar>
to org.apache.myfaces.shared/myfaces-shared-tomahawk/4.1.13-SNAPSHOT/myfaces-shared-tomahawk-4.1.13-SNAPSHOT-sources.jar
Sending artifact delta relative to myfaces-current21 ? MyFaces Shared Tomahawk #2189
Archived 3 artifacts
Archive block size is 32768
Received 0 blocks and 829821 bytes
Compression is 0.0%
Took 0.4 sec
[JENKINS] Archiving <https://builds.apache.org/job/myfaces-current21/ws/current21/core/shared-public/pom.xml>
to org.apache.myfaces.core.internal/myfaces-impl-shared-public/2.1.16-SNAPSHOT/myfaces-impl-shared-public-2.1.16-SNAPSHOT.pom
[JENKINS] Archiving <https://builds.apache.org/job/myfaces-current21/ws/current21/core/shared-public/target/myfaces-impl-shared-public-2.1.16-SNAPSHOT.jar>
to org.apache.myfaces.core.internal/myfaces-impl-shared-public/2.1.16-SNAPSHOT/myfaces-impl-shared-public-2.1.16-SNAPSHOT.jar
[JENKINS] Archiving <https://builds.apache.org/job/myfaces-current21/ws/current21/core/shared-public/target/myfaces-impl-shared-public-2.1.16-SNAPSHOT-sources.jar>
to org.apache.myfaces.core.internal/myfaces-impl-shared-public/2.1.16-SNAPSHOT/myfaces-impl-shared-public-2.1.16-SNAPSHOT-sources.jar
Sending artifact delta relative to myfaces-current21 ? Apache MyFaces Shared Public API For
JSF 2.1 - Core #2189
Archived 3 artifacts
Archive block size is 32768
Received 0 blocks and 186082 bytes
Compression is 0.0%
Took 0.14 sec
[JENKINS] Archiving <https://builds.apache.org/job/myfaces-current21/ws/current21/core/impl/pom.xml>
to org.apache.myfaces.core/myfaces-impl/2.1.16-SNAPSHOT/myfaces-impl-2.1.16-SNAPSHOT.pom
[JENKINS] Archiving <https://builds.apache.org/job/myfaces-current21/ws/current21/core/impl/target/myfaces-impl-2.1.16-SNAPSHOT.jar>
to org.apache.myfaces.core/myfaces-impl/2.1.16-SNAPSHOT/myfaces-impl-2.1.16-SNAPSHOT.jar
[JENKINS] Archiving <https://builds.apache.org/job/myfaces-current21/ws/current21/core/impl/target/myfaces-impl-2.1.16-SNAPSHOT-sources.jar>
to org.apache.myfaces.core/myfaces-impl/2.1.16-SNAPSHOT/myfaces-impl-2.1.16-SNAPSHOT-sources.jar
[JENKINS] Archiving <https://builds.apache.org/job/myfaces-current21/ws/current21/core/impl/target/myfaces-impl-2.1.16-SNAPSHOT-tests.jar>
to org.apache.myfaces.core/myfaces-impl/2.1.16-SNAPSHOT/myfaces-impl-2.1.16-SNAPSHOT-tests.jar
Sending artifact delta relative to myfaces-current21 ? Apache MyFaces JSF-2.1 Core Impl #2189
Archived 4 artifacts
Archive block size is 32768
Received 3 blocks and 4831124 bytes
Compression is 2.0%
Took 5.4 sec
[JENKINS] Archiving <https://builds.apache.org/job/myfaces-current21/ws/current21/shared/core/pom.xml>
to org.apache.myfaces.shared/myfaces-shared-core/4.1.13-SNAPSHOT/myfaces-shared-core-4.1.13-SNAPSHOT.pom
[JENKINS] Archiving <https://builds.apache.org/job/myfaces-current21/ws/current21/shared/core/target/myfaces-shared-core-4.1.13-SNAPSHOT.jar>
to org.apache.myfaces.shared/myfaces-shared-core/4.1.13-SNAPSHOT/myfaces-shared-core-4.1.13-SNAPSHOT.jar
[JENKINS] Archiving <https://builds.apache.org/job/myfaces-current21/ws/current21/shared/core/target/myfaces-shared-core-4.1.13-SNAPSHOT-sources.jar>
to org.apache.myfaces.shared/myfaces-shared-core/4.1.13-SNAPSHOT/myfaces-shared-core-4.1.13-SNAPSHOT-sources.jar
Sending artifact delta relative to myfaces-current21 ? Apache MyFaces Shared For JSF 2.1 -
Core Mirror #2189
Archived 3 artifacts
Archive block size is 32768
Received 0 blocks and 898765 bytes
Compression is 0.0%
Took 0.42 sec
[JENKINS] Archiving <https://builds.apache.org/job/myfaces-current21/ws/current21/core/bundle/pom.xml>
to org.apache.myfaces.core/myfaces-bundle/2.1.16-SNAPSHOT/myfaces-bundle-2.1.16-SNAPSHOT.pom
[JENKINS] Archiving <https://builds.apache.org/job/myfaces-current21/ws/current21/core/bundle/target/myfaces-bundle-2.1.16-SNAPSHOT.jar>
to org.apache.myfaces.core/myfaces-bundle/2.1.16-SNAPSHOT/myfaces-bundle-2.1.16-SNAPSHOT.jar
[JENKINS] Archiving <https://builds.apache.org/job/myfaces-current21/ws/current21/core/bundle/target/myfaces-bundle-2.1.16-SNAPSHOT-sources.jar>
to org.apache.myfaces.core/myfaces-bundle/2.1.16-SNAPSHOT/myfaces-bundle-2.1.16-SNAPSHOT-sources.jar
Sending artifact delta relative to myfaces-current21 ? Apache MyFaces JSF-2.1 Core OSGi Bundle
#2189
Archived 3 artifacts
Archive block size is 32768
Received 2 blocks and 3103948 bytes
Compression is 2.1%
Took 5.7 sec
[JENKINS] Archiving <https://builds.apache.org/job/myfaces-current21/ws/current21/core/api/pom.xml>
to org.apache.myfaces.core/myfaces-api/2.1.16-SNAPSHOT/myfaces-api-2.1.16-SNAPSHOT.pom
[JENKINS] Archiving <https://builds.apache.org/job/myfaces-current21/ws/current21/core/api/target/myfaces-api-2.1.16-SNAPSHOT.jar>
to org.apache.myfaces.core/myfaces-api/2.1.16-SNAPSHOT/myfaces-api-2.1.16-SNAPSHOT.jar
[JENKINS] Archiving <https://builds.apache.org/job/myfaces-current21/ws/current21/core/api/target/myfaces-api-2.1.16-SNAPSHOT-sources.jar>
to org.apache.myfaces.core/myfaces-api/2.1.16-SNAPSHOT/myfaces-api-2.1.16-SNAPSHOT-sources.jar
[JENKINS] Archiving <https://builds.apache.org/job/myfaces-current21/ws/current21/core/api/target/myfaces-api-2.1.16-SNAPSHOT-tests.jar>
to org.apache.myfaces.core/myfaces-api/2.1.16-SNAPSHOT/myfaces-api-2.1.16-SNAPSHOT-tests.jar
Sending artifact delta relative to myfaces-current21 ? Apache MyFaces JSF-2.1 Core API #2189
Archived 4 artifacts
Archive block size is 32768
Received 3 blocks and 2228741 bytes
Compression is 4.2%
Took 5.7 sec
[JENKINS] Archiving /home/jenkins/jenkins-slave/maven-repositories/0/org/apache/myfaces/shared/myfaces-shared-project/4.1.13-SNAPSHOT/myfaces-shared-project-4.1.13-SNAPSHOT.pom
to org.apache.myfaces.shared/myfaces-shared-project/4.1.13-SNAPSHOT/myfaces-shared-project-4.1.13-SNAPSHOT.pom
[JENKINS] Archiving <https://builds.apache.org/job/myfaces-current21/ws/current21/shared/target/myfaces-shared-project-4.1.13-SNAPSHOT-site.xml>
to org.apache.myfaces.shared/myfaces-shared-project/4.1.13-SNAPSHOT/myfaces-shared-project-4.1.13-SNAPSHOT-site.xml
/x1/jenkins/jenkins-slave/maven-repositories/0/org/apache/myfaces/shared/myfaces-shared-project/4.1.13-SNAPSHOT/myfaces-shared-project-4.1.13-SNAPSHOT.pom
is not inside /x1/jenkins/jenkins-slave/workspace/myfaces-current21/current21/shared/; will
archive in a separate pass
Sending artifact delta relative to myfaces-current21 ? Apache MyFaces Shared For JSF 2.1 -
Project #2189
Archived 1 artifacts
Archive block size is 32768
Received 0 blocks and 2548 bytes
Compression is 0.0%
Took 0.14 sec
Sending artifact delta relative to myfaces-current21 ? Apache MyFaces Shared For JSF 2.1 -
Project #2189
Archived 1 artifacts
Archive block size is 32768
Received 0 blocks and 7986 bytes
Compression is 0.0%
Took 17 ms
[JENKINS] Archiving /home/jenkins/jenkins-slave/maven-repositories/0/org/apache/myfaces/core/myfaces-core-project/2.1.16-SNAPSHOT/myfaces-core-project-2.1.16-SNAPSHOT.pom
to org.apache.myfaces.core/myfaces-core-project/2.1.16-SNAPSHOT/myfaces-core-project-2.1.16-SNAPSHOT.pom
[JENKINS] Archiving <https://builds.apache.org/job/myfaces-current21/ws/current21/core/parent/target/myfaces-core-project-2.1.16-SNAPSHOT-site.xml>
to org.apache.myfaces.core/myfaces-core-project/2.1.16-SNAPSHOT/myfaces-core-project-2.1.16-SNAPSHOT-site.xml
/x1/jenkins/jenkins-slave/maven-repositories/0/org/apache/myfaces/core/myfaces-core-project/2.1.16-SNAPSHOT/myfaces-core-project-2.1.16-SNAPSHOT.pom
is not inside /x1/jenkins/jenkins-slave/workspace/myfaces-current21/current21/core/parent/;
will archive in a separate pass
Sending artifact delta relative to myfaces-current21 ? Apache MyFaces JSF-2.1 Core Project
#2189
Archived 1 artifacts
Archive block size is 32768
Received 0 blocks and 6227 bytes
Compression is 0.0%
Took 0.11 sec
Sending artifact delta relative to myfaces-current21 ? Apache MyFaces JSF-2.1 Core Project
#2189
Archived 1 artifacts
Archive block size is 32768
Received 0 blocks and 23555 bytes
Compression is 0.0%
Took 16 ms
[JENKINS] Archiving /home/jenkins/jenkins-slave/maven-repositories/0/org/apache/myfaces/core/myfaces-core-module/2.1.16-SNAPSHOT/myfaces-core-module-2.1.16-SNAPSHOT.pom
to org.apache.myfaces.core/myfaces-core-module/2.1.16-SNAPSHOT/myfaces-core-module-2.1.16-SNAPSHOT.pom
/x1/jenkins/jenkins-slave/maven-repositories/0/org/apache/myfaces/core/myfaces-core-module/2.1.16-SNAPSHOT/myfaces-core-module-2.1.16-SNAPSHOT.pom
is not inside /x1/jenkins/jenkins-slave/workspace/myfaces-current21/current21/core/; will
archive in a separate pass
Sending artifact delta relative to myfaces-current21 ? Apache MyFaces JSF-2.1 Core Module
#2189
Archived 1 artifacts
Archive block size is 32768
Received 0 blocks and 8298 bytes
Compression is 0.0%
Took 0.16 sec
[JENKINS] Archiving /home/jenkins/jenkins-slave/maven-repositories/0/org/apache/myfaces/myfaces-base/2.1.0-SNAPSHOT/myfaces-base-2.1.0-SNAPSHOT.pom
to org.apache.myfaces/myfaces-base/2.1.0-SNAPSHOT/myfaces-base-2.1.0-SNAPSHOT.pom
/x1/jenkins/jenkins-slave/maven-repositories/0/org/apache/myfaces/myfaces-base/2.1.0-SNAPSHOT/myfaces-base-2.1.0-SNAPSHOT.pom
is not inside /x1/jenkins/jenkins-slave/workspace/myfaces-current21/current21/; will archive
in a separate pass
Sending artifact delta relative to myfaces-current21 ? Apache MyFaces Composite Build #2189
Archived 1 artifacts
Archive block size is 32768
Received 0 blocks and 2225 bytes
Compression is 0.0%
Took 0.1 sec
[JENKINS] Archiving <https://builds.apache.org/job/myfaces-current21/ws/current21/core/shared/pom.xml>
to org.apache.myfaces.core.internal/myfaces-impl-shared/2.1.16-SNAPSHOT/myfaces-impl-shared-2.1.16-SNAPSHOT.pom
[JENKINS] Archiving <https://builds.apache.org/job/myfaces-current21/ws/current21/core/shared/target/myfaces-impl-shared-2.1.16-SNAPSHOT.jar>
to org.apache.myfaces.core.internal/myfaces-impl-shared/2.1.16-SNAPSHOT/myfaces-impl-shared-2.1.16-SNAPSHOT.jar
[JENKINS] Archiving <https://builds.apache.org/job/myfaces-current21/ws/current21/core/shared/target/myfaces-impl-shared-2.1.16-SNAPSHOT-sources.jar>
to org.apache.myfaces.core.internal/myfaces-impl-shared/2.1.16-SNAPSHOT/myfaces-impl-shared-2.1.16-SNAPSHOT-sources.jar
Sending artifact delta relative to myfaces-current21 ? Apache MyFaces Core For JSF 2.1 - Shared
#2189
Archived 3 artifacts
Archive block size is 32768
Received 0 blocks and 905559 bytes
Compression is 0.0%
Took 2.4 sec
channel stopped
Maven RedeployPublisher use remote ubuntu3 maven settings from : /home/jenkins/.m2/settings.xml
[INFO] Deployment in https://repository.apache.org/content/repositories/snapshots (id=apache.snapshots.https,uniqueVersion=false)
Deploying the main artifact myfaces-base-2.1.0-SNAPSHOT.pom
[INFO] Deployment in https://repository.apache.org/content/repositories/snapshots (id=apache.snapshots.https,uniqueVersion=false)
Deploying the main artifact myfaces-api-2.1.16-SNAPSHOT.jar
Deploying the main artifact myfaces-api-2.1.16-SNAPSHOT-sources.jar
Deploying the main artifact myfaces-api-2.1.16-SNAPSHOT-tests.jar
[INFO] Deployment in https://repository.apache.org/content/repositories/snapshots (id=apache.snapshots.https,uniqueVersion=false)
Deploying the main artifact myfaces-bundle-2.1.16-SNAPSHOT.jar
Deploying the main artifact myfaces-bundle-2.1.16-SNAPSHOT-sources.jar
[INFO] Deployment in https://repository.apache.org/content/repositories/snapshots (id=apache.snapshots.https,uniqueVersion=false)
Deploying the main artifact myfaces-core-module-2.1.16-SNAPSHOT.pom
[INFO] Deployment in https://repository.apache.org/content/repositories/snapshots (id=apache.snapshots.https,uniqueVersion=false)
Deploying the main artifact myfaces-core-project-2.1.16-SNAPSHOT.pom
Deploying the main artifact myfaces-core-project-2.1.16-SNAPSHOT-site.xml
[INFO] Deployment in https://repository.apache.org/content/repositories/snapshots (id=apache.snapshots.https,uniqueVersion=false)
Deploying the main artifact myfaces-impl-2.1.16-SNAPSHOT.jar
Deploying the main artifact myfaces-impl-2.1.16-SNAPSHOT-sources.jar
Deploying the main artifact myfaces-impl-2.1.16-SNAPSHOT-tests.jar
Deploying the main artifact myfaces-impl-2.1.16-SNAPSHOT-sources.jar
[INFO] Deployment in https://repository.apache.org/content/repositories/snapshots (id=apache.snapshots.https,uniqueVersion=false)
Deploying the main artifact myfaces-impl-shared-2.1.16-SNAPSHOT.jar
Deploying the main artifact myfaces-impl-shared-2.1.16-SNAPSHOT-sources.jar
Deploying the main artifact myfaces-impl-shared-2.1.16-SNAPSHOT-sources.jar
[INFO] Deployment in https://repository.apache.org/content/repositories/snapshots (id=apache.snapshots.https,uniqueVersion=false)
Deploying the main artifact myfaces-impl-shared-public-2.1.16-SNAPSHOT.jar
Deploying the main artifact myfaces-impl-shared-public-2.1.16-SNAPSHOT-sources.jar
[INFO] Deployment in https://repository.apache.org/content/repositories/snapshots (id=apache.snapshots.https,uniqueVersion=false)
Deploying the main artifact myfaces-shared-core-4.1.13-SNAPSHOT.jar
Deploying the main artifact myfaces-shared-core-4.1.13-SNAPSHOT-sources.jar
[INFO] Deployment in https://repository.apache.org/content/repositories/snapshots (id=apache.snapshots.https,uniqueVersion=false)
Deploying the main artifact myfaces-shared-project-4.1.13-SNAPSHOT.pom
ERROR: Error deploying artifact: peer not authenticated
org.apache.maven.artifact.deployer.ArtifactDeploymentException: Error deploying artifact:
peer not authenticated
	at hudson.maven.artifact.deployer.DefaultArtifactDeployer.deploy(DefaultArtifactDeployer.java:175)
	at hudson.maven.reporters.MavenArtifactRecord.deploy(MavenArtifactRecord.java:193)
	at hudson.maven.RedeployPublisher.perform(RedeployPublisher.java:176)
	at hudson.tasks.BuildStepMonitor$1.perform(BuildStepMonitor.java:20)
	at hudson.model.AbstractBuild$AbstractBuildExecution.perform(AbstractBuild.java:804)
	at hudson.model.AbstractBuild$AbstractBuildExecution.performAllBuildSteps(AbstractBuild.java:776)
	at hudson.maven.MavenModuleSetBuild$MavenModuleSetBuildExecution.post2(MavenModuleSetBuild.java:1040)
	at hudson.model.AbstractBuild$AbstractBuildExecution.post(AbstractBuild.java:725)
	at hudson.model.Run.execute(Run.java:1701)
	at hudson.maven.MavenModuleSetBuild.run(MavenModuleSetBuild.java:529)
	at hudson.model.ResourceController.execute(ResourceController.java:88)
	at hudson.model.Executor.run(Executor.java:231)
Caused by: org.apache.maven.wagon.TransferFailedException: peer not authenticated
	at org.apache.maven.wagon.shared.http4.AbstractHttpClientWagon.put(AbstractHttpClientWagon.java:580)
	at org.apache.maven.wagon.shared.http4.AbstractHttpClientWagon.put(AbstractHttpClientWagon.java:524)
	at org.apache.maven.wagon.shared.http4.AbstractHttpClientWagon.put(AbstractHttpClientWagon.java:505)
	at org.apache.maven.wagon.shared.http4.AbstractHttpClientWagon.put(AbstractHttpClientWagon.java:485)
	at org.apache.maven.repository.legacy.DefaultWagonManager.putRemoteFile(DefaultWagonManager.java:543)
	at org.apache.maven.repository.legacy.DefaultWagonManager.putArtifact(DefaultWagonManager.java:494)
	at hudson.maven.artifact.deployer.DefaultArtifactDeployer.deploy(DefaultArtifactDeployer.java:160)
	... 11 more
Caused by: javax.net.ssl.SSLPeerUnverifiedException: peer not authenticated
	at sun.security.ssl.SSLSessionImpl.getPeerCertificates(SSLSessionImpl.java:397)
	at org.apache.http.conn.ssl.AbstractVerifier.verify(AbstractVerifier.java:126)
	at org.apache.http.conn.ssl.SSLSocketFactory.connectSocket(SSLSocketFactory.java:437)
	at org.apache.maven.wagon.shared.http4.ConfigurableSSLSocketFactoryDecorator.connectSocket(ConfigurableSSLSocketFactoryDecorator.java:64)
	at org.apache.http.impl.conn.DefaultClientConnectionOperator.openConnection(DefaultClientConnectionOperator.java:180)
	at org.apache.http.impl.conn.ManagedClientConnectionImpl.open(ManagedClientConnectionImpl.java:294)
	at org.apache.http.impl.client.DefaultRequestDirector.tryConnect(DefaultRequestDirector.java:643)
	at org.apache.http.impl.client.DefaultRequestDirector.execute(DefaultRequestDirector.java:479)
	at org.apache.http.impl.client.AbstractHttpClient.execute(AbstractHttpClient.java:906)
	at org.apache.http.impl.client.AbstractHttpClient.execute(AbstractHttpClient.java:805)
	at org.apache.maven.wagon.shared.http4.AbstractHttpClientWagon.execute(AbstractHttpClientWagon.java:746)
	at org.apache.maven.wagon.shared.http4.AbstractHttpClientWagon.put(AbstractHttpClientWagon.java:574)
	... 17 more
[INFO] Deployment failed after 2 min 50 sec
Build step 'Deploy artifacts to Maven repository' changed build result to FAILURE

Mime
View raw message