myfaces-commits mailing list archives

Site index · List index
Message view « Date » · « Thread »
Top « Date » · « Thread »
From Apache Jenkins Server <jenk...@builds.apache.org>
Subject Build failed in Jenkins: myfaces-current11 #1180
Date Tue, 01 Jul 2014 21:52:45 GMT
See <https://builds.apache.org/job/myfaces-current11/1180/>

------------------------------------------
[...truncated 1139 lines...]
Jul 1, 2014 2:52:08 PM org.apache.myfaces.shared_impl.config.MyfacesConfig getBooleanInitParameter
INFO: No context init parameter 'org.apache.myfaces.PRETTY_HTML' found, using default value
true
Jul 1, 2014 2:52:08 PM org.apache.myfaces.shared_impl.config.MyfacesConfig getBooleanInitParameter
INFO: No context init parameter 'org.apache.myfaces.ALLOW_JAVASCRIPT' found, using default
value true
Jul 1, 2014 2:52:08 PM org.apache.myfaces.shared_impl.config.MyfacesConfig getBooleanInitParameter
INFO: No context init parameter 'org.apache.myfaces.READONLY_AS_DISABLED_FOR_SELECTS' found,
using default value true
Jul 1, 2014 2:52:08 PM org.apache.myfaces.shared_impl.config.MyfacesConfig getBooleanInitParameter
INFO: No context init parameter 'org.apache.myfaces.RENDER_VIEWSTATE_ID' found, using default
value true
Jul 1, 2014 2:52:08 PM org.apache.myfaces.shared_impl.config.MyfacesConfig getBooleanInitParameter
INFO: No context init parameter 'org.apache.myfaces.STRICT_XHTML_LINKS' found, using default
value true
Jul 1, 2014 2:52:08 PM org.apache.myfaces.shared_impl.config.MyfacesConfig getLongInitParameter
INFO: No context init parameter 'org.apache.myfaces.CONFIG_REFRESH_PERIOD' found, using default
value 2
Jul 1, 2014 2:52:08 PM org.apache.myfaces.shared_impl.config.MyfacesConfig createAndInitializeMyFacesConfig
INFO: Tomahawk jar not available. Autoscrolling, DetectJavascript, AddResourceClass and CheckExtensionsFilter
are disabled now.
Jul 1, 2014 2:52:08 PM org.apache.myfaces.shared_impl.config.MyfacesConfig createAndInitializeMyFacesConfig
INFO: Starting up Tomahawk on the MyFaces-JSF-Implementation
Tests run: 2, Failures: 0, Errors: 0, Skipped: 0, Time elapsed: 0.031 sec
Running org.apache.myfaces.renderkit.html.HtmlSecretRendererTest
WARNING: Component _id0 just got an automatic id, because there was no id assigned yet. If
this component was created dynamically (i.e. not by a JSP tag) you should assign it an explicit
static id or assign it the id you get from the createUniqueId from the current UIViewRoot
component right after creation!
WARNING: Component _id0 just got an automatic id, because there was no id assigned yet. If
this component was created dynamically (i.e. not by a JSP tag) you should assign it an explicit
static id or assign it the id you get from the createUniqueId from the current UIViewRoot
component right after creation!
Tests run: 2, Failures: 0, Errors: 0, Skipped: 0, Time elapsed: 0.04 sec
Running org.apache.myfaces.renderkit.html.HtmlImageRendererTest
Jul 1, 2014 2:52:08 PM org.apache.myfaces.shared_impl.renderkit.html.HtmlImageRendererBase
encodeEnd
WARNING: ALT attribute is missing for : img1
Jul 1, 2014 2:52:08 PM org.apache.myfaces.shared_impl.renderkit.html.HtmlImageRendererBase
encodeEnd
WARNING: ALT attribute is missing for : img1
Jul 1, 2014 2:52:08 PM org.apache.myfaces.shared_impl.renderkit.html.HtmlImageRendererBase
encodeEnd
WARNING: ALT attribute is missing for : img1
Tests run: 3, Failures: 0, Errors: 0, Skipped: 0, Time elapsed: 0.054 sec
Running org.apache.myfaces.renderkit.html.HtmlCheckboxRendererTest
WARNING: Component _id0 just got an automatic id, because there was no id assigned yet. If
this component was created dynamically (i.e. not by a JSP tag) you should assign it an explicit
static id or assign it the id you get from the createUniqueId from the current UIViewRoot
component right after creation!
WARNING: Component _id0 just got an automatic id, because there was no id assigned yet. If
this component was created dynamically (i.e. not by a JSP tag) you should assign it an explicit
static id or assign it the id you get from the createUniqueId from the current UIViewRoot
component right after creation!
Tests run: 2, Failures: 0, Errors: 0, Skipped: 0, Time elapsed: 0.036 sec
Running org.apache.myfaces.renderkit.html.HtmlTextareaRendererTest
WARNING: Component _id0 just got an automatic id, because there was no id assigned yet. If
this component was created dynamically (i.e. not by a JSP tag) you should assign it an explicit
static id or assign it the id you get from the createUniqueId from the current UIViewRoot
component right after creation!
WARNING: Component _id0 just got an automatic id, because there was no id assigned yet. If
this component was created dynamically (i.e. not by a JSP tag) you should assign it an explicit
static id or assign it the id you get from the createUniqueId from the current UIViewRoot
component right after creation!
WARNING: Component _id0 just got an automatic id, because there was no id assigned yet. If
this component was created dynamically (i.e. not by a JSP tag) you should assign it an explicit
static id or assign it the id you get from the createUniqueId from the current UIViewRoot
component right after creation!
Tests run: 3, Failures: 0, Errors: 0, Skipped: 0, Time elapsed: 0.267 sec
Running org.apache.myfaces.renderkit.html.HtmlLabelRendererTest
WARNING: Component _id0 just got an automatic id, because there was no id assigned yet. If
this component was created dynamically (i.e. not by a JSP tag) you should assign it an explicit
static id or assign it the id you get from the createUniqueId from the current UIViewRoot
component right after creation!
Jul 1, 2014 2:52:09 PM org.apache.myfaces.shared_impl.renderkit.RendererUtils getClientId
INFO: Unable to find component 'compId' (calling findComponent on component '_id0'). We'll
try to return a guessed client-id anyways - this will be a problem if you put the referenced
component into a different naming-container. If this is the case, you can always use the full
client-id.
Tests run: 1, Failures: 0, Errors: 0, Skipped: 0, Time elapsed: 0.02 sec
Running org.apache.myfaces.renderkit.html.HtmlMenuRendererTest
WARNING: Component _id0 just got an automatic id, because there was no id assigned yet. If
this component was created dynamically (i.e. not by a JSP tag) you should assign it an explicit
static id or assign it the id you get from the createUniqueId from the current UIViewRoot
component right after creation!
WARNING: Component _id0 just got an automatic id, because there was no id assigned yet. If
this component was created dynamically (i.e. not by a JSP tag) you should assign it an explicit
static id or assign it the id you get from the createUniqueId from the current UIViewRoot
component right after creation!
Tests run: 2, Failures: 0, Errors: 0, Skipped: 0, Time elapsed: 0.017 sec
Running org.apache.myfaces.el.PropertyResolverTestCase
Tests run: 1, Failures: 0, Errors: 0, Skipped: 0, Time elapsed: 0.009 sec
Running org.apache.myfaces.renderkit.html.HtmlMessageRendererTest
WARNING: Component _id0 just got an automatic id, because there was no id assigned yet. If
this component was created dynamically (i.e. not by a JSP tag) you should assign it an explicit
static id or assign it the id you get from the createUniqueId from the current UIViewRoot
component right after creation!
WARNING: Component _id0 just got an automatic id, because there was no id assigned yet. If
this component was created dynamically (i.e. not by a JSP tag) you should assign it an explicit
static id or assign it the id you get from the createUniqueId from the current UIViewRoot
component right after creation!
Tests run: 2, Failures: 0, Errors: 0, Skipped: 0, Time elapsed: 0.008 sec

Results :

Tests run: 48, Failures: 0, Errors: 0, Skipped: 0

[JENKINS] Recording test results
[INFO] 
[INFO] --- maven-jar-plugin:2.3.2:jar (default-jar) @ myfaces-impl ---
[INFO] Building jar: F:\jenkins\jenkins-slave\workspace\myfaces-current11\current11\core\impl\target\myfaces-impl-1.1.11-SNAPSHOT.jar
[INFO] 
[INFO] --- maven-site-plugin:3.0:attach-descriptor (attach-descriptor) @ myfaces-impl ---
[INFO] 
[INFO] >>> maven-source-plugin:2.0.4:jar (attach-source) @ myfaces-impl >>>
[INFO] 
[INFO] --- myfaces-builder-plugin:1.0.10:build-metadata (makemyfacesmetadata) @ myfaces-impl
---
[INFO] model is up to date
[INFO] 
[INFO] --- myfaces-builder-plugin:1.0.10:make-config (makefacesconfig) @ myfaces-impl ---
[INFO] generated file standard-faces-config.xml is up to date
[INFO] 
[INFO] --- myfaces-builder-plugin:1.0.10:make-tags (make_tags) @ myfaces-impl ---
[INFO] generated component tag files are up to date
[INFO] 
[INFO] --- myfaces-builder-plugin:1.0.10:make-config (makecoretld) @ myfaces-impl ---
[INFO] generated file myfaces_core.tld is up to date
[INFO] 
[INFO] --- myfaces-builder-plugin:1.0.10:make-config (makehtmltld) @ myfaces-impl ---
[INFO] generated file myfaces_html.tld is up to date
[WARNING] Failed to getClass for org.apache.maven.plugin.source.SourceJarMojo
[INFO] 
[INFO] <<< maven-source-plugin:2.0.4:jar (attach-source) @ myfaces-impl <<<
[INFO] 
[INFO] --- maven-source-plugin:2.0.4:jar (attach-source) @ myfaces-impl ---
[INFO] Building jar: F:\jenkins\jenkins-slave\workspace\myfaces-current11\current11\core\impl\target\myfaces-impl-1.1.11-SNAPSHOT-sources.jar
[INFO] 
[INFO] --- maven-checkstyle-plugin:2.6:check (verify-style) @ myfaces-impl ---
[INFO] 
[INFO] 
[INFO] --- maven-install-plugin:2.3.1:install (default-install) @ myfaces-impl ---
[INFO] Installing F:\jenkins\jenkins-slave\workspace\myfaces-current11\current11\core\impl\target\myfaces-impl-1.1.11-SNAPSHOT.jar
to f:\jenkins\jenkins-slave\maven-repositories\1\org\apache\myfaces\core\myfaces-impl\1.1.11-SNAPSHOT\myfaces-impl-1.1.11-SNAPSHOT.jar
[INFO] Installing F:\jenkins\jenkins-slave\workspace\myfaces-current11\current11\core\impl\pom.xml
to f:\jenkins\jenkins-slave\maven-repositories\1\org\apache\myfaces\core\myfaces-impl\1.1.11-SNAPSHOT\myfaces-impl-1.1.11-SNAPSHOT.pom
[INFO] Installing F:\jenkins\jenkins-slave\workspace\myfaces-current11\current11\core\impl\target\myfaces-impl-1.1.11-SNAPSHOT-sources.jar
to f:\jenkins\jenkins-slave\maven-repositories\1\org\apache\myfaces\core\myfaces-impl\1.1.11-SNAPSHOT\myfaces-impl-1.1.11-SNAPSHOT-sources.jar
[INFO]                                                                         
[INFO] ------------------------------------------------------------------------
[INFO] Building Build Project 1.1.8-SNAPSHOT
[INFO] ------------------------------------------------------------------------
[INFO] 
[INFO] --- maven-remote-resources-plugin:1.1:process (default) @ myfaces-base ---
[INFO] Setting property: classpath.resource.loader.class => 'org.codehaus.plexus.velocity.ContextClassLoaderResourceLoader'.
[INFO] Setting property: velocimacro.messages.on => 'false'.
[INFO] Setting property: resource.loader => 'classpath'.
[INFO] Setting property: resource.manager.logwhenfound => 'false'.
[INFO] 
[INFO] --- maven-install-plugin:2.3:install (default-install) @ myfaces-base ---
[INFO] Installing <https://builds.apache.org/job/myfaces-current11/ws/current11\pom.xml>
to f:\jenkins\jenkins-slave\maven-repositories\1\org\apache\myfaces\myfaces-base\1.1.8-SNAPSHOT\myfaces-base-1.1.8-SNAPSHOT.pom
[INFO] ------------------------------------------------------------------------
[INFO] Reactor Summary:
[INFO] 
[INFO] Apache MyFaces Shared For JSF 1.1 - Project ....... SUCCESS [18.347s]
[INFO] Apache MyFaces Shared For JSF 1.1 - Core .......... SUCCESS [19.732s]
[INFO] MyFaces Shared Impl ............................... SUCCESS [14.556s]
[INFO] MyFaces Shared Tomahawk ........................... SUCCESS [9.633s]
[INFO] Apache MyFaces Shared - Orchestra ................. SUCCESS [8.530s]
[INFO] Apache MyFaces JSF-1.1 Core Project ............... SUCCESS [6.038s]
[INFO] Apache MyFaces JSF-1.1 API ........................ SUCCESS [23.926s]
[INFO] Apache MyFaces JSF-1.1 Implementation ............. SUCCESS [32.565s]
[INFO] Build Project ..................................... SUCCESS [3.861s]
[INFO] ------------------------------------------------------------------------
[INFO] BUILD SUCCESS
[INFO] ------------------------------------------------------------------------
[INFO] Total time: 2:28.975s
[INFO] Finished at: Tue Jul 01 14:52:27 PDT 2014
[INFO] Final Memory: 31M/76M
[INFO] ------------------------------------------------------------------------
Waiting for Jenkins to finish collecting data
[JENKINS] Archiving F:\jenkins\jenkins-slave\workspace\myfaces-current11\current11\shared\shared-tomahawk\pom.xml
to org.apache.myfaces.shared/myfaces-shared-tomahawk/2.0.15-SNAPSHOT/myfaces-shared-tomahawk-2.0.15-SNAPSHOT.pom
[JENKINS] Archiving F:\jenkins\jenkins-slave\workspace\myfaces-current11\current11\shared\shared-tomahawk\target\myfaces-shared-tomahawk-2.0.15-SNAPSHOT.jar
to org.apache.myfaces.shared/myfaces-shared-tomahawk/2.0.15-SNAPSHOT/myfaces-shared-tomahawk-2.0.15-SNAPSHOT.jar
[JENKINS] Archiving F:\jenkins\jenkins-slave\workspace\myfaces-current11\current11\shared\shared-tomahawk\target\myfaces-shared-tomahawk-2.0.15-SNAPSHOT-sources.jar
to org.apache.myfaces.shared/myfaces-shared-tomahawk/2.0.15-SNAPSHOT/myfaces-shared-tomahawk-2.0.15-SNAPSHOT-sources.jar
Sending artifact delta relative to myfaces-current11 » MyFaces Shared Tomahawk #1179
Archived 3 artifacts
Archive block size is 32768
Received 0 blocks and 489200 bytes
Compression is 0.0%
Took 0.21 sec
[JENKINS] Archiving F:\jenkins\jenkins-slave\workspace\myfaces-current11\current11\core\impl\pom.xml
to org.apache.myfaces.core/myfaces-impl/1.1.11-SNAPSHOT/myfaces-impl-1.1.11-SNAPSHOT.pom
[JENKINS] Archiving F:\jenkins\jenkins-slave\workspace\myfaces-current11\current11\core\impl\target\myfaces-impl-1.1.11-SNAPSHOT.jar
to org.apache.myfaces.core/myfaces-impl/1.1.11-SNAPSHOT/myfaces-impl-1.1.11-SNAPSHOT.jar
[JENKINS] Archiving F:\jenkins\jenkins-slave\workspace\myfaces-current11\current11\core\impl\target\myfaces-impl-1.1.11-SNAPSHOT-sources.jar
to org.apache.myfaces.core/myfaces-impl/1.1.11-SNAPSHOT/myfaces-impl-1.1.11-SNAPSHOT-sources.jar
Sending artifact delta relative to myfaces-current11 » Apache MyFaces JSF-1.1 Implementation
#1179
Archived 3 artifacts
Archive block size is 32768
Received 0 blocks and 1330849 bytes
Compression is 0.0%
Took 0.44 sec
[JENKINS] Archiving F:\jenkins\jenkins-slave\workspace\myfaces-current11\current11\shared\shared-impl\pom.xml
to org.apache.myfaces.shared/myfaces-shared-impl/2.0.15-SNAPSHOT/myfaces-shared-impl-2.0.15-SNAPSHOT.pom
[JENKINS] Archiving F:\jenkins\jenkins-slave\workspace\myfaces-current11\current11\shared\shared-impl\target\myfaces-shared-impl-2.0.15-SNAPSHOT.jar
to org.apache.myfaces.shared/myfaces-shared-impl/2.0.15-SNAPSHOT/myfaces-shared-impl-2.0.15-SNAPSHOT.jar
[JENKINS] Archiving F:\jenkins\jenkins-slave\workspace\myfaces-current11\current11\shared\shared-impl\target\myfaces-shared-impl-2.0.15-SNAPSHOT-sources.jar
to org.apache.myfaces.shared/myfaces-shared-impl/2.0.15-SNAPSHOT/myfaces-shared-impl-2.0.15-SNAPSHOT-sources.jar
Sending artifact delta relative to myfaces-current11 » MyFaces Shared Impl #1179
Archived 3 artifacts
Archive block size is 32768
Received 0 blocks and 486124 bytes
Compression is 0.0%
Took 0.17 sec
[JENKINS] Archiving F:\jenkins\jenkins-slave\workspace\myfaces-current11\current11\shared\core\pom.xml
to org.apache.myfaces.shared/myfaces-shared-core/2.0.15-SNAPSHOT/myfaces-shared-core-2.0.15-SNAPSHOT.pom
[JENKINS] Archiving F:\jenkins\jenkins-slave\workspace\myfaces-current11\current11\shared\core\target\myfaces-shared-core-2.0.15-SNAPSHOT.jar
to org.apache.myfaces.shared/myfaces-shared-core/2.0.15-SNAPSHOT/myfaces-shared-core-2.0.15-SNAPSHOT.jar
[JENKINS] Archiving F:\jenkins\jenkins-slave\workspace\myfaces-current11\current11\shared\core\target\myfaces-shared-core-2.0.15-SNAPSHOT-sources.jar
to org.apache.myfaces.shared/myfaces-shared-core/2.0.15-SNAPSHOT/myfaces-shared-core-2.0.15-SNAPSHOT-sources.jar
Sending artifact delta relative to myfaces-current11 » Apache MyFaces Shared For JSF 1.1
- Core #1179
Archived 3 artifacts
Archive block size is 32768
Received 0 blocks and 481315 bytes
Compression is 0.0%
Took 0.56 sec
[JENKINS] Archiving F:\jenkins\jenkins-slave\workspace\myfaces-current11\current11\core\api\pom.xml
to org.apache.myfaces.core/myfaces-api/1.1.11-SNAPSHOT/myfaces-api-1.1.11-SNAPSHOT.pom
[JENKINS] Archiving F:\jenkins\jenkins-slave\workspace\myfaces-current11\current11\core\api\target\myfaces-api-1.1.11-SNAPSHOT.jar
to org.apache.myfaces.core/myfaces-api/1.1.11-SNAPSHOT/myfaces-api-1.1.11-SNAPSHOT.jar
[JENKINS] Archiving F:\jenkins\jenkins-slave\workspace\myfaces-current11\current11\core\api\target\myfaces-api-1.1.11-SNAPSHOT-sources.jar
to org.apache.myfaces.core/myfaces-api/1.1.11-SNAPSHOT/myfaces-api-1.1.11-SNAPSHOT-sources.jar
Sending artifact delta relative to myfaces-current11 » Apache MyFaces JSF-1.1 API #1179
Archived 3 artifacts
Archive block size is 32768
Received 0 blocks and 767907 bytes
Compression is 0.0%
Took 0.24 sec
[JENKINS] Archiving F:\jenkins\jenkins-slave\workspace\myfaces-current11\current11\shared\shared-orchestra\pom.xml
to org.apache.myfaces.shared/myfaces-shared-orchestra/2.0.15-SNAPSHOT/myfaces-shared-orchestra-2.0.15-SNAPSHOT.pom
[JENKINS] Archiving F:\jenkins\jenkins-slave\workspace\myfaces-current11\current11\shared\shared-orchestra\target\myfaces-shared-orchestra-2.0.15-SNAPSHOT.jar
to org.apache.myfaces.shared/myfaces-shared-orchestra/2.0.15-SNAPSHOT/myfaces-shared-orchestra-2.0.15-SNAPSHOT.jar
[JENKINS] Archiving F:\jenkins\jenkins-slave\workspace\myfaces-current11\current11\shared\shared-orchestra\target\myfaces-shared-orchestra-2.0.15-SNAPSHOT-sources.jar
to org.apache.myfaces.shared/myfaces-shared-orchestra/2.0.15-SNAPSHOT/myfaces-shared-orchestra-2.0.15-SNAPSHOT-sources.jar
Sending artifact delta relative to myfaces-current11 » Apache MyFaces Shared - Orchestra
#1179
Archived 3 artifacts
Archive block size is 32768
Received 0 blocks and 489524 bytes
Compression is 0.0%
Took 0.13 sec
[JENKINS] Archiving F:\jenkins\jenkins-slave\workspace\myfaces-current11\current11\shared\pom.xml
to org.apache.myfaces.shared/myfaces-shared-project/2.0.15-SNAPSHOT/myfaces-shared-project-2.0.15-SNAPSHOT.pom
[JENKINS] Archiving F:\jenkins\jenkins-slave\workspace\myfaces-current11\current11\shared\target\myfaces-shared-project-2.0.15-SNAPSHOT-site.xml
to org.apache.myfaces.shared/myfaces-shared-project/2.0.15-SNAPSHOT/myfaces-shared-project-2.0.15-SNAPSHOT-site.xml
Sending artifact delta relative to myfaces-current11 » Apache MyFaces Shared For JSF 1.1
- Project #1179
Archived 2 artifacts
Archive block size is 32768
Received 0 blocks and 10288 bytes
Compression is 0.0%
Took 1.8 sec
[JENKINS] Archiving F:\jenkins\jenkins-slave\workspace\myfaces-current11\current11\core\pom.xml
to org.apache.myfaces.core/myfaces-core-project/1.1.11-SNAPSHOT/myfaces-core-project-1.1.11-SNAPSHOT.pom
[JENKINS] Archiving F:\jenkins\jenkins-slave\workspace\myfaces-current11\current11\core\target\myfaces-core-project-1.1.11-SNAPSHOT-site.xml
to org.apache.myfaces.core/myfaces-core-project/1.1.11-SNAPSHOT/myfaces-core-project-1.1.11-SNAPSHOT-site.xml
Sending artifact delta relative to myfaces-current11 » Apache MyFaces JSF-1.1 Core Project
#1179
Archived 2 artifacts
Archive block size is 32768
Received 0 blocks and 20788 bytes
Compression is 0.0%
Took 0.1 sec
[JENKINS] Archiving <https://builds.apache.org/job/myfaces-current11/ws/current11\pom.xml>
to org.apache.myfaces/myfaces-base/1.1.8-SNAPSHOT/myfaces-base-1.1.8-SNAPSHOT.pom
Sending artifact delta relative to myfaces-current11 » Build Project #1179
Archived 1 artifacts
Archive block size is 32768
Received 0 blocks and 1172 bytes
Compression is 0.0%
Took 0.12 sec
channel stopped
Maven RedeployPublisher use remote windows2 maven settings from : f:\jenkins\tools\maven\latest/conf/settings.xml
[ERROR] uniqueVersion == false is not anymore supported in maven 3
[INFO] Deployment in https://repository.apache.org/content/repositories/snapshots (id=apache.snapshots.https,uniqueVersion=false)
Deploying the main artifact myfaces-base-1.1.8-SNAPSHOT.pom
Downloading: https://repository.apache.org/content/repositories/snapshots/org/apache/myfaces/myfaces-base/1.1.8-SNAPSHOT/maven-metadata.xml
Downloaded: https://repository.apache.org/content/repositories/snapshots/org/apache/myfaces/myfaces-base/1.1.8-SNAPSHOT/maven-metadata.xml
(566 B at 0.2 KB/sec)
Uploading: https://repository.apache.org/content/repositories/snapshots/org/apache/myfaces/myfaces-base/1.1.8-SNAPSHOT/myfaces-base-1.1.8-20140701.215244-554.pom
ERROR: Failed to deploy artifacts: Could not transfer artifact org.apache.myfaces:myfaces-base:pom:1.1.8-20140701.215244-554
from/to apache.snapshots.https (https://repository.apache.org/content/repositories/snapshots):
Failed to transfer file: https://repository.apache.org/content/repositories/snapshots/org/apache/myfaces/myfaces-base/1.1.8-SNAPSHOT/myfaces-base-1.1.8-20140701.215244-554.pom.
Return code is: 401, ReasonPhrase: Unauthorized.
org.apache.maven.artifact.deployer.ArtifactDeploymentException: Failed to deploy artifacts:
Could not transfer artifact org.apache.myfaces:myfaces-base:pom:1.1.8-20140701.215244-554
from/to apache.snapshots.https (https://repository.apache.org/content/repositories/snapshots):
Failed to transfer file: https://repository.apache.org/content/repositories/snapshots/org/apache/myfaces/myfaces-base/1.1.8-SNAPSHOT/myfaces-base-1.1.8-20140701.215244-554.pom.
Return code is: 401, ReasonPhrase: Unauthorized.
	at org.apache.maven.artifact.deployer.DefaultArtifactDeployer.deploy(DefaultArtifactDeployer.java:143)
	at hudson.maven.reporters.MavenArtifactRecord.deploy(MavenArtifactRecord.java:193)
	at hudson.maven.RedeployPublisher.perform(RedeployPublisher.java:176)
	at hudson.tasks.BuildStepMonitor$1.perform(BuildStepMonitor.java:20)
	at hudson.model.AbstractBuild$AbstractBuildExecution.perform(AbstractBuild.java:804)
	at hudson.model.AbstractBuild$AbstractBuildExecution.performAllBuildSteps(AbstractBuild.java:776)
	at hudson.maven.MavenModuleSetBuild$MavenModuleSetBuildExecution.post2(MavenModuleSetBuild.java:1040)
	at hudson.model.AbstractBuild$AbstractBuildExecution.post(AbstractBuild.java:725)
	at hudson.model.Run.execute(Run.java:1701)
	at hudson.maven.MavenModuleSetBuild.run(MavenModuleSetBuild.java:529)
	at hudson.model.ResourceController.execute(ResourceController.java:88)
	at hudson.model.Executor.run(Executor.java:231)
Caused by: org.eclipse.aether.deployment.DeploymentException: Failed to deploy artifacts:
Could not transfer artifact org.apache.myfaces:myfaces-base:pom:1.1.8-20140701.215244-554
from/to apache.snapshots.https (https://repository.apache.org/content/repositories/snapshots):
Failed to transfer file: https://repository.apache.org/content/repositories/snapshots/org/apache/myfaces/myfaces-base/1.1.8-SNAPSHOT/myfaces-base-1.1.8-20140701.215244-554.pom.
Return code is: 401, ReasonPhrase: Unauthorized.
	at org.eclipse.aether.internal.impl.DefaultDeployer.deploy(DefaultDeployer.java:341)
	at org.eclipse.aether.internal.impl.DefaultDeployer.deploy(DefaultDeployer.java:269)
	at org.eclipse.aether.internal.impl.DefaultRepositorySystem.deploy(DefaultRepositorySystem.java:413)
	at org.apache.maven.artifact.deployer.DefaultArtifactDeployer.deploy(DefaultArtifactDeployer.java:139)
	... 11 more
Caused by: org.eclipse.aether.transfer.ArtifactTransferException: Could not transfer artifact
org.apache.myfaces:myfaces-base:pom:1.1.8-20140701.215244-554 from/to apache.snapshots.https
(https://repository.apache.org/content/repositories/snapshots): Failed to transfer file: https://repository.apache.org/content/repositories/snapshots/org/apache/myfaces/myfaces-base/1.1.8-SNAPSHOT/myfaces-base-1.1.8-20140701.215244-554.pom.
Return code is: 401, ReasonPhrase: Unauthorized.
	at org.eclipse.aether.connector.wagon.WagonRepositoryConnector$6.wrap(WagonRepositoryConnector.java:1016)
	at org.eclipse.aether.connector.wagon.WagonRepositoryConnector$6.wrap(WagonRepositoryConnector.java:1004)
	at org.eclipse.aether.connector.wagon.WagonRepositoryConnector$PutTask.run(WagonRepositoryConnector.java:895)
	at org.eclipse.aether.connector.wagon.WagonRepositoryConnector.put(WagonRepositoryConnector.java:522)
	at org.eclipse.aether.internal.impl.DefaultDeployer.deploy(DefaultDeployer.java:335)
	... 14 more
Caused by: org.apache.maven.wagon.TransferFailedException: Failed to transfer file: https://repository.apache.org/content/repositories/snapshots/org/apache/myfaces/myfaces-base/1.1.8-SNAPSHOT/myfaces-base-1.1.8-20140701.215244-554.pom.
Return code is: 401, ReasonPhrase: Unauthorized.
	at org.apache.maven.wagon.shared.http4.AbstractHttpClientWagon.put(AbstractHttpClientWagon.java:626)
	at org.apache.maven.wagon.shared.http4.AbstractHttpClientWagon.put(AbstractHttpClientWagon.java:524)
	at org.apache.maven.wagon.shared.http4.AbstractHttpClientWagon.put(AbstractHttpClientWagon.java:505)
	at org.apache.maven.wagon.shared.http4.AbstractHttpClientWagon.put(AbstractHttpClientWagon.java:485)
	at org.eclipse.aether.connector.wagon.WagonRepositoryConnector$PutTask.run(WagonRepositoryConnector.java:871)
	... 16 more
[INFO] Deployment failed after 3.1 sec
Build step 'Deploy artifacts to Maven repository' changed build result to FAILURE

Mime
View raw message