myfaces-commits mailing list archives

Site index · List index
Message view « Date » · « Thread »
Top « Date » · « Thread »
From Apache Jenkins Server <jenk...@builds.apache.org>
Subject Build failed in Jenkins: tobago-1.0.x » Tobago Apt #762
Date Thu, 12 Jun 2014 22:59:43 GMT
See <https://builds.apache.org/job/tobago-1.0.x/org.apache.myfaces.tobago$tobago-tool-apt/762/>

------------------------------------------
[INFO] ------------------------------------------------------------------------
[INFO] Building Tobago Apt
[INFO]    task-segment: [clean, install, checkstyle:check]
[INFO] ------------------------------------------------------------------------
[INFO] [clean:clean {execution: default-clean}]
[INFO] [remote-resources:process {execution: default}]
Downloading: http://repo1.maven.org/maven2/org/codehaus/modello/modello-core/1.0-alpha-13/modello-core-1.0-alpha-13.pom
1K downloaded  (modello-core-1.0-alpha-13.pom)
Downloading: http://repo1.maven.org/maven2/org/codehaus/modello/modello/1.0-alpha-13/modello-1.0-alpha-13.pom
9K downloaded  (modello-1.0-alpha-13.pom)
Downloading: http://repo1.maven.org/maven2/org/codehaus/plexus/plexus-container-default/1.0-alpha-12/plexus-container-default-1.0-alpha-12.pom
1K downloaded  (plexus-container-default-1.0-alpha-12.pom)
Downloading: http://repo1.maven.org/maven2/org/codehaus/plexus/plexus-containers/1.0.7-alpha-2/plexus-containers-1.0.7-alpha-2.pom
1K downloaded  (plexus-containers-1.0.7-alpha-2.pom)
Downloading: http://repo1.maven.org/maven2/org/codehaus/plexus/plexus-component-api/1.0-alpha-12/plexus-component-api-1.0-alpha-12.pom
918b downloaded  (plexus-component-api-1.0-alpha-12.pom)
Downloading: http://repo1.maven.org/maven2/org/codehaus/plexus/plexus-container-default/1.0-alpha-12/plexus-container-default-1.0-alpha-12.jar
Downloading: http://repo1.maven.org/maven2/org/codehaus/modello/modello-core/1.0-alpha-13/modello-core-1.0-alpha-13.jar
117K downloaded  (modello-core-1.0-alpha-13.jar)
193K downloaded  (plexus-container-default-1.0-alpha-12.jar)
Downloading: http://repo1.maven.org/maven2/org/codehaus/plexus/plexus-component-api/1.0-alpha-12/plexus-component-api-1.0-alpha-12.jar
31K downloaded  (plexus-component-api-1.0-alpha-12.jar)
[INFO] [resources:resources {execution: default-resources}]
[INFO] Using 'UTF-8' encoding to copy filtered resources.
[INFO] Copying 3 resources
[INFO] Copying 3 resources
[INFO] [compiler:compile {execution: default-compile}]
[INFO] Compiling 17 source files to <https://builds.apache.org/job/tobago-1.0.x/org.apache.myfaces.tobago$tobago-tool-apt/ws/target/classes>
[INFO] -------------------------------------------------------------
[ERROR] COMPILATION ERROR : 
[INFO] -------------------------------------------------------------
[ERROR] <https://builds.apache.org/job/tobago-1.0.x/org.apache.myfaces.tobago$tobago-tool-apt/ws/src/main/java/org/apache/myfaces/tobago/apt/PrintAnnotationVisitor.java>:[28,-1]
cannot access com.sun.tools.apt.mirror.declaration.EnumConstantDeclarationImpl
bad class file: /home/jenkins/tools/java/jdk1.7.0_55/jre/../lib/tools.jar(com/sun/tools/apt/mirror/declaration/EnumConstantDeclarationImpl.class)
class file has wrong version 51.0, should be 49.0
[INFO] 1 error
[INFO] -------------------------------------------------------------
[INFO] ------------------------------------------------------------------------
[ERROR] BUILD FAILURE
[INFO] ------------------------------------------------------------------------
[INFO] Compilation failure
<https://builds.apache.org/job/tobago-1.0.x/org.apache.myfaces.tobago$tobago-tool-apt/ws/src/main/java/org/apache/myfaces/tobago/apt/PrintAnnotationVisitor.java>:[28,-1]
cannot access com.sun.tools.apt.mirror.declaration.EnumConstantDeclarationImpl
bad class file: /home/jenkins/tools/java/jdk1.7.0_55/jre/../lib/tools.jar(com/sun/tools/apt/mirror/declaration/EnumConstantDeclarationImpl.class)
class file has wrong version 51.0, should be 49.0

[INFO] ------------------------------------------------------------------------
[INFO] For more information, run Maven with the -e switch
[INFO] ------------------------------------------------------------------------
[INFO] Total time: 53 seconds
[INFO] Finished at: Thu Jun 12 22:58:59 UTC 2014
[INFO] Final Memory: 47M/675M
[INFO] ------------------------------------------------------------------------
Waiting for Jenkins to finish collecting data

Mime
View raw message