myfaces-commits mailing list archives

Site index · List index
Message view « Date » · « Thread »
Top « Date » · « Thread »
From Apache Jenkins Server <jenk...@builds.apache.org>
Subject Build failed in Jenkins: myfaces-current-2.0 #2378
Date Sat, 14 Jun 2014 23:59:40 GMT
See <https://builds.apache.org/job/myfaces-current-2.0/2378/>

------------------------------------------
[...truncated 294 lines...]
[WARNING] [WARNING] The symbol found is declared but is apparently never used.
This code can probably be written in a more efficient way.
obj,finalAttr,value);}var found ---> = <--- false;var prefix=(value)?

[WARNING] [WARNING] The symbol _tokenPos is declared but is apparently never used.
This code can probably be written in a more efficient way.
=-1,_contentEnd=-1,_tokenPos ---> = <--- 0,_tokenForward=1,tagNameStart=(

[WARNING] [WARNING] The symbol _tokenForward is declared but is apparently never used.
This code can probably be written in a more efficient way.
_contentEnd=-1,_tokenPos=0,_tokenForward ---> = <--- 1,tagNameStart=(!tagNameStart)?

[WARNING] [WARNING] The symbol _RT is declared but is apparently never used.
This code can probably be written in a more efficient way.
{var _Lang=this._Lang;var _RT ---> = <--- this._RT;try{var scopeThis=

[WARNING] [WARNING] The symbol _AJAXUTIL is declared but is apparently never used.
This code can probably be written in a more efficient way.
},getFormData:function (){var _AJAXUTIL ---> = <--- this._AJAXUTIL,myfacesOptions=this._context

[WARNING] [WARNING] The symbol myfacesOptions is declared but is apparently never used.
This code can probably be written in a more efficient way.
){var _AJAXUTIL=this._AJAXUTIL,myfacesOptions ---> = <--- this._context.myfaces;return
this.
[INFO] jsf-minimal-modern.js (260,383 bytes) ...................... compressed at 73%
[INFO] jsf-legacy.js (38,152 bytes) ............................... compressed at 76%
[INFO] Messages_nl.js (5,112 bytes) ............................... compressed at 39%
[INFO] Messages_ru.js (5,855 bytes) ............................... compressed at 33%
[INFO] Messages_zh_HK.js (5,962 bytes) ............................ compressed at 54%
[INFO] Messages_de.js (5,721 bytes) ............................... compressed at 44%
[INFO] Messages_it.js (5,101 bytes) ............................... compressed at 38%
[INFO] Messages.js (5,525 bytes) .................................. compressed at 47%
[INFO] Messages_zh_CN.js (5,630 bytes) ............................ compressed at 51%
[INFO] Messages_es.js (5,397 bytes) ............................... compressed at 38%
[INFO] Messages_zh_TW.js (6,371 bytes) ............................ compressed at 57%
[INFO] Messages_fr.js (5,532 bytes) ............................... compressed at 40%

[WARNING] [WARNING] Using 'eval' is not recommended...
[INFO] Using 'eval' reduces the level of compression!
function (){var _r=window.eval ---> . <--- call(window,code);if(

[WARNING] [WARNING] Using 'eval' is not recommended...
[INFO] Using 'eval' reduces the level of compression!
_T[_e]||((_w.eval ---> && <--- (!_b.isBlackBerry||_b.isBlackBerry

[WARNING] [WARNING] Using 'eval' is not recommended...
[INFO] Using 'eval' reduces the level of compression!
_T[_e]||((_w.eval ---> ) <--- ?"_evalHeadAppendix":null);}if(

[WARNING] [WARNING] Using 'eval' is not recommended...
[INFO] Using 'eval' reduces the level of compression!
[_e]](c);}eval ---> . <--- call(window,c);return null
[INFO] _EvalHandlers.js (6,652 bytes) ............................. compressed at 81%

[WARNING] [WARNING] Found an undeclared symbol: jsf
}catch(e){}if(jsf ---> . <--- getProjectStage()==="Development"){eventData.
[INFO] Impl.js (29,605 bytes) ..................................... compressed at 74%
[INFO] _EndImpl.js (1,514 bytes) .................................. compressed at 84%
[INFO] _RuntimeQuirks.js (2,081 bytes) ............................ compressed at 77%
[INFO] Object.js (3,459 bytes) .................................... compressed at 66%

[WARNING] [WARNING] The variable _T has already been declared in the same scope...
,tv=parseFloat(dav);var _T ---> = <--- this;_T.browser={};

[WARNING] [WARNING] The symbol assigned is declared but is apparently never used.
This code can probably be written in a more efficient way.
}:function (){};var assigned ---> = <--- true;}if("function"!=typeof newCls
[INFO] _Runtime.js (34,057 bytes) ................................. compressed at 79%
[INFO] _StartImpl.js (1,690 bytes) ................................ compressed at 75%
[INFO] _ExtRuntime.js (7,452 bytes) ............................... compressed at 77%

[WARNING] [WARNING] The variable i has already been declared in the same scope...
&&params!=null){for(var i ---> = <--- 0,param;(param=params[

[WARNING] [WARNING] The variable param has already been declared in the same scope...
){for(var i=0,param ---> ; <--- (param=params[i]);
[INFO] _OamSubmit.js (5,740 bytes) ................................ compressed at 67%
[INFO] _ListenerQueue.js (2,814 bytes) ............................ compressed at 76%

[WARNING] [WARNING] Found an undeclared symbol: jsf
.description);}else{if(jsf ---> . <--- ajax.getProjectStage()==="Development"){

[WARNING] [WARNING] The symbol jsf is declared but is apparently never used.
This code can probably be written in a more efficient way.
.description);}else{if(jsf ---> . <--- ajax.getProjectStage()==="Development"){
[INFO] _Dom.js (48,773 bytes) ..................................... compressed at 72%
[INFO] _Queue.js (5,264 bytes) .................................... compressed at 82%
[INFO] _LangQuirks.js (8,154 bytes) ............................... compressed at 77%

[WARNING] [WARNING] The symbol found is declared but is apparently never used.
This code can probably be written in a more efficient way.
obj,finalAttr,value);}var found ---> = <--- false;var prefix=(value)?
[INFO] _Lang.js (27,069 bytes) .................................... compressed at 68%
[INFO] _Logging.js (4,613 bytes) .................................. compressed at 65%
[INFO] _ExtDom.js (12,692 bytes) .................................. compressed at 73%
[INFO] _DomQuirks.js (24,708 bytes) ............................... compressed at 76%
[INFO] _DomExperimental.js (5,921 bytes) .......................... compressed at 73%
[INFO] _ExtLang.js (4,261 bytes) .................................. compressed at 73%

[WARNING] [WARNING] The variable tagNameStart has already been declared in the same scope...
,_tokenPos=0,_tokenForward=1,tagNameStart ---> = <--- (!tagNameStart)?BEGIN_TAG:tagNameStart;

[WARNING] [WARNING] The symbol _tokenPos is declared but is apparently never used.
This code can probably be written in a more efficient way.
=-1,_contentEnd=-1,_tokenPos ---> = <--- 0,_tokenForward=1,tagNameStart=(

[WARNING] [WARNING] The symbol _tokenForward is declared but is apparently never used.
This code can probably be written in a more efficient way.
_contentEnd=-1,_tokenPos=0,_tokenForward ---> = <--- 1,tagNameStart=(!tagNameStart)?
[INFO] _HtmlStripper.js (5,195 bytes) ............................. compressed at 84%

[WARNING] [WARNING] Found an undeclared symbol: jsf
_mfInternal=context._mfInternal||{};jsf ---> . <--- ajax.response((xhr.getXHRObject)

[WARNING] [WARNING] The symbol _RT is declared but is apparently never used.
This code can probably be written in a more efficient way.
{var _Lang=this._Lang;var _RT ---> = <--- this._RT;try{var scopeThis=

[WARNING] [WARNING] The symbol _AJAXUTIL is declared but is apparently never used.
This code can probably be written in a more efficient way.
},getFormData:function (){var _AJAXUTIL ---> = <--- this._AJAXUTIL,myfacesOptions=this._context

[WARNING] [WARNING] The symbol myfacesOptions is declared but is apparently never used.
This code can probably be written in a more efficient way.
){var _AJAXUTIL=this._AJAXUTIL,myfacesOptions ---> = <--- this._context.myfaces;return
this.
[INFO] _AjaxRequest.js (11,420 bytes) ............................. compressed at 68%
[INFO] _Transports.js (6,847 bytes) ............................... compressed at 82%
[INFO] XhrConst.js (1,429 bytes) .................................. compressed at 83%
[INFO] FormData.js (2,518 bytes) .................................. compressed at 70%
[INFO] IFrame.js (11,077 bytes) ................................... compressed at 68%
[INFO] BaseRequest.js (5,550 bytes) ............................... compressed at 85%
[INFO] Xhr1.js (6,399 bytes) ...................................... compressed at 59%
[INFO] _ExtTransport.js (8,726 bytes) ............................. compressed at 86%
[INFO] _AjaxResponse.js (33,092 bytes) ............................ compressed at 69%
[INFO] _AjaxUtils.js (5,487 bytes) ................................ compressed at 81%
[INFO] _IFrameRequest.js (2,187 bytes) ............................ compressed at 76%
[INFO] _AjaxRequestLevel2.js (2,011 bytes) ........................ compressed at 73%
[INFO] _ExtAjaxRequest.js (2,664 bytes) ........................... compressed at 77%
[INFO] _PartialSubmitUtils.js (5,118 bytes) ....................... compressed at 76%
[INFO] _AjaxRequestQueue.js (1,944 bytes) ......................... compressed at 78%
[INFO] jsf.js (8,317 bytes) ....................................... compressed at 83%

[WARNING] [WARNING] Using 'eval' is not recommended...
[INFO] Using 'eval' reduces the level of compression!
function (){var _r=window.eval ---> . <--- call(window,code);if(

[WARNING] [WARNING] Using 'eval' is not recommended...
[INFO] Using 'eval' reduces the level of compression!
_T[_e]||((_w.eval ---> && <--- (!_b.isBlackBerry||_b.isBlackBerry

[WARNING] [WARNING] Using 'eval' is not recommended...
[INFO] Using 'eval' reduces the level of compression!
_T[_e]||((_w.eval ---> ) <--- ?"_evalHeadAppendix":null);}if(

[WARNING] [WARNING] Using 'eval' is not recommended...
[INFO] Using 'eval' reduces the level of compression!
[_e]](c);}eval ---> . <--- call(window,c);return null

[WARNING] [WARNING] The variable _T has already been declared in the same scope...
,tv=parseFloat(dav);var _T ---> = <--- this;_T.browser={};

[WARNING] [WARNING] The variable tagNameStart has already been declared in the same scope...
,_tokenPos=0,_tokenForward=1,tagNameStart ---> = <--- (!tagNameStart)?BEGIN_TAG:tagNameStart;

[WARNING] [WARNING] The variable i has already been declared in the same scope...
&&params!=null){for(var i ---> = <--- 0,param;(param=params[

[WARNING] [WARNING] The variable param has already been declared in the same scope...
){for(var i=0,param ---> ; <--- (param=params[i]);

[WARNING] [WARNING] The symbol assigned is declared but is apparently never used.
This code can probably be written in a more efficient way.
}:function (){};var assigned ---> = <--- true;}if("function"!=typeof newCls

[WARNING] [WARNING] The symbol found is declared but is apparently never used.
This code can probably be written in a more efficient way.
obj,finalAttr,value);}var found ---> = <--- false;var prefix=(value)?

[WARNING] [WARNING] The symbol _tokenPos is declared but is apparently never used.
This code can probably be written in a more efficient way.
=-1,_contentEnd=-1,_tokenPos ---> = <--- 0,_tokenForward=1,tagNameStart=(

[WARNING] [WARNING] The symbol _tokenForward is declared but is apparently never used.
This code can probably be written in a more efficient way.
_contentEnd=-1,_tokenPos=0,_tokenForward ---> = <--- 1,tagNameStart=(!tagNameStart)?

[WARNING] [WARNING] The symbol _RT is declared but is apparently never used.
This code can probably be written in a more efficient way.
{var _Lang=this._Lang;var _RT ---> = <--- this._RT;try{var scopeThis=

[WARNING] [WARNING] The symbol _AJAXUTIL is declared but is apparently never used.
This code can probably be written in a more efficient way.
},getFormData:function (){var _AJAXUTIL ---> = <--- this._AJAXUTIL,myfacesOptions=this._context

[WARNING] [WARNING] The symbol myfacesOptions is declared but is apparently never used.
This code can probably be written in a more efficient way.
){var _AJAXUTIL=this._AJAXUTIL,myfacesOptions ---> = <--- this._context.myfaces;return
this.
[INFO] jsf-minimal.js (295,329 bytes) ............................. compressed at 73%
[INFO] ------------------------------------------------------------------------------
[INFO] compression saved 218,068 bytes
[INFO] [compiler:compile {execution: default-compile}]
[INFO] Compiling 386 source files to <https://builds.apache.org/job/myfaces-current-2.0/ws/current20/core/api/target/classes>
[INFO] [bundle:manifest {execution: bundle-manifest}]
[debug] execute contextualize
[INFO] [resources:testResources {execution: default-testResources}]
[INFO] Using 'UTF-8' encoding to copy filtered resources.
[INFO] Copying 0 resource
[INFO] Copying 3 resources
[INFO] [compiler:testCompile {execution: default-testCompile}]
[INFO] Compiling 66 source files to <https://builds.apache.org/job/myfaces-current-2.0/ws/current20/core/api/target/test-classes>
[INFO] ------------------------------------------------------------------------
[ERROR] BUILD FAILURE
[INFO] ------------------------------------------------------------------------
[INFO] Compilation failure

error: error reading /home/jenkins/jenkins-slave/maven-repositories/0/org/testng/testng/5.1/testng-5.1-jdk15.jar;
error in opening zip file
error: error reading /home/jenkins/jenkins-slave/maven-repositories/0/org/easymock/easymock/2.3/easymock-2.3.jar;
error in opening zip file
error: error reading /home/jenkins/jenkins-slave/maven-repositories/0/org/easymock/easymockclassextension/2.3/easymockclassextension-2.3.jar;
error in opening zip file

[INFO] ------------------------------------------------------------------------
[INFO] For more information, run Maven with the -e switch
[INFO] ------------------------------------------------------------------------
[INFO] Total time: 47 seconds
[INFO] Finished at: Sat Jun 14 23:59:25 UTC 2014
[INFO] Final Memory: 90M/420M
[INFO] ------------------------------------------------------------------------
[JENKINS] Archiving <https://builds.apache.org/job/myfaces-current-2.0/ws/current20/core/api/pom.xml>
to org.apache.myfaces.core/myfaces-api/2.0.22-SNAPSHOT/myfaces-api-2.0.22-SNAPSHOT.pom
Sending artifact delta relative to myfaces-current-2.0 ? Apache MyFaces JSF-2.0 Core API #2374
Archived 1 artifacts
Archive block size is 32768
Received 0 blocks and 33949 bytes
Compression is 0.0%
Took 1.5 sec
[JENKINS] Archiving <https://builds.apache.org/job/myfaces-current-2.0/ws/current20/core/parent/pom.xml>
to org.apache.myfaces.core/myfaces-core-project/2.0.22-SNAPSHOT/myfaces-core-project-2.0.22-SNAPSHOT.pom
[JENKINS] Archiving /home/jenkins/jenkins-slave/maven-repositories/0/org/apache/myfaces/core/myfaces-core-project/2.0.22-SNAPSHOT/myfaces-core-project-2.0.22-SNAPSHOT.pom
to org.apache.myfaces.core/myfaces-core-project/2.0.22-20140614.235856-36/myfaces-core-project-2.0.22-20140614.235856-36.pom
[JENKINS] Archiving <https://builds.apache.org/job/myfaces-current-2.0/ws/current20/core/parent/target/myfaces-core-project-2.0.22-SNAPSHOT-site.xml>
to org.apache.myfaces.core/myfaces-core-project/2.0.22-20140614.235856-36/myfaces-core-project-2.0.22-20140614.235856-36-site.xml
/home/jenkins/jenkins-slave/maven-repositories/0/org/apache/myfaces/core/myfaces-core-project/2.0.22-SNAPSHOT/myfaces-core-project-2.0.22-SNAPSHOT.pom
is not inside <https://builds.apache.org/job/myfaces-current-2.0/ws/current20/core/parent/;>
will archive in a separate pass
Sending artifact delta relative to myfaces-current-2.0 ? Apache MyFaces JSF-2.0 Core Project
#2374
Archived 2 artifacts
Archive block size is 32768
Received 0 blocks and 30369 bytes
Compression is 0.0%
Took 0.76 sec
Sending artifact delta relative to myfaces-current-2.0 ? Apache MyFaces JSF-2.0 Core Project
#2374
Archived 1 artifacts
Archive block size is 32768
Received 0 blocks and 24144 bytes
Compression is 0.0%
Took 0.16 sec
channel stopped

Mime
View raw message