myfaces-commits mailing list archives

Site index · List index
Message view « Date » · « Thread »
Top « Date » · « Thread »
From Apache Jenkins Server <jenk...@builds.apache.org>
Subject Build failed in Jenkins: myfaces-maven2-plugins #1286
Date Sun, 06 Apr 2014 22:38:12 GMT
See <https://builds.apache.org/job/myfaces-maven2-plugins/1286/>

------------------------------------------
[...truncated 1089 lines...]
Running org.apache.myfaces.buildtools.maven2.plugin.builder.BuildMetaDataMojoTest
Tests run: 1, Failures: 0, Errors: 0, Skipped: 0, Time elapsed: 0.003 sec

Results :

Tests run: 11, Failures: 0, Errors: 0, Skipped: 0

[JENKINS] Recording test results
[INFO] [jar:jar {execution: default-jar}]
[INFO] Building jar: <https://builds.apache.org/job/myfaces-maven2-plugins/ws/maven2-plugins/myfaces-builder-plugin/target/myfaces-builder-plugin-1.0.11-SNAPSHOT.jar>
[INFO] [plugin:addPluginArtifactMetadata {execution: default-addPluginArtifactMetadata}]
[INFO] [checkstyle:check {execution: verify-style}]
[INFO] 
[INFO] [install:install {execution: default-install}]
[INFO] Installing <https://builds.apache.org/job/myfaces-maven2-plugins/ws/maven2-plugins/myfaces-builder-plugin/target/myfaces-builder-plugin-1.0.11-SNAPSHOT.jar>
to /home/jenkins/jenkins-slave/maven-repositories/1/org/apache/myfaces/buildtools/myfaces-builder-plugin/1.0.11-SNAPSHOT/myfaces-builder-plugin-1.0.11-SNAPSHOT.jar
[INFO] ------------------------------------------------------------------------
[INFO] Building Apache MyFaces Buildtools Maven2 Faces Plugin
[INFO]    task-segment: [install]
[INFO] ------------------------------------------------------------------------
[INFO] [antrun:run {execution: javadoc.resources}]
[INFO] Executing tasks
     [copy] Copying 2 files to <https://builds.apache.org/job/myfaces-maven2-plugins/ws/maven2-plugins/myfaces-faces-plugin/target/apidocs/META-INF>
[INFO] Executed tasks
[INFO] [plugin:descriptor {execution: default-descriptor}]
[INFO] Using 'UTF-8' encoding to read mojo metadata.
[INFO] Applying mojo extractor for language: java
[INFO] Mojo extractor for language: java found 6 mojo descriptors.
[INFO] Applying mojo extractor for language: bsh
[INFO] Mojo extractor for language: bsh found 0 mojo descriptors.
[INFO] Setting property: classpath.resource.loader.class => 'org.codehaus.plexus.velocity.ContextClassLoaderResourceLoader'.
[INFO] Setting property: velocimacro.messages.on => 'false'.
[INFO] Setting property: resource.loader => 'classpath'.
[INFO] Setting property: resource.manager.logwhenfound => 'false'.
[INFO] [remote-resources:process {execution: default}]
[INFO] [resources:resources {execution: default-resources}]
[INFO] Using 'UTF-8' encoding to copy filtered resources.
[INFO] Copying 4 resources
[INFO] Copying 3 resources
[INFO] [compiler:compile {execution: default-compile}]
[INFO] Compiling 58 source files to <https://builds.apache.org/job/myfaces-maven2-plugins/ws/maven2-plugins/myfaces-faces-plugin/target/classes>
[INFO] [resources:testResources {execution: default-testResources}]
[INFO] Using 'UTF-8' encoding to copy filtered resources.
[INFO] Copying 12 resources
[INFO] Copying 3 resources
[INFO] [compiler:testCompile {execution: default-testCompile}]
[INFO] Compiling 3 source files to <https://builds.apache.org/job/myfaces-maven2-plugins/ws/maven2-plugins/myfaces-faces-plugin/target/test-classes>
[INFO] [surefire:test {execution: default-test}]
[INFO] Surefire report directory: <https://builds.apache.org/job/myfaces-maven2-plugins/ws/maven2-plugins/myfaces-faces-plugin/target/surefire-reports>

-------------------------------------------------------
 T E S T S
-------------------------------------------------------
Running org.apache.myfaces.buildtools.maven2.plugin.faces.GenerateFacesConfigMojoTest
[info] Generated META-INF/faces-config.xml
Tests run: 1, Failures: 0, Errors: 0, Skipped: 0, Time elapsed: 0.534 sec
Running org.apache.myfaces.buildtools.maven2.plugin.faces.GenerateComponentsMojoTest
[debug] Generating org.apache.myfaces.trinidad.component.UIXCommand, with generator: org.apache.myfaces.buildtools.maven2.plugin.faces.generator.component.MyFacesComponentGenerator
[debug] Using template org/apache/myfaces/trinidad/component/UIXCommandTemplate.java
[info] Generated 1 component(s)
[debug] Generating org.apache.myfaces.trinidad.component.UIXCommand, with generator: org.apache.myfaces.buildtools.maven2.plugin.faces.generator.component.MyFacesComponentGenerator
[debug] Using template org/apache/myfaces/trinidad/component/UIXCommandTemplate.java
[info] Generated 1 component(s)
[debug] Generating org.apache.myfaces.trinidad.component.UIXCommand, with generator: org.apache.myfaces.buildtools.maven2.plugin.faces.generator.component.MyFacesComponentGenerator
[debug] Using template org/apache/myfaces/trinidad/component/UIXCommandTemplate.java
[info] Generated 1 component(s)
Tests run: 3, Failures: 0, Errors: 0, Skipped: 0, Time elapsed: 0.133 sec

Results :

Tests run: 4, Failures: 0, Errors: 0, Skipped: 0

[JENKINS] Recording test results
[INFO] [jar:jar {execution: default-jar}]
[INFO] Building jar: <https://builds.apache.org/job/myfaces-maven2-plugins/ws/maven2-plugins/myfaces-faces-plugin/target/myfaces-faces-plugin-1.0.1-SNAPSHOT.jar>
[INFO] [plugin:addPluginArtifactMetadata {execution: default-addPluginArtifactMetadata}]
[INFO] [install:install {execution: default-install}]
[INFO] Installing <https://builds.apache.org/job/myfaces-maven2-plugins/ws/maven2-plugins/myfaces-faces-plugin/target/myfaces-faces-plugin-1.0.1-SNAPSHOT.jar>
to /home/jenkins/jenkins-slave/maven-repositories/1/org/apache/myfaces/buildtools/myfaces-faces-plugin/1.0.1-SNAPSHOT/myfaces-faces-plugin-1.0.1-SNAPSHOT.jar
[INFO] ------------------------------------------------------------------------
[INFO] Building Apache MyFaces Buildtools Maven2 i18n Plugin
[INFO]    task-segment: [install]
[INFO] ------------------------------------------------------------------------
[INFO] [antrun:run {execution: javadoc.resources}]
[INFO] Executing tasks
     [copy] Copying 2 files to <https://builds.apache.org/job/myfaces-maven2-plugins/ws/maven2-plugins/myfaces-i18n-plugin/target/apidocs/META-INF>
[INFO] Executed tasks
[INFO] [plugin:descriptor {execution: default-descriptor}]
[INFO] Using 2 extractors.
[INFO] Applying extractor for language: java
[INFO] Extractor for language: java found 2 mojo descriptors.
[INFO] Applying extractor for language: bsh
[INFO] Extractor for language: bsh found 0 mojo descriptors.
[INFO] [remote-resources:process {execution: default}]
[INFO] [resources:resources {execution: default-resources}]
[INFO] Using 'UTF-8' encoding to copy filtered resources.
[INFO] Copying 0 resource
[INFO] Copying 3 resources
[INFO] [compiler:compile {execution: default-compile}]
[INFO] Compiling 4 source files to <https://builds.apache.org/job/myfaces-maven2-plugins/ws/maven2-plugins/myfaces-i18n-plugin/target/classes>
[INFO] [resources:testResources {execution: default-testResources}]
[INFO] Using 'UTF-8' encoding to copy filtered resources.
[INFO] skip non existing resourceDirectory <https://builds.apache.org/job/myfaces-maven2-plugins/ws/maven2-plugins/myfaces-i18n-plugin/src/test/resources>
[INFO] Copying 3 resources
[INFO] [compiler:testCompile {execution: default-testCompile}]
[INFO] No sources to compile
[INFO] [surefire:test {execution: default-test}]
[INFO] Surefire report directory: <https://builds.apache.org/job/myfaces-maven2-plugins/ws/maven2-plugins/myfaces-i18n-plugin/target/surefire-reports>

-------------------------------------------------------
 T E S T S
-------------------------------------------------------
There are no tests to run.

Results :

Tests run: 0, Failures: 0, Errors: 0, Skipped: 0

[JENKINS] Recording test results
[INFO] [jar:jar {execution: default-jar}]
[INFO] Building jar: <https://builds.apache.org/job/myfaces-maven2-plugins/ws/maven2-plugins/myfaces-i18n-plugin/target/myfaces-i18n-plugin-1.0.1-SNAPSHOT.jar>
[INFO] [plugin:addPluginArtifactMetadata {execution: default-addPluginArtifactMetadata}]
[INFO] [install:install {execution: default-install}]
[INFO] Installing <https://builds.apache.org/job/myfaces-maven2-plugins/ws/maven2-plugins/myfaces-i18n-plugin/target/myfaces-i18n-plugin-1.0.1-SNAPSHOT.jar>
to /home/jenkins/jenkins-slave/maven-repositories/1/org/apache/myfaces/buildtools/myfaces-i18n-plugin/1.0.1-SNAPSHOT/myfaces-i18n-plugin-1.0.1-SNAPSHOT.jar
[INFO] ------------------------------------------------------------------------
[INFO] Building Apache MyFaces Buildtools Maven2 Javacc Plugin
[INFO]    task-segment: [install]
[INFO] ------------------------------------------------------------------------
[INFO] [antrun:run {execution: javadoc.resources}]
[INFO] Executing tasks
     [copy] Copying 2 files to <https://builds.apache.org/job/myfaces-maven2-plugins/ws/maven2-plugins/myfaces-javacc-plugin/target/apidocs/META-INF>
[INFO] Executed tasks
[INFO] [plugin:descriptor {execution: default-descriptor}]
[INFO] Using 'UTF-8' encoding to read mojo metadata.
[INFO] Applying mojo extractor for language: java
[INFO] Mojo extractor for language: java found 1 mojo descriptors.
[INFO] Applying mojo extractor for language: bsh
[INFO] Mojo extractor for language: bsh found 0 mojo descriptors.
[INFO] [remote-resources:process {execution: default}]
[INFO] [resources:resources {execution: default-resources}]
[INFO] Using 'UTF-8' encoding to copy filtered resources.
[INFO] Copying 0 resource
[INFO] Copying 3 resources
[INFO] [compiler:compile {execution: default-compile}]
[INFO] Compiling 1 source file to <https://builds.apache.org/job/myfaces-maven2-plugins/ws/maven2-plugins/myfaces-javacc-plugin/target/classes>
[INFO] [resources:testResources {execution: default-testResources}]
[INFO] Using 'UTF-8' encoding to copy filtered resources.
[INFO] Copying 8 resources
[INFO] Copying 3 resources
[INFO] [compiler:testCompile {execution: default-testCompile}]
[INFO] Compiling 1 source file to <https://builds.apache.org/job/myfaces-maven2-plugins/ws/maven2-plugins/myfaces-javacc-plugin/target/test-classes>
[INFO] [surefire:test {execution: default-test}]
[INFO] Surefire report directory: <https://builds.apache.org/job/myfaces-maven2-plugins/ws/maven2-plugins/myfaces-javacc-plugin/target/surefire-reports>

-------------------------------------------------------
 T E S T S
-------------------------------------------------------
Running org.apache.myfaces.buildtools.maven2.plugin.javacc.JavaCCMojoTest
Tests run: 1, Failures: 0, Errors: 0, Skipped: 0, Time elapsed: 0.029 sec

Results :

Tests run: 1, Failures: 0, Errors: 0, Skipped: 0

[JENKINS] Recording test results
[INFO] [jar:jar {execution: default-jar}]
[INFO] Building jar: <https://builds.apache.org/job/myfaces-maven2-plugins/ws/maven2-plugins/myfaces-javacc-plugin/target/myfaces-javacc-plugin-1.0.2-SNAPSHOT.jar>
[INFO] [plugin:addPluginArtifactMetadata {execution: default-addPluginArtifactMetadata}]
[INFO] [install:install {execution: default-install}]
[INFO] Installing <https://builds.apache.org/job/myfaces-maven2-plugins/ws/maven2-plugins/myfaces-javacc-plugin/target/myfaces-javacc-plugin-1.0.2-SNAPSHOT.jar>
to /home/jenkins/jenkins-slave/maven-repositories/1/org/apache/myfaces/buildtools/myfaces-javacc-plugin/1.0.2-SNAPSHOT/myfaces-javacc-plugin-1.0.2-SNAPSHOT.jar
[INFO] ------------------------------------------------------------------------
[INFO] Building Apache MyFaces Buildtools Maven2 Javascript Plugin
[INFO]    task-segment: [install]
[INFO] ------------------------------------------------------------------------
[INFO] [antrun:run {execution: javadoc.resources}]
[INFO] Executing tasks
     [copy] Copying 2 files to <https://builds.apache.org/job/myfaces-maven2-plugins/ws/maven2-plugins/myfaces-javascript-plugin/target/apidocs/META-INF>
[INFO] Executed tasks
[WARNING] While downloading javacc:javacc:3.2
  This artifact has been relocated to net.java.dev.javacc:javacc:3.2.


[INFO] [myfaces-javacc:generate {execution: default}]
Java Compiler Compiler Version 3.2 (Parser Generator)
(type "javacc" with no arguments for help)
Reading from file <https://builds.apache.org/job/myfaces-maven2-plugins/ws/maven2-plugins/myfaces-javascript-plugin/src/main/java/org/apache/myfaces/buildtools/maven2/plugin/javascript/obfuscator/javascript15parser/js1.5.jj>
. . .
File "TokenMgrError.java" does not exist.  Will create one.
File "ParseException.java" does not exist.  Will create one.
File "Token.java" does not exist.  Will create one.
File "SimpleCharStream.java" does not exist.  Will create one.
Parser generated successfully.
[INFO] [modello:xpp3-reader {execution: descriptor}]
[INFO] outputDirectory: <https://builds.apache.org/job/myfaces-maven2-plugins/ws/maven2-plugins/myfaces-javascript-plugin/target/generated-sources/modello>
[INFO] Working on model: src/main/mdo/assembler.mdo
[INFO] Generating current version: 1.0.0
[INFO] [modello:java {execution: descriptor}]
[INFO] outputDirectory: <https://builds.apache.org/job/myfaces-maven2-plugins/ws/maven2-plugins/myfaces-javascript-plugin/target/generated-sources/modello>
[INFO] Working on model: src/main/mdo/assembler.mdo
[INFO] Generating current version: 1.0.0
[INFO] [modello:xsd {execution: descriptor}]
[INFO] outputDirectory: <https://builds.apache.org/job/myfaces-maven2-plugins/ws/maven2-plugins/myfaces-javascript-plugin/target/generated-site/xsd>
[INFO] Working on model: src/main/mdo/assembler.mdo
[INFO] Generating current version: 1.0.0
[INFO] [plugin:descriptor {execution: default-descriptor}]
[INFO] Using 'UTF-8' encoding to read mojo metadata.
[INFO] Applying mojo extractor for language: java
[INFO] Mojo extractor for language: java found 9 mojo descriptors.
[INFO] Applying mojo extractor for language: bsh
[INFO] Mojo extractor for language: bsh found 0 mojo descriptors.
[INFO] [remote-resources:process {execution: default}]
[INFO] [resources:resources {execution: default-resources}]
[INFO] Using 'UTF-8' encoding to copy filtered resources.
[INFO] Copying 1 resource
[INFO] Copying 3 resources
[INFO] [compiler:compile {execution: default-compile}]
[INFO] Compiling 226 source files to <https://builds.apache.org/job/myfaces-maven2-plugins/ws/maven2-plugins/myfaces-javascript-plugin/target/classes>
[INFO] -------------------------------------------------------------
[ERROR] COMPILATION ERROR : 
[INFO] -------------------------------------------------------------
[ERROR] error: error reading /home/jenkins/jenkins-slave/maven-repositories/1/junit/junit/3.8.2/junit-3.8.2.jar;
error in opening zip file
[INFO] 1error
[INFO] -------------------------------------------------------------
[INFO] ------------------------------------------------------------------------
[ERROR] BUILD FAILURE
[INFO] ------------------------------------------------------------------------
[INFO] Compilation failure
error: error reading /home/jenkins/jenkins-slave/maven-repositories/1/junit/junit/3.8.2/junit-3.8.2.jar;
error in opening zip file

[INFO] ------------------------------------------------------------------------
[INFO] For more information, run Maven with the -e switch
[INFO] ------------------------------------------------------------------------
[INFO] Total time: 49 seconds
[INFO] Finished at: Sun Apr 06 22:37:47 UTC 2014
[INFO] Final Memory: 111M/437M
[INFO] ------------------------------------------------------------------------
Waiting for Jenkins to finish collecting data
[JENKINS] Archiving <https://builds.apache.org/job/myfaces-maven2-plugins/ws/maven2-plugins/myfaces-faces-plugin/pom.xml>
to org.apache.myfaces.buildtools/myfaces-faces-plugin/1.0.1-SNAPSHOT/myfaces-faces-plugin-1.0.1-SNAPSHOT.pom
[JENKINS] Archiving <https://builds.apache.org/job/myfaces-maven2-plugins/ws/maven2-plugins/myfaces-faces-plugin/target/myfaces-faces-plugin-1.0.1-SNAPSHOT.jar>
to org.apache.myfaces.buildtools/myfaces-faces-plugin/1.0.1-SNAPSHOT/myfaces-faces-plugin-1.0.1-SNAPSHOT.jar
[JENKINS] Archiving /home/jenkins/jenkins-slave/maven-repositories/1/org/apache/myfaces/buildtools/myfaces-plugin-parent/1.0.7-SNAPSHOT/myfaces-plugin-parent-1.0.7-SNAPSHOT.pom
to org.apache.myfaces.buildtools/myfaces-plugin-parent/1.0.7-SNAPSHOT/myfaces-plugin-parent-1.0.7-SNAPSHOT.pom
[JENKINS] Archiving <https://builds.apache.org/job/myfaces-maven2-plugins/ws/maven2-plugins/myfaces-plugin-parent/target/myfaces-plugin-parent-1.0.7-SNAPSHOT-site.xml>
to org.apache.myfaces.buildtools/myfaces-plugin-parent/1.0.7-SNAPSHOT/myfaces-plugin-parent-1.0.7-SNAPSHOT-site.xml
/x1/jenkins/jenkins-slave/maven-repositories/1/org/apache/myfaces/buildtools/myfaces-plugin-parent/1.0.7-SNAPSHOT/myfaces-plugin-parent-1.0.7-SNAPSHOT.pom
is not inside /x1/jenkins/jenkins-slave/workspace/myfaces-maven2-plugins/maven2-plugins/myfaces-plugin-parent/;
will archive in a separate pass
[JENKINS] Archiving <https://builds.apache.org/job/myfaces-maven2-plugins/ws/maven2-plugins/myfaces-javascript-plugin/pom.xml>
to org.apache.myfaces.buildtools/myfaces-javascript-plugin/1.0.3-SNAPSHOT/myfaces-javascript-plugin-1.0.3-SNAPSHOT.pom
[JENKINS] Archiving <https://builds.apache.org/job/myfaces-maven2-plugins/ws/maven2-plugins/myfaces-javacc-plugin/pom.xml>
to org.apache.myfaces.buildtools/myfaces-javacc-plugin/1.0.2-SNAPSHOT/myfaces-javacc-plugin-1.0.2-SNAPSHOT.pom
[JENKINS] Archiving <https://builds.apache.org/job/myfaces-maven2-plugins/ws/maven2-plugins/myfaces-javacc-plugin/target/myfaces-javacc-plugin-1.0.2-SNAPSHOT.jar>
to org.apache.myfaces.buildtools/myfaces-javacc-plugin/1.0.2-SNAPSHOT/myfaces-javacc-plugin-1.0.2-SNAPSHOT.jar
[JENKINS] Archiving <https://builds.apache.org/job/myfaces-maven2-plugins/ws/maven2-plugins/myfaces-i18n-plugin/pom.xml>
to org.apache.myfaces.buildtools/myfaces-i18n-plugin/1.0.1-SNAPSHOT/myfaces-i18n-plugin-1.0.1-SNAPSHOT.pom
[JENKINS] Archiving <https://builds.apache.org/job/myfaces-maven2-plugins/ws/maven2-plugins/myfaces-i18n-plugin/target/myfaces-i18n-plugin-1.0.1-SNAPSHOT.jar>
to org.apache.myfaces.buildtools/myfaces-i18n-plugin/1.0.1-SNAPSHOT/myfaces-i18n-plugin-1.0.1-SNAPSHOT.jar
[JENKINS] Archiving <https://builds.apache.org/job/myfaces-maven2-plugins/ws/maven2-plugins/myfaces-builder-plugin/pom.xml>
to org.apache.myfaces.buildtools/myfaces-builder-plugin/1.0.11-SNAPSHOT/myfaces-builder-plugin-1.0.11-SNAPSHOT.pom
[JENKINS] Archiving <https://builds.apache.org/job/myfaces-maven2-plugins/ws/maven2-plugins/myfaces-builder-plugin/target/myfaces-builder-plugin-1.0.11-SNAPSHOT.jar>
to org.apache.myfaces.buildtools/myfaces-builder-plugin/1.0.11-SNAPSHOT/myfaces-builder-plugin-1.0.11-SNAPSHOT.jar
[JENKINS] Archiving <https://builds.apache.org/job/myfaces-maven2-plugins/ws/maven2-plugins/myfaces-builder-annotations/pom.xml>
to org.apache.myfaces.buildtools/myfaces-builder-annotations/1.0.10-SNAPSHOT/myfaces-builder-annotations-1.0.10-SNAPSHOT.pom
[JENKINS] Archiving <https://builds.apache.org/job/myfaces-maven2-plugins/ws/maven2-plugins/myfaces-builder-annotations/target/myfaces-builder-annotations-1.0.10-SNAPSHOT.jar>
to org.apache.myfaces.buildtools/myfaces-builder-annotations/1.0.10-SNAPSHOT/myfaces-builder-annotations-1.0.10-SNAPSHOT.jar
channel stopped

Mime
View raw message