myfaces-commits mailing list archives

Site index · List index
Message view « Date » · « Thread »
Top « Date » · « Thread »
From Apache Jenkins Server <jenk...@builds.apache.org>
Subject Build failed in Jenkins: myfaces-maven2-plugins #1095
Date Sat, 24 Aug 2013 19:25:35 GMT
See <https://builds.apache.org/job/myfaces-maven2-plugins/1095/>

------------------------------------------
[...truncated 499 lines...]
[INFO] Surefire report directory: <https://builds.apache.org/job/myfaces-maven2-plugins/ws/maven2-plugins/myfaces-jdev-plugin/target/surefire-reports>

-------------------------------------------------------
 T E S T S
-------------------------------------------------------
There are no tests to run.

Results :

Tests run: 0, Failures: 0, Errors: 0, Skipped: 0

[JENKINS] Recording test results
[INFO] [jar:jar {execution: default-jar}]
[INFO] Building jar: <https://builds.apache.org/job/myfaces-maven2-plugins/ws/maven2-plugins/myfaces-jdev-plugin/target/myfaces-jdev-plugin-1.0.1-SNAPSHOT.jar>
[INFO] [plugin:addPluginArtifactMetadata {execution: default-addPluginArtifactMetadata}]
[INFO] [install:install {execution: default-install}]
[INFO] Installing <https://builds.apache.org/job/myfaces-maven2-plugins/ws/maven2-plugins/myfaces-jdev-plugin/target/myfaces-jdev-plugin-1.0.1-SNAPSHOT.jar>
to /home/jenkins/jenkins-slave/maven-repositories/1/org/apache/myfaces/buildtools/myfaces-jdev-plugin/1.0.1-SNAPSHOT/myfaces-jdev-plugin-1.0.1-SNAPSHOT.jar
[JENKINS] Archiving <https://builds.apache.org/job/myfaces-maven2-plugins/ws/maven2-plugins/myfaces-jdev-plugin/pom.xml>
to /home/hudson/hudson/jobs/myfaces-maven2-plugins/modules/org.apache.myfaces.buildtools$myfaces-jdev-plugin/builds/2013-08-24_19-16-31/archive/org.apache.myfaces.buildtools/myfaces-jdev-plugin/1.0.1-SNAPSHOT/myfaces-jdev-plugin-1.0.1-SNAPSHOT.pom
[JENKINS] Archiving <https://builds.apache.org/job/myfaces-maven2-plugins/ws/maven2-plugins/myfaces-jdev-plugin/target/myfaces-jdev-plugin-1.0.1-SNAPSHOT.jar>
to /home/hudson/hudson/jobs/myfaces-maven2-plugins/modules/org.apache.myfaces.buildtools$myfaces-jdev-plugin/builds/2013-08-24_19-16-31/archive/org.apache.myfaces.buildtools/myfaces-jdev-plugin/1.0.1-SNAPSHOT/myfaces-jdev-plugin-1.0.1-SNAPSHOT.jar
[INFO] ------------------------------------------------------------------------
[INFO] Building Apache MyFaces Buildtools Maven2 Tag Documentation Report
[INFO]    task-segment: [install]
[INFO] ------------------------------------------------------------------------
[INFO] snapshot org.apache.myfaces.buildtools:myfaces-faces-plugin:1.0.1-SNAPSHOT: checking
for updates from apache.snapshots
[INFO] [antrun:run {execution: javadoc.resources}]
[INFO] Executing tasks
[INFO] Executed tasks
[INFO] [plugin:descriptor {execution: default-descriptor}]
[INFO] Using 'UTF-8' encoding to read mojo metadata.
[INFO] Applying mojo extractor for language: java
[INFO] Mojo extractor for language: java found 1 mojo descriptors.
[INFO] Applying mojo extractor for language: bsh
[INFO] Mojo extractor for language: bsh found 0 mojo descriptors.
[INFO] [remote-resources:process {execution: default}]
[INFO] [resources:resources {execution: default-resources}]
[INFO] Using 'UTF-8' encoding to copy filtered resources.
[INFO] Copying 0 resource
[INFO] Copying 3 resources
[INFO] [compiler:compile {execution: default-compile}]
[INFO] Nothing to compile - all classes are up to date
[INFO] [resources:testResources {execution: default-testResources}]
[INFO] Using 'UTF-8' encoding to copy filtered resources.
[INFO] skip non existing resourceDirectory <https://builds.apache.org/job/myfaces-maven2-plugins/ws/maven2-plugins/myfaces-tagdoc-plugin/src/test/resources>
[INFO] Copying 3 resources
[INFO] [compiler:testCompile {execution: default-testCompile}]
[INFO] No sources to compile
[INFO] [surefire:test {execution: default-test}]
[INFO] Surefire report directory: <https://builds.apache.org/job/myfaces-maven2-plugins/ws/maven2-plugins/myfaces-tagdoc-plugin/target/surefire-reports>

-------------------------------------------------------
 T E S T S
-------------------------------------------------------
There are no tests to run.

Results :

Tests run: 0, Failures: 0, Errors: 0, Skipped: 0

[JENKINS] Recording test results
[INFO] [jar:jar {execution: default-jar}]
[INFO] Building jar: <https://builds.apache.org/job/myfaces-maven2-plugins/ws/maven2-plugins/myfaces-tagdoc-plugin/target/myfaces-tagdoc-plugin-1.0.1-SNAPSHOT.jar>
[INFO] [plugin:addPluginArtifactMetadata {execution: default-addPluginArtifactMetadata}]
[INFO] [install:install {execution: default-install}]
[INFO] Installing <https://builds.apache.org/job/myfaces-maven2-plugins/ws/maven2-plugins/myfaces-tagdoc-plugin/target/myfaces-tagdoc-plugin-1.0.1-SNAPSHOT.jar>
to /home/jenkins/jenkins-slave/maven-repositories/1/org/apache/myfaces/buildtools/myfaces-tagdoc-plugin/1.0.1-SNAPSHOT/myfaces-tagdoc-plugin-1.0.1-SNAPSHOT.jar
[JENKINS] Archiving <https://builds.apache.org/job/myfaces-maven2-plugins/ws/maven2-plugins/myfaces-tagdoc-plugin/pom.xml>
to /home/hudson/hudson/jobs/myfaces-maven2-plugins/modules/org.apache.myfaces.buildtools$myfaces-tagdoc-plugin/builds/2013-08-24_19-16-31/archive/org.apache.myfaces.buildtools/myfaces-tagdoc-plugin/1.0.1-SNAPSHOT/myfaces-tagdoc-plugin-1.0.1-SNAPSHOT.pom
[JENKINS] Archiving <https://builds.apache.org/job/myfaces-maven2-plugins/ws/maven2-plugins/myfaces-tagdoc-plugin/target/myfaces-tagdoc-plugin-1.0.1-SNAPSHOT.jar>
to /home/hudson/hudson/jobs/myfaces-maven2-plugins/modules/org.apache.myfaces.buildtools$myfaces-tagdoc-plugin/builds/2013-08-24_19-16-31/archive/org.apache.myfaces.buildtools/myfaces-tagdoc-plugin/1.0.1-SNAPSHOT/myfaces-tagdoc-plugin-1.0.1-SNAPSHOT.jar
[INFO] ------------------------------------------------------------------------
[INFO] Building Apache MyFaces Buildtools Maven2 Wagon Plugin
[INFO]    task-segment: [install]
[INFO] ------------------------------------------------------------------------
[INFO] [antrun:run {execution: javadoc.resources}]
[INFO] Executing tasks
[INFO] Executed tasks
[INFO] [plugin:descriptor {execution: default-descriptor}]
[INFO] Using 'UTF-8' encoding to read mojo metadata.
[INFO] Applying mojo extractor for language: java
[INFO] Mojo extractor for language: java found 1 mojo descriptors.
[INFO] Applying mojo extractor for language: bsh
[INFO] Mojo extractor for language: bsh found 0 mojo descriptors.
[INFO] [remote-resources:process {execution: default}]
[INFO] [resources:resources {execution: default-resources}]
[INFO] Using 'UTF-8' encoding to copy filtered resources.
[INFO] Copying 2 resources
[INFO] Copying 3 resources
[INFO] [compiler:compile {execution: default-compile}]
[INFO] Nothing to compile - all classes are up to date
[INFO] [resources:testResources {execution: default-testResources}]
[INFO] Using 'UTF-8' encoding to copy filtered resources.
[INFO] skip non existing resourceDirectory <https://builds.apache.org/job/myfaces-maven2-plugins/ws/maven2-plugins/myfaces-wagon-plugin/src/test/resources>
[INFO] Copying 3 resources
[INFO] [compiler:testCompile {execution: default-testCompile}]
[INFO] No sources to compile
[INFO] [surefire:test {execution: default-test}]
[INFO] Surefire report directory: <https://builds.apache.org/job/myfaces-maven2-plugins/ws/maven2-plugins/myfaces-wagon-plugin/target/surefire-reports>

-------------------------------------------------------
 T E S T S
-------------------------------------------------------
There are no tests to run.

Results :

Tests run: 0, Failures: 0, Errors: 0, Skipped: 0

[JENKINS] Recording test results
[INFO] [jar:jar {execution: default-jar}]
[INFO] Building jar: <https://builds.apache.org/job/myfaces-maven2-plugins/ws/maven2-plugins/myfaces-wagon-plugin/target/myfaces-wagon-plugin-1.0.1-SNAPSHOT.jar>
[INFO] [plugin:addPluginArtifactMetadata {execution: default-addPluginArtifactMetadata}]
[INFO] [install:install {execution: default-install}]
[INFO] Installing <https://builds.apache.org/job/myfaces-maven2-plugins/ws/maven2-plugins/myfaces-wagon-plugin/target/myfaces-wagon-plugin-1.0.1-SNAPSHOT.jar>
to /home/jenkins/jenkins-slave/maven-repositories/1/org/apache/myfaces/buildtools/myfaces-wagon-plugin/1.0.1-SNAPSHOT/myfaces-wagon-plugin-1.0.1-SNAPSHOT.jar
[JENKINS] Archiving <https://builds.apache.org/job/myfaces-maven2-plugins/ws/maven2-plugins/myfaces-wagon-plugin/pom.xml>
to /home/hudson/hudson/jobs/myfaces-maven2-plugins/modules/org.apache.myfaces.buildtools$myfaces-wagon-plugin/builds/2013-08-24_19-16-31/archive/org.apache.myfaces.buildtools/myfaces-wagon-plugin/1.0.1-SNAPSHOT/myfaces-wagon-plugin-1.0.1-SNAPSHOT.pom
[JENKINS] Archiving <https://builds.apache.org/job/myfaces-maven2-plugins/ws/maven2-plugins/myfaces-wagon-plugin/target/myfaces-wagon-plugin-1.0.1-SNAPSHOT.jar>
to /home/hudson/hudson/jobs/myfaces-maven2-plugins/modules/org.apache.myfaces.buildtools$myfaces-wagon-plugin/builds/2013-08-24_19-16-31/archive/org.apache.myfaces.buildtools/myfaces-wagon-plugin/1.0.1-SNAPSHOT/myfaces-wagon-plugin-1.0.1-SNAPSHOT.jar
[INFO] ------------------------------------------------------------------------
[INFO] Building Apache MyFaces Buildtools Maven2 XRTS Plugin
[INFO]    task-segment: [install]
[INFO] ------------------------------------------------------------------------
[INFO] [antrun:run {execution: javadoc.resources}]
[INFO] Executing tasks
[INFO] Executed tasks
[INFO] [plugin:descriptor {execution: default-descriptor}]
[INFO] Using 2 extractors.
[INFO] Applying extractor for language: java
[INFO] Extractor for language: java found 2 mojo descriptors.
[INFO] Applying extractor for language: bsh
[INFO] Extractor for language: bsh found 0 mojo descriptors.
[INFO] [remote-resources:process {execution: default}]
[INFO] [resources:resources {execution: default-resources}]
[INFO] Using 'UTF-8' encoding to copy filtered resources.
[INFO] Copying 0 resource
[INFO] Copying 3 resources
[INFO] [compiler:compile {execution: default-compile}]
[INFO] Nothing to compile - all classes are up to date
[INFO] [resources:testResources {execution: default-testResources}]
[INFO] Using 'UTF-8' encoding to copy filtered resources.
[INFO] skip non existing resourceDirectory <https://builds.apache.org/job/myfaces-maven2-plugins/ws/maven2-plugins/myfaces-xrts-plugin/src/test/resources>
[INFO] Copying 3 resources
[INFO] [compiler:testCompile {execution: default-testCompile}]
[INFO] No sources to compile
[INFO] [surefire:test {execution: default-test}]
[INFO] Surefire report directory: <https://builds.apache.org/job/myfaces-maven2-plugins/ws/maven2-plugins/myfaces-xrts-plugin/target/surefire-reports>

-------------------------------------------------------
 T E S T S
-------------------------------------------------------
There are no tests to run.

Results :

Tests run: 0, Failures: 0, Errors: 0, Skipped: 0

[JENKINS] Recording test results
[INFO] [jar:jar {execution: default-jar}]
[INFO] Building jar: <https://builds.apache.org/job/myfaces-maven2-plugins/ws/maven2-plugins/myfaces-xrts-plugin/target/myfaces-xrts-plugin-1.0.1-SNAPSHOT.jar>
[INFO] [plugin:addPluginArtifactMetadata {execution: default-addPluginArtifactMetadata}]
[INFO] [install:install {execution: default-install}]
[INFO] Installing <https://builds.apache.org/job/myfaces-maven2-plugins/ws/maven2-plugins/myfaces-xrts-plugin/target/myfaces-xrts-plugin-1.0.1-SNAPSHOT.jar>
to /home/jenkins/jenkins-slave/maven-repositories/1/org/apache/myfaces/buildtools/myfaces-xrts-plugin/1.0.1-SNAPSHOT/myfaces-xrts-plugin-1.0.1-SNAPSHOT.jar
[JENKINS] Archiving <https://builds.apache.org/job/myfaces-maven2-plugins/ws/maven2-plugins/myfaces-xrts-plugin/pom.xml>
to /home/hudson/hudson/jobs/myfaces-maven2-plugins/modules/org.apache.myfaces.buildtools$myfaces-xrts-plugin/builds/2013-08-24_19-16-31/archive/org.apache.myfaces.buildtools/myfaces-xrts-plugin/1.0.1-SNAPSHOT/myfaces-xrts-plugin-1.0.1-SNAPSHOT.pom
[JENKINS] Archiving <https://builds.apache.org/job/myfaces-maven2-plugins/ws/maven2-plugins/myfaces-xrts-plugin/target/myfaces-xrts-plugin-1.0.1-SNAPSHOT.jar>
to /home/hudson/hudson/jobs/myfaces-maven2-plugins/modules/org.apache.myfaces.buildtools$myfaces-xrts-plugin/builds/2013-08-24_19-16-31/archive/org.apache.myfaces.buildtools/myfaces-xrts-plugin/1.0.1-SNAPSHOT/myfaces-xrts-plugin-1.0.1-SNAPSHOT.jar
[INFO] ------------------------------------------------------------------------
[INFO] Building Apache MyFaces Buildtools Maven2 Plugin Module
[INFO]    task-segment: [install]
[INFO] ------------------------------------------------------------------------
[INFO] [remote-resources:process {execution: default}]
[INFO] [site:attach-descriptor {execution: default-attach-descriptor}]
[INFO] [install:install {execution: default-install}]
[INFO] Installing <https://builds.apache.org/job/myfaces-maven2-plugins/ws/maven2-plugins/pom.xml>
to /home/jenkins/jenkins-slave/maven-repositories/1/org/apache/myfaces/buildtools/myfaces-plugin-module/1-SNAPSHOT/myfaces-plugin-module-1-SNAPSHOT.pom
[JENKINS] Archiving <https://builds.apache.org/job/myfaces-maven2-plugins/ws/maven2-plugins/pom.xml>
to /home/hudson/hudson/jobs/myfaces-maven2-plugins/modules/org.apache.myfaces.buildtools$myfaces-plugin-module/builds/2013-08-24_19-16-30/archive/org.apache.myfaces.buildtools/myfaces-plugin-module/1-SNAPSHOT/myfaces-plugin-module-1-SNAPSHOT.pom
[INFO] 
[INFO] 
[INFO] ------------------------------------------------------------------------
[INFO] Reactor Summary:
[INFO] ------------------------------------------------------------------------
[INFO] Apache MyFaces Buildtools Maven2 Plugin Parent ........ SUCCESS [27.271s]
[INFO] Apache MyFaces Buildtools Maven2 Builder Annotations .. SUCCESS [16.871s]
[INFO] Apache MyFaces Buildtools Maven2 Builder Plugin ....... SUCCESS [19.180s]
[INFO] Apache MyFaces Buildtools Maven2 Faces Plugin ......... SUCCESS [27.190s]
[INFO] Apache MyFaces Buildtools Maven2 i18n Plugin .......... SUCCESS [22.070s]
[INFO] Apache MyFaces Buildtools Maven2 Javacc Plugin ........ SUCCESS [18.188s]
[INFO] Apache MyFaces Buildtools Maven2 Javascript Plugin .... SUCCESS [26.106s]
[INFO] Apache MyFaces Buildtools Maven2 Javascript Documentation Plugin  SUCCESS [19.415s]
[INFO] Apache MyFaces Buildtools Maven2 JDev Plugin .......... SUCCESS [16.371s]
[INFO] Apache MyFaces Buildtools Maven2 Tag Documentation Report  SUCCESS [16.838s]
[INFO] Apache MyFaces Buildtools Maven2 Wagon Plugin ......... SUCCESS [11.652s]
[INFO] Apache MyFaces Buildtools Maven2 XRTS Plugin .......... SUCCESS [19.008s]
[INFO] Apache MyFaces Buildtools Maven2 Plugin Module ........ SUCCESS [11.654s]
[INFO] ------------------------------------------------------------------------
[INFO] ------------------------------------------------------------------------
[INFO] BUILD SUCCESSFUL
[INFO] ------------------------------------------------------------------------
[INFO] Total time: 5 minutes 52 seconds
[INFO] Finished at: Sat Aug 24 19:22:49 UTC 2013
[INFO] Final Memory: 92M/431M
[INFO] ------------------------------------------------------------------------
Waiting for Jenkins to finish collecting data
channel stopped
Maven RedeployPublisher use remote ubuntu5 maven settings from : /home/jenkins/.m2/settings.xml
[INFO] Deployment in https://repository.apache.org/content/repositories/snapshots (id=apache.snapshots.https,uniqueVersion=false)
Deploying the main artifact myfaces-builder-annotations-1.0.10-SNAPSHOT.jar
[INFO] Deployment in https://repository.apache.org/content/repositories/snapshots (id=apache.snapshots.https,uniqueVersion=false)
Deploying the main artifact myfaces-builder-plugin-1.0.11-SNAPSHOT.jar
[INFO] Deployment in https://repository.apache.org/content/repositories/snapshots (id=apache.snapshots.https,uniqueVersion=false)
Deploying the main artifact myfaces-faces-plugin-1.0.1-SNAPSHOT.jar
[INFO] Deployment in https://repository.apache.org/content/repositories/snapshots (id=apache.snapshots.https,uniqueVersion=false)
Deploying the main artifact myfaces-i18n-plugin-1.0.1-SNAPSHOT.jar
ERROR: Error installing artifact's metadata: Error while deploying metadata: The target server
failed to respond
org.apache.maven.artifact.deployer.ArtifactDeploymentException: Error installing artifact's
metadata: Error while deploying metadata: The target server failed to respond
	at hudson.maven.artifact.deployer.DefaultArtifactDeployer.deploy(DefaultArtifactDeployer.java:183)
	at hudson.maven.reporters.MavenArtifactRecord.deploy(MavenArtifactRecord.java:190)
	at hudson.maven.RedeployPublisher.perform(RedeployPublisher.java:176)
	at hudson.tasks.BuildStepMonitor$1.perform(BuildStepMonitor.java:20)
	at hudson.model.AbstractBuild$AbstractBuildExecution.perform(AbstractBuild.java:782)
	at hudson.model.AbstractBuild$AbstractBuildExecution.performAllBuildSteps(AbstractBuild.java:754)
	at hudson.maven.MavenModuleSetBuild$MavenModuleSetBuildExecution.post2(MavenModuleSetBuild.java:1007)
	at hudson.model.AbstractBuild$AbstractBuildExecution.post(AbstractBuild.java:707)
	at hudson.model.Run.execute(Run.java:1628)
	at hudson.maven.MavenModuleSetBuild.run(MavenModuleSetBuild.java:506)
	at hudson.model.ResourceController.execute(ResourceController.java:88)
	at hudson.model.Executor.run(Executor.java:247)
Caused by: org.apache.maven.artifact.repository.metadata.RepositoryMetadataDeploymentException:
Error while deploying metadata: The target server failed to respond
	at org.apache.maven.artifact.repository.metadata.DefaultRepositoryMetadataManager.deploy(DefaultRepositoryMetadataManager.java:492)
	at hudson.maven.artifact.deployer.DefaultArtifactDeployer.deploy(DefaultArtifactDeployer.java:167)
	... 11 more
Caused by: org.apache.maven.wagon.TransferFailedException: The target server failed to respond
	at org.apache.maven.wagon.shared.http4.AbstractHttpClientWagon.put(AbstractHttpClientWagon.java:580)
	at org.apache.maven.wagon.shared.http4.AbstractHttpClientWagon.put(AbstractHttpClientWagon.java:524)
	at org.apache.maven.wagon.shared.http4.AbstractHttpClientWagon.put(AbstractHttpClientWagon.java:505)
	at org.apache.maven.wagon.shared.http4.AbstractHttpClientWagon.put(AbstractHttpClientWagon.java:485)
	at org.apache.maven.repository.legacy.DefaultWagonManager.putRemoteFile(DefaultWagonManager.java:543)
	at org.apache.maven.repository.legacy.DefaultWagonManager.putArtifactMetadata(DefaultWagonManager.java:501)
	at org.apache.maven.artifact.repository.metadata.DefaultRepositoryMetadataManager.deploy(DefaultRepositoryMetadataManager.java:488)
	... 12 more
Caused by: org.apache.http.NoHttpResponseException: The target server failed to respond
	at org.apache.http.impl.conn.DefaultHttpResponseParser.parseHead(DefaultHttpResponseParser.java:95)
	at org.apache.http.impl.conn.DefaultHttpResponseParser.parseHead(DefaultHttpResponseParser.java:62)
	at org.apache.http.impl.io.AbstractMessageParser.parse(AbstractMessageParser.java:254)
	at org.apache.http.impl.AbstractHttpClientConnection.receiveResponseHeader(AbstractHttpClientConnection.java:289)
	at org.apache.http.impl.conn.DefaultClientConnection.receiveResponseHeader(DefaultClientConnection.java:252)
	at org.apache.http.impl.conn.ManagedClientConnectionImpl.receiveResponseHeader(ManagedClientConnectionImpl.java:191)
	at org.apache.http.protocol.HttpRequestExecutor.doReceiveResponse(HttpRequestExecutor.java:300)
	at org.apache.http.protocol.HttpRequestExecutor.execute(HttpRequestExecutor.java:127)
	at org.apache.http.impl.client.DefaultRequestDirector.tryExecute(DefaultRequestDirector.java:715)
	at org.apache.http.impl.client.DefaultRequestDirector.execute(DefaultRequestDirector.java:520)
	at org.apache.http.impl.client.AbstractHttpClient.execute(AbstractHttpClient.java:906)
	at org.apache.http.impl.client.AbstractHttpClient.execute(AbstractHttpClient.java:805)
	at org.apache.maven.wagon.shared.http4.AbstractHttpClientWagon.execute(AbstractHttpClientWagon.java:746)
	at org.apache.maven.wagon.shared.http4.AbstractHttpClientWagon.put(AbstractHttpClientWagon.java:574)
	... 18 more
[INFO] Deployment failed after 1 min 47 sec
Build step 'Deploy artifacts to Maven repository' changed build result to FAILURE

Mime
View raw message