myfaces-commits mailing list archives

Site index · List index
Message view « Date » · « Thread »
Top « Date » · « Thread »
From Apache Jenkins Server <jenk...@builds.apache.org>
Subject Build failed in Jenkins: myfaces-current-2.0-integration-tests #1531
Date Sat, 24 Aug 2013 22:16:48 GMT
See <https://builds.apache.org/job/myfaces-current-2.0-integration-tests/1531/>

------------------------------------------
Started by upstream project "myfaces-current-2.0" build number 2113
originally caused by:
 Started by upstream project "maven-plugins" build number 1685
 originally caused by:
  Started by an SCM change
Building remotely on solaris1 in workspace <https://builds.apache.org/job/myfaces-current-2.0-integration-tests/ws/>
Updating https://svn.apache.org/repos/asf/myfaces/core/branches/2.0.x/integration-tests at
revision '2013-08-24T22:04:50.113 +0000'
At revision 1517205
no change for https://svn.apache.org/repos/asf/myfaces/core/branches/2.0.x/integration-tests
since the previous build
Parsing POMs
ERROR: Failed to parse POMs
hudson.util.IOException2: remote file operation failed: <https://builds.apache.org/job/myfaces-current-2.0-integration-tests/ws/>
at hudson.remoting.Channel@58ef119:solaris1
	at hudson.FilePath.act(FilePath.java:905)
	at hudson.FilePath.act(FilePath.java:882)
	at hudson.maven.MavenModuleSetBuild$MavenModuleSetBuildExecution.parsePoms(MavenModuleSetBuild.java:920)
	at hudson.maven.MavenModuleSetBuild$MavenModuleSetBuildExecution.doRun(MavenModuleSetBuild.java:652)
	at hudson.model.AbstractBuild$AbstractBuildExecution.run(AbstractBuild.java:567)
	at hudson.model.Run.execute(Run.java:1603)
	at hudson.maven.MavenModuleSetBuild.run(MavenModuleSetBuild.java:506)
	at hudson.model.ResourceController.execute(ResourceController.java:88)
	at hudson.model.Executor.run(Executor.java:247)
Caused by: hudson.remoting.ProxyException: hudson.maven.MavenModuleSetBuild$MavenExecutionException:
org.apache.maven.project.ProjectBuildingException: Some problems were encountered while processing
the POMs:
[FATAL] Non-resolvable parent POM: Could not find artifact org.apache.myfaces.core:myfaces-core-project:pom:2.0.15-SNAPSHOT
and 'parent.relativePath' points at wrong local POM @ line 20, column 13

	at hudson.maven.MavenModuleSetBuild$PomParser.invoke(MavenModuleSetBuild.java:1323)
	at hudson.maven.MavenModuleSetBuild$PomParser.invoke(MavenModuleSetBuild.java:1058)
	at hudson.FilePath$FileCallableWrapper.call(FilePath.java:2417)
	at hudson.remoting.UserRequest.perform(UserRequest.java:118)
	at hudson.remoting.UserRequest.perform(UserRequest.java:48)
	at hudson.remoting.Request$2.run(Request.java:326)
	at hudson.remoting.InterceptingExecutorService$1.call(InterceptingExecutorService.java:72)
	at java.util.concurrent.FutureTask$Sync.innerRun(FutureTask.java:303)
	at java.util.concurrent.FutureTask.run(FutureTask.java:138)
	at java.util.concurrent.ThreadPoolExecutor$Worker.runTask(ThreadPoolExecutor.java:886)
	at java.util.concurrent.ThreadPoolExecutor$Worker.run(ThreadPoolExecutor.java:908)
	at java.lang.Thread.run(Thread.java:662)
Caused by: hudson.remoting.ProxyException: org.apache.maven.project.ProjectBuildingException:
Some problems were encountered while processing the POMs:
[FATAL] Non-resolvable parent POM: Could not find artifact org.apache.myfaces.core:myfaces-core-project:pom:2.0.15-SNAPSHOT
and 'parent.relativePath' points at wrong local POM @ line 20, column 13

	at org.apache.maven.project.DefaultProjectBuilder.build(DefaultProjectBuilder.java:364)
	at hudson.maven.MavenEmbedder.buildProjects(MavenEmbedder.java:361)
	at hudson.maven.MavenEmbedder.readProjects(MavenEmbedder.java:331)
	at hudson.maven.MavenModuleSetBuild$PomParser.invoke(MavenModuleSetBuild.java:1260)
	... 11 more

Mime
View raw message