myfaces-commits mailing list archives

Site index · List index
Message view « Date » · « Thread »
Top « Date » · « Thread »
From Apache Jenkins Server <jenk...@builds.apache.org>
Subject Build failed in Jenkins: tobago-1.0.x-deploy #648
Date Mon, 01 Jul 2013 03:33:37 GMT
See <https://builds.apache.org/job/tobago-1.0.x-deploy/648/>

------------------------------------------
[...truncated 3459 lines...]
Jul 1, 2013 3:29:48 AM org.apache.myfaces.tobago.taglib.component.TabTag setAccessKey
SEVERE: Attribute 'accessKey' doesn't work any longer and will removed soon! Please use special
syntax of 'label' instead.
Jul 1, 2013 3:29:48 AM org.apache.myfaces.tobago.taglib.component.TobagoTag setHeight
WARNING: Attribute 'height' is deprecated, and will removed soon! Please use a layout manager
instead.
Jul 1, 2013 3:29:48 AM org.apache.myfaces.tobago.taglib.component.TabTag setLabelWithAccessKey
WARNING: Attribute 'labelWithAccessKey' is deprecated, and will removed soon! Please use 'label'
instead.
Jul 1, 2013 3:29:48 AM org.apache.myfaces.tobago.taglib.component.TobagoTag setWidth
WARNING: Attribute 'width' is deprecated, and will removed soon! Please use a layout manager
instead.
Jul 1, 2013 3:29:48 AM org.apache.myfaces.tobago.taglib.component.InputTag setAccessKey
SEVERE: Attribute 'accessKey' doesn't work any longer and will removed soon! Please use special
syntax of 'label' instead.
Jul 1, 2013 3:29:48 AM org.apache.myfaces.tobago.taglib.component.TobagoTag setHeight
WARNING: Attribute 'height' is deprecated, and will removed soon! Please use a layout manager
instead.
Jul 1, 2013 3:29:48 AM org.apache.myfaces.tobago.taglib.component.InputTag setLabelWithAccessKey
WARNING: Attribute 'labelWithAccessKey' is deprecated, and will removed soon! Please use 'label'
instead.
Jul 1, 2013 3:29:48 AM org.apache.myfaces.tobago.taglib.component.TobagoTag setWidth
WARNING: Attribute 'width' is deprecated, and will removed soon! Please use a layout manager
instead.
Jul 1, 2013 3:29:48 AM org.apache.myfaces.tobago.taglib.component.InputTag setAccessKey
SEVERE: Attribute 'accessKey' doesn't work any longer and will removed soon! Please use special
syntax of 'label' instead.
Jul 1, 2013 3:29:48 AM org.apache.myfaces.tobago.taglib.component.TobagoTag setHeight
WARNING: Attribute 'height' is deprecated, and will removed soon! Please use a layout manager
instead.
Jul 1, 2013 3:29:48 AM org.apache.myfaces.tobago.taglib.component.InputTag setLabelWithAccessKey
WARNING: Attribute 'labelWithAccessKey' is deprecated, and will removed soon! Please use 'label'
instead.
Jul 1, 2013 3:29:48 AM org.apache.myfaces.tobago.taglib.component.TobagoTag setWidth
WARNING: Attribute 'width' is deprecated, and will removed soon! Please use a layout manager
instead.
Jul 1, 2013 3:29:48 AM org.apache.myfaces.tobago.taglib.component.ToolBarCommandTag setAccessKey
SEVERE: Attribute 'accessKey' doesn't work any longer and will removed soon! Please use special
syntax of 'label' instead.
Jul 1, 2013 3:29:48 AM org.apache.myfaces.tobago.taglib.component.TobagoTag setHeight
WARNING: Attribute 'height' is deprecated, and will removed soon! Please use a layout manager
instead.
Jul 1, 2013 3:29:48 AM org.apache.myfaces.tobago.taglib.component.ToolBarCommandTag setLabelWithAccessKey
WARNING: Attribute 'labelWithAccessKey' is deprecated, and will removed soon! Please use 'label'
instead.
Jul 1, 2013 3:29:48 AM org.apache.myfaces.tobago.taglib.component.TobagoTag setWidth
WARNING: Attribute 'width' is deprecated, and will removed soon! Please use a layout manager
instead.
Jul 1, 2013 3:29:48 AM org.apache.myfaces.tobago.taglib.component.SelectBooleanCommandTag
setAccessKey
SEVERE: Attribute 'accessKey' doesn't work any longer and will removed soon! Please use special
syntax of 'label' instead.
Jul 1, 2013 3:29:48 AM org.apache.myfaces.tobago.taglib.component.TobagoTag setHeight
WARNING: Attribute 'height' is deprecated, and will removed soon! Please use a layout manager
instead.
Jul 1, 2013 3:29:48 AM org.apache.myfaces.tobago.taglib.component.SelectBooleanCommandTag
setLabelWithAccessKey
WARNING: Attribute 'labelWithAccessKey' is deprecated, and will removed soon! Please use 'label'
instead.
Jul 1, 2013 3:29:48 AM org.apache.myfaces.tobago.taglib.component.TobagoTag setWidth
WARNING: Attribute 'width' is deprecated, and will removed soon! Please use a layout manager
instead.
Jul 1, 2013 3:29:48 AM org.apache.myfaces.tobago.taglib.component.TobagoTag setHeight
WARNING: Attribute 'height' is deprecated, and will removed soon! Please use a layout manager
instead.
Jul 1, 2013 3:29:48 AM org.apache.myfaces.tobago.taglib.component.TobagoTag setWidth
WARNING: Attribute 'width' is deprecated, and will removed soon! Please use a layout manager
instead.
Jul 1, 2013 3:29:48 AM org.apache.myfaces.tobago.taglib.component.TobagoTag setHeight
WARNING: Attribute 'height' is deprecated, and will removed soon! Please use a layout manager
instead.
Jul 1, 2013 3:29:48 AM org.apache.myfaces.tobago.taglib.component.TobagoTag setWidth
WARNING: Attribute 'width' is deprecated, and will removed soon! Please use a layout manager
instead.
Jul 1, 2013 3:29:48 AM org.apache.myfaces.tobago.taglib.component.TobagoTag setHeight
WARNING: Attribute 'height' is deprecated, and will removed soon! Please use a layout manager
instead.
Jul 1, 2013 3:29:48 AM org.apache.myfaces.tobago.taglib.component.TobagoTag setWidth
WARNING: Attribute 'width' is deprecated, and will removed soon! Please use a layout manager
instead.
Jul 1, 2013 3:29:48 AM org.apache.myfaces.tobago.taglib.component.TobagoTag setHeight
WARNING: Attribute 'height' is deprecated, and will removed soon! Please use a layout manager
instead.
Jul 1, 2013 3:29:48 AM org.apache.myfaces.tobago.taglib.component.TobagoTag setWidth
WARNING: Attribute 'width' is deprecated, and will removed soon! Please use a layout manager
instead.
Tests run: 2, Failures: 0, Errors: 0, Skipped: 0, Time elapsed: 0.171 sec
Running org.apache.myfaces.tobago.component.UITreeUnitTest
Tests run: 1, Failures: 0, Errors: 0, Skipped: 0, Time elapsed: 0.019 sec
Running org.apache.myfaces.tobago.webapp.TobagoMultipartFormdataRequestUnitTest
Tests run: 5, Failures: 0, Errors: 0, Skipped: 0, Time elapsed: 0.005 sec
Running org.apache.myfaces.tobago.component.LayoutTokensUnitTest
Tests run: 3, Failures: 0, Errors: 0, Skipped: 0, Time elapsed: 0.003 sec
Running org.apache.myfaces.tobago.convert.DurationConverterUnitTest
Tests run: 2, Failures: 0, Errors: 0, Skipped: 0, Time elapsed: 0.01 sec
Running org.apache.myfaces.tobago.util.HtmlWriterUtilUnitTest
Tests run: 1, Failures: 0, Errors: 0, Skipped: 0, Time elapsed: 0.003 sec
Running org.apache.myfaces.tobago.component.UIDataUnitTest
Tests run: 2, Failures: 0, Errors: 0, Skipped: 0, Time elapsed: 0.01 sec

Results :

Tests run: 61, Failures: 0, Errors: 0, Skipped: 0

[JENKINS] Recording test results
[INFO] [jar:jar {execution: default-jar}]
[INFO] Building jar: <https://builds.apache.org/job/tobago-1.0.x-deploy/ws/tobago-1.0.x-deploy/core/target/tobago-core-1.0.41-SNAPSHOT.jar>
[INFO] [assembly:single {execution: source-release-assembly}]
[INFO] Skipping the assembly in this project because it's not the Execution Root
[INFO] [jar:test-jar {execution: default}]
[INFO] Building jar: <https://builds.apache.org/job/tobago-1.0.x-deploy/ws/tobago-1.0.x-deploy/core/target/tobago-core-1.0.41-SNAPSHOT-tests.jar>
[INFO] Preparing javadoc:jar
[WARNING] Removing: jar from forked lifecycle, to prevent recursive invocation.
[JENKINS] Archiving <https://builds.apache.org/job/tobago-1.0.x-deploy/ws/tobago-1.0.x-deploy/core/target/tobago-core-1.0.41-SNAPSHOT.jar>
to /home/hudson/hudson/jobs/tobago-1.0.x-deploy/modules/org.apache.myfaces.tobago$tobago-core/builds/2013-07-01_03-27-06/archive/org.apache.myfaces.tobago/tobago-core/1.0.41-SNAPSHOT/tobago-core-1.0.41-SNAPSHOT.jar
[JENKINS] Archiving <https://builds.apache.org/job/tobago-1.0.x-deploy/ws/tobago-1.0.x-deploy/core/target/tobago-core-1.0.41-SNAPSHOT-sources.jar>
to /home/hudson/hudson/jobs/tobago-1.0.x-deploy/modules/org.apache.myfaces.tobago$tobago-core/builds/2013-07-01_03-27-06/archive/org.apache.myfaces.tobago/tobago-core/1.0.41-SNAPSHOT/tobago-core-1.0.41-SNAPSHOT-sources.jar
[JENKINS] Archiving <https://builds.apache.org/job/tobago-1.0.x-deploy/ws/tobago-1.0.x-deploy/core/target/tobago-core-1.0.41-SNAPSHOT-tests.jar>
to /home/hudson/hudson/jobs/tobago-1.0.x-deploy/modules/org.apache.myfaces.tobago$tobago-core/builds/2013-07-01_03-27-06/archive/org.apache.myfaces.tobago/tobago-core/1.0.41-SNAPSHOT/tobago-core-1.0.41-SNAPSHOT-tests.jar
[INFO] [buildnumber:create {execution: default}]
[INFO] [javadoc:jar {execution: attach-javadoc}]
7 warnings
[INFO] Javadoc Warnings
[WARNING] javadoc: warning - Error fetching URL: http://download-llnw.oracle.com/javase/1.5.0/docs/api/package-list
[WARNING] javadoc: warning - Error fetching URL: http://jakarta.apache.org/commons/collections/api-3.1/package-list
[WARNING] javadoc: warning - Error fetching URL: http://jakarta.apache.org/commons/lang/api-2.1/package-list
[WARNING] javadoc: warning - Error fetching URL: http://jakarta.apache.org/commons/io/api-1.1/package-list
[WARNING] javadoc: warning - Error fetching URL: http://jakarta.apache.org/commons/logging/commons-logging-1.1.1/apidocs/package-list
[WARNING] javadoc: warning - Error fetching URL: http://www.junit.org/junit/javadoc/package-list
[WARNING] javadoc: warning - Error fetching URL: http://logging.apache.org/log4j/docs/api/package-list
[INFO] Building jar: <https://builds.apache.org/job/tobago-1.0.x-deploy/ws/tobago-1.0.x-deploy/core/target/tobago-core-1.0.41-SNAPSHOT-javadoc.jar>
[INFO] Preparing taglib:taglibdocjar
[INFO] Setting property: classpath.resource.loader.class => 'org.codehaus.plexus.velocity.ContextClassLoaderResourceLoader'.
[INFO] Setting property: velocimacro.messages.on => 'false'.
[INFO] Setting property: resource.loader => 'classpath'.
[INFO] Setting property: resource.manager.logwhenfound => 'false'.
[INFO] ************************************************************** 
[INFO] Starting Jakarta Velocity v1.4
[INFO] RuntimeInstance initializing.
[INFO] Default Properties File: org/apache/velocity/runtime/defaults/velocity.properties
[INFO] Default ResourceManager initializing. (class org.apache.velocity.runtime.resource.ResourceManagerImpl)
[INFO] Resource Loader Instantiated: org.codehaus.plexus.velocity.ContextClassLoaderResourceLoader
[INFO] ClasspathResourceLoader : initialization starting.
[INFO] ClasspathResourceLoader : initialization complete.
[INFO] ResourceCache : initialized. (class org.apache.velocity.runtime.resource.ResourceCacheImpl)
[INFO] Default ResourceManager initialization complete.
[INFO] Loaded System Directive: org.apache.velocity.runtime.directive.Literal
[INFO] Loaded System Directive: org.apache.velocity.runtime.directive.Macro
[INFO] Loaded System Directive: org.apache.velocity.runtime.directive.Parse
[INFO] Loaded System Directive: org.apache.velocity.runtime.directive.Include
[INFO] Loaded System Directive: org.apache.velocity.runtime.directive.Foreach
[INFO] Created: 20 parsers.
[INFO] Velocimacro : initialization starting.
[INFO] Velocimacro : adding VMs from VM library template : VM_global_library.vm
[ERROR] ResourceManager : unable to find resource 'VM_global_library.vm' in any resource loader.
[INFO] Velocimacro : error using  VM library template VM_global_library.vm : org.apache.velocity.exception.ResourceNotFoundException:
Unable to find resource 'VM_global_library.vm'
[INFO] Velocimacro :  VM library template macro registration complete.
[INFO] Velocimacro : allowInline = true : VMs can be defined inline in templates
[INFO] Velocimacro : allowInlineToOverride = false : VMs defined inline may NOT replace previous
VM definitions
[INFO] Velocimacro : allowInlineLocal = false : VMs defined inline will be  global in scope
if allowed.
[INFO] Velocimacro : initialization complete.
[INFO] Velocity successfully started.
[JENKINS] Archiving <https://builds.apache.org/job/tobago-1.0.x-deploy/ws/tobago-1.0.x-deploy/core/target/tobago-core-1.0.41-SNAPSHOT-javadoc.jar>
to /home/hudson/hudson/jobs/tobago-1.0.x-deploy/modules/org.apache.myfaces.tobago$tobago-core/builds/2013-07-01_03-27-06/archive/org.apache.myfaces.tobago/tobago-core/1.0.41-SNAPSHOT/tobago-core-1.0.41-SNAPSHOT-javadoc.jar
[INFO] [taglib:taglibdoc {execution: taglibdoc}]
[INFO] [taglib:taglibdocjar {execution: attach-tlddoc}]
[INFO] Building jar: <https://builds.apache.org/job/tobago-1.0.x-deploy/ws/tobago-1.0.x-deploy/core/target/tobago-core-1.0.41-SNAPSHOT-tlddoc.jar>
[INFO] Preparing source:jar
[WARNING] Removing: jar from forked lifecycle, to prevent recursive invocation.
[WARNING] Removing: taglibdocjar from forked lifecycle, to prevent recursive invocation.
[WARNING] Removing: jar from forked lifecycle, to prevent recursive invocation.
[JENKINS] Archiving <https://builds.apache.org/job/tobago-1.0.x-deploy/ws/tobago-1.0.x-deploy/core/target/tobago-core-1.0.41-SNAPSHOT-tlddoc.jar>
to /home/hudson/hudson/jobs/tobago-1.0.x-deploy/modules/org.apache.myfaces.tobago$tobago-core/builds/2013-07-01_03-27-06/archive/org.apache.myfaces.tobago/tobago-core/1.0.41-SNAPSHOT/tobago-core-1.0.41-SNAPSHOT-tlddoc.jar
[INFO] [buildnumber:create {execution: default}]
[INFO] [source:jar {execution: attach-source}]
Jul 1, 2013 3:31:18 AM hudson.remoting.SynchronousCommandTransport$ReaderThread run
SEVERE: I/O error in channel channel
java.io.StreamCorruptedException
	at java.io.ObjectInputStream$BlockDataInputStream.readBlockHeader(ObjectInputStream.java:2412)
	at java.io.ObjectInputStream$BlockDataInputStream.refill(ObjectInputStream.java:2445)
	at java.io.ObjectInputStream$BlockDataInputStream.skipBlockData(ObjectInputStream.java:2350)
	at java.io.ObjectInputStream.skipCustomData(ObjectInputStream.java:1860)
	at java.io.ObjectInputStream.readSerialData(ObjectInputStream.java:1837)
	at java.io.ObjectInputStream.readOrdinaryObject(ObjectInputStream.java:1719)
	at java.io.ObjectInputStream.readObject0(ObjectInputStream.java:1305)
	at java.io.ObjectInputStream.defaultReadFields(ObjectInputStream.java:1910)
	at java.io.ObjectInputStream.readSerialData(ObjectInputStream.java:1834)
	at java.io.ObjectInputStream.readOrdinaryObject(ObjectInputStream.java:1719)
	at java.io.ObjectInputStream.readObject0(ObjectInputStream.java:1305)
	at java.io.ObjectInputStream.defaultReadFields(ObjectInputStream.java:1910)
	at java.io.ObjectInputStream.readSerialData(ObjectInputStream.java:1834)
	at java.io.ObjectInputStream.readOrdinaryObject(ObjectInputStream.java:1719)
	at java.io.ObjectInputStream.readObject0(ObjectInputStream.java:1305)
	at java.io.ObjectInputStream.defaultReadFields(ObjectInputStream.java:1910)
	at java.io.ObjectInputStream.readSerialData(ObjectInputStream.java:1834)
	at java.io.ObjectInputStream.readOrdinaryObject(ObjectInputStream.java:1719)
	at java.io.ObjectInputStream.readObject0(ObjectInputStream.java:1305)
	at java.io.ObjectInputStream.readObject(ObjectInputStream.java:348)
	at hudson.remoting.Command.readFrom(Command.java:92)
	at hudson.remoting.ClassicCommandTransport.read(ClassicCommandTransport.java:59)
	at hudson.remoting.SynchronousCommandTransport$ReaderThread.run(SynchronousCommandTransport.java:48)
channel stopped
[INFO] org already added, skipping
[INFO] org/apache already added, skipping
[INFO] org/apache/myfaces already added, skipping
[INFO] org/apache/myfaces/tobago already added, skipping
[INFO] org/apache/myfaces/tobago/taglib already added, skipping
[INFO] org/apache/myfaces/tobago/taglib/component already added, skipping
[INFO] org/apache/myfaces/tobago/taglib/extension already added, skipping
Process 1372649478264 is killed.
[INFO] ------------------------------------------------------------------------
[ERROR] FATAL ERROR
[INFO] ------------------------------------------------------------------------
[INFO] null
[INFO] ------------------------------------------------------------------------
[INFO] Trace
java.lang.reflect.UndeclaredThrowableException
	at $Proxy2.isArchivingDisabled(Unknown Source)
	at hudson.maven.MavenBuildProxy$Filter.isArchivingDisabled(MavenBuildProxy.java:227)
	at hudson.maven.reporters.MavenArtifact.archive(MavenArtifact.java:223)
	at hudson.maven.reporters.MavenArtifactArchiver.postBuild(MavenArtifactArchiver.java:108)
	at hudson.maven.Maven2Builder.postModule(Maven2Builder.java:129)
	at hudson.maven.MavenBuilder$Adapter.fireLeaveModule(MavenBuilder.java:354)
	at hudson.maven.MavenBuilder$Adapter.postBuild(MavenBuilder.java:308)
	at org.apache.maven.lifecycle.LifecycleExecutorInterceptor.execute(LifecycleExecutorInterceptor.java:68)
	at org.apache.maven.DefaultMaven.doExecute(DefaultMaven.java:328)
	at org.apache.maven.DefaultMaven.execute(DefaultMaven.java:138)
	at org.apache.maven.cli.MavenCli.main(MavenCli.java:362)
	at sun.reflect.NativeMethodAccessorImpl.invoke0(Native Method)
	at sun.reflect.NativeMethodAccessorImpl.invoke(NativeMethodAccessorImpl.java:39)
	at sun.reflect.DelegatingMethodAccessorImpl.invoke(DelegatingMethodAccessorImpl.java:25)
	at java.lang.reflect.Method.invoke(Method.java:592)
	at org.codehaus.classworlds.Launcher.launchEnhanced(Launcher.java:315)
	at org.codehaus.classworlds.Launcher.launch(Launcher.java:255)
	at hudson.maven.agent.Main.launch(Main.java:185)
	at hudson.maven.MavenBuilder.call(MavenBuilder.java:154)
	at hudson.maven.Maven2Builder.call(Maven2Builder.java:79)
	at hudson.maven.Maven2Builder.call(Maven2Builder.java:55)
	at hudson.remoting.UserRequest.perform(UserRequest.java:118)
	at hudson.remoting.UserRequest.perform(UserRequest.java:48)
	at hudson.remoting.Request$2.run(Request.java:326)
	at hudson.remoting.InterceptingExecutorService$1.call(InterceptingExecutorService.java:72)
	at java.util.concurrent.FutureTask$Sync.innerRun(FutureTask.java:269)
	at java.util.concurrent.FutureTask.run(FutureTask.java:123)
	at java.util.concurrent.ThreadPoolExecutor$Worker.runTask(ThreadPoolExecutor.java:651)
	at java.util.concurrent.ThreadPoolExecutor$Worker.run(ThreadPoolExecutor.java:676)
	at java.lang.Thread.run(Thread.java:595)
Caused by: hudson.remoting.ChannelClosedException: channel is already closed
	at hudson.remoting.Channel.send(Channel.java:494)
	at hudson.remoting.Request.call(Request.java:129)
	at hudson.remoting.Channel.call(Channel.java:672)
	at hudson.remoting.RemoteInvocationHandler.invoke(RemoteInvocationHandler.java:158)
	... 30 more
Caused by: java.io.StreamCorruptedException
	at java.io.ObjectInputStream$BlockDataInputStream.readBlockHeader(ObjectInputStream.java:2412)
	at java.io.ObjectInputStream$BlockDataInputStream.refill(ObjectInputStream.java:2445)
	at java.io.ObjectInputStream$BlockDataInputStream.skipBlockData(ObjectInputStream.java:2350)
	at java.io.ObjectInputStream.skipCustomData(ObjectInputStream.java:1860)
	at java.io.ObjectInputStream.readSerialData(ObjectInputStream.java:1837)
	at java.io.ObjectInputStream.readOrdinaryObject(ObjectInputStream.java:1719)
	at java.io.ObjectInputStream.readObject0(ObjectInputStream.java:1305)
	at java.io.ObjectInputStream.defaultReadFields(ObjectInputStream.java:1910)
	at java.io.ObjectInputStream.readSerialData(ObjectInputStream.java:1834)
	at java.io.ObjectInputStream.readOrdinaryObject(ObjectInputStream.java:1719)
	at java.io.ObjectInputStream.readObject0(ObjectInputStream.java:1305)
	at java.io.ObjectInputStream.defaultReadFields(ObjectInputStream.java:1910)
	at java.io.ObjectInputStream.readSerialData(ObjectInputStream.java:1834)
	at java.io.ObjectInputStream.readOrdinaryObject(ObjectInputStream.java:1719)
	at java.io.ObjectInputStream.readObject0(ObjectInputStream.java:1305)
	at java.io.ObjectInputStream.defaultReadFields(ObjectInputStream.java:1910)
	at java.io.ObjectInputStream.readSerialData(ObjectInputStream.java:1834)
	at java.io.ObjectInputStream.readOrdinaryObject(ObjectInputStream.java:1719)
	at java.io.ObjectInputStream.readObject0(ObjectInputStream.java:1305)
	at java.io.ObjectInputStream.readObject(ObjectInputStream.java:348)
	at hudson.remoting.Command.readFrom(Command.java:92)
	at hudson.remoting.ClassicCommandTransport.read(ClassicCommandTransport.java:59)
	at hudson.remoting.SynchronousCommandTransport$ReaderThread.run(SynchronousCommandTransport.java:48)
[INFO] ------------------------------------------------------------------------
[INFO] Total time: 3 minutes 28 seconds
[INFO] Finished at: Mon Jul 01 03:31:18 UTC 2013
[INFO] Final Memory: 72M/327M
[INFO] ------------------------------------------------------------------------
ERROR: Maven JVM terminated unexpectedly with exit code 0


Mime
View raw message