myfaces-commits mailing list archives

Site index · List index
Message view « Date » · « Thread »
Top « Date » · « Thread »
From Apache Jenkins Server <jenk...@builds.apache.org>
Subject Build failed in Jenkins: Myfaces-Orchestra #1000
Date Fri, 28 Jun 2013 19:02:37 GMT
See <https://builds.apache.org/job/Myfaces-Orchestra/1000/>

------------------------------------------
[...truncated 317 lines...]
Jun 28, 2013 6:58:39 PM org.apache.myfaces.orchestra.conversation.MockAdvice invoke
INFO: before:Invoking
Jun 28, 2013 6:58:39 PM org.apache.myfaces.orchestra.conversation.MockAdvice invoke
INFO: after: Invoking
Jun 28, 2013 6:58:39 PM org.apache.myfaces.orchestra.conversation.MockAdvice invoke
INFO: after: Conversation Method
Jun 28, 2013 6:58:39 PM org.apache.myfaces.orchestra.conversation.MockAdvice invoke
INFO: before:Conversation Method
Jun 28, 2013 6:58:39 PM org.apache.myfaces.orchestra.conversation.MockAdvice invoke
INFO: before:Invoking
Jun 28, 2013 6:58:39 PM org.apache.myfaces.orchestra.conversation.MockAdvice invoke
INFO: after: Invoking
Jun 28, 2013 6:58:39 PM org.apache.myfaces.orchestra.conversation.MockAdvice invoke
INFO: after: Conversation Method
Jun 28, 2013 6:58:39 PM org.apache.myfaces.orchestra.conversation.MockAdvice invoke
INFO: before:Invoking
Jun 28, 2013 6:58:39 PM org.apache.myfaces.orchestra.conversation.MockAdvice invoke
INFO: after: Invoking
Tests run: 3, Failures: 0, Errors: 0, Skipped: 0, Time elapsed: 1.795 sec
Running org.apache.myfaces.orchestra.conversation.TestConversationBind
Jun 28, 2013 6:58:39 PM org.apache.myfaces.orchestra.conversation.MockAdvice invoke
INFO: before:Conversation Method
Jun 28, 2013 6:58:39 PM org.apache.myfaces.orchestra.conversation.MockAdvice invoke
INFO: before:Invoking
Jun 28, 2013 6:58:39 PM org.apache.myfaces.orchestra.conversation.MockAdvice invoke
INFO: after: Invoking
Jun 28, 2013 6:58:39 PM org.apache.myfaces.orchestra.conversation.MockAdvice invoke
INFO: after: Conversation Method
Jun 28, 2013 6:58:39 PM org.apache.myfaces.orchestra.conversation.MockAdvice invoke
INFO: before:Conversation Method
Jun 28, 2013 6:58:39 PM org.apache.myfaces.orchestra.conversation.MockAdvice invoke
INFO: before:Invoking
Jun 28, 2013 6:58:39 PM org.apache.myfaces.orchestra.conversation.MockAdvice invoke
INFO: after: Invoking
Jun 28, 2013 6:58:39 PM org.apache.myfaces.orchestra.conversation.MockAdvice invoke
INFO: after: Conversation Method
Jun 28, 2013 6:58:39 PM org.apache.myfaces.orchestra.conversation.MockAdvice invoke
INFO: before:Conversation Method
Jun 28, 2013 6:58:39 PM org.apache.myfaces.orchestra.conversation.MockAdvice invoke
INFO: before:Invoking
Jun 28, 2013 6:58:39 PM org.apache.myfaces.orchestra.conversation.MockAdvice invoke
INFO: after: Invoking
Jun 28, 2013 6:58:39 PM org.apache.myfaces.orchestra.conversation.MockAdvice invoke
INFO: after: Conversation Method
Jun 28, 2013 6:58:39 PM org.apache.myfaces.orchestra.conversation.MockAdvice invoke
INFO: before:Conversation Method
Jun 28, 2013 6:58:39 PM org.apache.myfaces.orchestra.conversation.MockAdvice invoke
INFO: after: Conversation Method
Jun 28, 2013 6:58:39 PM org.apache.myfaces.orchestra.conversation.MockAdvice invoke
INFO: before:Conversation Method
Jun 28, 2013 6:58:39 PM org.apache.myfaces.orchestra.conversation.MockAdvice invoke
INFO: after: Conversation Method
Jun 28, 2013 6:58:39 PM org.apache.myfaces.orchestra.conversation.MockAdvice invoke
INFO: before:Conversation Method
Jun 28, 2013 6:58:39 PM org.apache.myfaces.orchestra.conversation.MockAdvice invoke
INFO: after: Conversation Method
Jun 28, 2013 6:58:39 PM org.apache.myfaces.orchestra.conversation.MockAdvice invoke
INFO: before:Conversation Method
Jun 28, 2013 6:58:39 PM org.apache.myfaces.orchestra.conversation.MockAdvice invoke
INFO: after: Conversation Method
Jun 28, 2013 6:58:39 PM org.apache.myfaces.orchestra.conversation.MockAdvice invoke
INFO: before:Conversation Method
Jun 28, 2013 6:58:39 PM org.apache.myfaces.orchestra.conversation.MockAdvice invoke
INFO: before:Invoking
Jun 28, 2013 6:58:39 PM org.apache.myfaces.orchestra.conversation.MockAdvice invoke
INFO: after: Invoking
Jun 28, 2013 6:58:39 PM org.apache.myfaces.orchestra.conversation.MockAdvice invoke
INFO: after: Conversation Method
Jun 28, 2013 6:58:39 PM org.apache.myfaces.orchestra.conversation.MockAdvice invoke
INFO: before:Conversation Method
Jun 28, 2013 6:58:39 PM org.apache.myfaces.orchestra.conversation.MockAdvice invoke
INFO: before:Invoking
Jun 28, 2013 6:58:39 PM org.apache.myfaces.orchestra.conversation.MockAdvice invoke
INFO: after: Invoking
Jun 28, 2013 6:58:39 PM org.apache.myfaces.orchestra.conversation.MockAdvice invoke
INFO: after: Conversation Method
Jun 28, 2013 6:58:39 PM org.apache.myfaces.orchestra.conversation.MockAdvice invoke
INFO: before:Conversation Method
Jun 28, 2013 6:58:39 PM org.apache.myfaces.orchestra.conversation.MockAdvice invoke
INFO: after: Conversation Method
Jun 28, 2013 6:58:39 PM org.apache.myfaces.orchestra.conversation.MockAdvice invoke
INFO: before:Conversation Method
Jun 28, 2013 6:58:39 PM org.apache.myfaces.orchestra.conversation.MockAdvice invoke
INFO: before:Invoking
Jun 28, 2013 6:58:39 PM org.apache.myfaces.orchestra.conversation.MockAdvice invoke
INFO: after: Invoking
Jun 28, 2013 6:58:39 PM org.apache.myfaces.orchestra.conversation.MockAdvice invoke
INFO: after: Conversation Method
Jun 28, 2013 6:58:39 PM org.apache.myfaces.orchestra.conversation.MockAdvice invoke
INFO: before:Conversation Method
Jun 28, 2013 6:58:39 PM org.apache.myfaces.orchestra.conversation.MockAdvice invoke
INFO: before:Invoking
Jun 28, 2013 6:58:39 PM org.apache.myfaces.orchestra.conversation.MockAdvice invoke
INFO: after: Invoking
Jun 28, 2013 6:58:39 PM org.apache.myfaces.orchestra.conversation.MockAdvice invoke
INFO: after: Conversation Method
Tests run: 2, Failures: 0, Errors: 0, Skipped: 0, Time elapsed: 0.035 sec
Running org.apache.myfaces.orchestra.conversation.TestConversation
Tests run: 1, Failures: 0, Errors: 0, Skipped: 0, Time elapsed: 0.028 sec
Running org.apache.myfaces.orchestra.conversation.spring.TestSpringUtils
Jun 28, 2013 6:58:39 PM org.springframework.test.AbstractSingleSpringContextTests loadContextLocations
INFO: Loading context for locations: classpath:org/apache/myfaces/orchestra/conversation/spring/TestSpringUtils.xml
Jun 28, 2013 6:58:39 PM org.springframework.beans.factory.xml.XmlBeanDefinitionReader loadBeanDefinitions
INFO: Loading XML bean definitions from class path resource [org/apache/myfaces/orchestra/conversation/spring/TestSpringUtils.xml]
Jun 28, 2013 6:58:39 PM org.springframework.context.support.AbstractApplicationContext prepareRefresh
INFO: Refreshing org.springframework.context.support.GenericApplicationContext@12022b7: display
name [org.springframework.context.support.GenericApplicationContext@12022b7]; startup date
[Fri Jun 28 18:58:39 GMT+00:00 2013]; root of context hierarchy
Jun 28, 2013 6:58:39 PM org.springframework.context.support.AbstractApplicationContext obtainFreshBeanFactory
INFO: Bean factory for application context [org.springframework.context.support.GenericApplicationContext@12022b7]:
org.springframework.beans.factory.support.DefaultListableBeanFactory@b1684
Jun 28, 2013 6:58:39 PM org.springframework.beans.factory.support.DefaultListableBeanFactory
preInstantiateSingletons
INFO: Pre-instantiating singletons in org.springframework.beans.factory.support.DefaultListableBeanFactory@b1684:
defining beans [org.springframework.beans.factory.config.CustomScopeConfigurer,simpleBean];
root of factory hierarchy
Tests run: 1, Failures: 0, Errors: 0, Skipped: 0, Time elapsed: 0.543 sec
Running org.apache.myfaces.orchestra.requestParameterProvider.TestRequestParameterProviderManager
Tests run: 1, Failures: 0, Errors: 0, Skipped: 0, Time elapsed: 0.656 sec
Running org.apache.myfaces.orchestra.lib.jsf.TestSerializableConverter
Jun 28, 2013 6:58:43 PM org.springframework.test.AbstractSingleSpringContextTests loadContextLocations
INFO: Loading context for locations: classpath:org/apache/myfaces/orchestra/lib/jsf/TestSerializableConverter.xml
Jun 28, 2013 6:58:43 PM org.springframework.beans.factory.xml.XmlBeanDefinitionReader loadBeanDefinitions
INFO: Loading XML bean definitions from class path resource [org/apache/myfaces/orchestra/lib/jsf/TestSerializableConverter.xml]
Jun 28, 2013 6:58:45 PM org.springframework.context.support.AbstractApplicationContext prepareRefresh
INFO: Refreshing org.springframework.context.support.GenericApplicationContext@7aa187: display
name [org.springframework.context.support.GenericApplicationContext@7aa187]; startup date
[Fri Jun 28 18:58:45 GMT+00:00 2013]; root of context hierarchy
Jun 28, 2013 6:58:45 PM org.springframework.context.support.AbstractApplicationContext obtainFreshBeanFactory
INFO: Bean factory for application context [org.springframework.context.support.GenericApplicationContext@7aa187]:
org.springframework.beans.factory.support.DefaultListableBeanFactory@4e8edc
Jun 28, 2013 6:58:45 PM org.springframework.beans.factory.support.DefaultListableBeanFactory
preInstantiateSingletons
INFO: Pre-instantiating singletons in org.springframework.beans.factory.support.DefaultListableBeanFactory@4e8edc:
defining beans [org.springframework.beans.factory.config.CustomScopeConfigurer,statelessConverter,statefulConverter];
root of factory hierarchy
Tests run: 2, Failures: 0, Errors: 0, Skipped: 0, Time elapsed: 5.738 sec
Running org.apache.myfaces.orchestra.viewController.TestDefaultViewControllerNameMapper
Tests run: 1, Failures: 0, Errors: 0, Skipped: 0, Time elapsed: 0.323 sec
Running org.apache.myfaces.orchestra.viewController.TestReflectiveViewControllerExecutor
Tests run: 1, Failures: 0, Errors: 0, Skipped: 0, Time elapsed: 0.159 sec
Running org.apache.myfaces.orchestra.viewController.TestInterfaceViewControllerExecutor
Tests run: 1, Failures: 0, Errors: 0, Skipped: 0, Time elapsed: 0.088 sec
Jun 28, 2013 6:58:47 PM org.springframework.context.support.AbstractApplicationContext doClose
INFO: Closing org.springframework.context.support.GenericApplicationContext@9b87f6: display
name [org.springframework.context.support.GenericApplicationContext@9b87f6]; startup date
[Fri Jun 28 18:58:38 GMT+00:00 2013]; root of context hierarchy
Jun 28, 2013 6:58:47 PM org.springframework.context.support.AbstractApplicationContext doClose
INFO: Closing org.springframework.context.support.GenericApplicationContext@12022b7: display
name [org.springframework.context.support.GenericApplicationContext@12022b7]; startup date
[Fri Jun 28 18:58:39 GMT+00:00 2013]; root of context hierarchy
Jun 28, 2013 6:58:47 PM org.springframework.context.support.AbstractApplicationContext doClose
INFO: Closing org.springframework.context.support.GenericApplicationContext@1ee4648: display
name [org.springframework.context.support.GenericApplicationContext@1ee4648]; startup date
[Fri Jun 28 18:57:56 GMT+00:00 2013]; root of context hierarchy
Jun 28, 2013 6:58:47 PM org.springframework.context.support.AbstractApplicationContext doClose
INFO: Closing org.springframework.context.support.GenericApplicationContext@7aa187: display
name [org.springframework.context.support.GenericApplicationContext@7aa187]; startup date
[Fri Jun 28 18:58:45 GMT+00:00 2013]; root of context hierarchy
[TopLink Config]: 2013.06.28 06:58:47.108--ServerSession(1478827)--Connection(9773403)--Thread(Thread[Thread-2,5,main])--disconnect
[TopLink Info]: 2013.06.28 06:58:47.109--ServerSession(1478827)--Thread(Thread[Thread-2,5,main])--<https://builds.apache.org/job/Myfaces-Orchestra/ws/trunk/core/target/test-classes-default>
logout successful
[TopLink Config]: 2013.06.28 06:58:47.109--ServerSession(1478827)--Connection(26130360)--Thread(Thread[Thread-2,5,main])--disconnect
[TopLink Config]: 2013.06.28 06:58:47.110--ServerSession(1478827)--Connection(14256494)--Thread(Thread[Thread-2,5,main])--disconnect
[TopLink Config]: 2013.06.28 06:58:47.110--ServerSession(1478827)--Connection(18529640)--Thread(Thread[Thread-2,5,main])--disconnect
[TopLink Config]: 2013.06.28 06:58:47.110--ServerSession(1478827)--Connection(29687596)--Thread(Thread[Thread-2,5,main])--disconnect
[TopLink Config]: 2013.06.28 06:58:47.111--ServerSession(1478827)--Connection(1269167)--Thread(Thread[Thread-2,5,main])--disconnect
[TopLink Config]: 2013.06.28 06:58:47.111--ServerSession(1478827)--Connection(14247087)--Thread(Thread[Thread-2,5,main])--disconnect
[TopLink Config]: 2013.06.28 06:58:47.112--ServerSession(1478827)--Connection(11019994)--Thread(Thread[Thread-2,5,main])--disconnect

Results :

Tests run: 15, Failures: 0, Errors: 0, Skipped: 0

[JENKINS] Recording test results
[INFO] [jar:jar {execution: default-jar}]
[INFO] Building jar: <https://builds.apache.org/job/Myfaces-Orchestra/ws/trunk/core/target/myfaces-orchestra-core-1.6-SNAPSHOT.jar>
[INFO] Preparing source:jar
[WARNING] Removing: jar from forked lifecycle, to prevent recursive invocation.
[WARNING] DEPRECATED [tasks]: Use target instead
[JENKINS] Archiving <https://builds.apache.org/job/Myfaces-Orchestra/ws/trunk/core/pom.xml>
to /home/hudson/hudson/jobs/Myfaces-Orchestra/modules/org.apache.myfaces.orchestra$myfaces-orchestra-core/builds/2013-06-28_18-49-01/archive/org.apache.myfaces.orchestra/myfaces-orchestra-core/1.6-SNAPSHOT/myfaces-orchestra-core-1.6-SNAPSHOT.pom
[JENKINS] Archiving <https://builds.apache.org/job/Myfaces-Orchestra/ws/trunk/core/target/myfaces-orchestra-core-1.6-SNAPSHOT.jar>
to /home/hudson/hudson/jobs/Myfaces-Orchestra/modules/org.apache.myfaces.orchestra$myfaces-orchestra-core/builds/2013-06-28_18-49-01/archive/org.apache.myfaces.orchestra/myfaces-orchestra-core/1.6-SNAPSHOT/myfaces-orchestra-core-1.6-SNAPSHOT.jar
[INFO] [antrun:run {execution: javadoc.resources}]
[WARNING] Parameter tasks is deprecated, use target instead
[INFO] Executing tasks

main:
[INFO] Executed tasks
[INFO] [build-helper:add-source {execution: add-source}]
[INFO] Source directory: <https://builds.apache.org/job/Myfaces-Orchestra/ws/trunk/core/target/shared_sources>
added.
[INFO] [source:jar {execution: attach-source}]
[INFO] ------------------------------------------------------------------------
[ERROR] FATAL ERROR
[INFO] ------------------------------------------------------------------------
[INFO] null
error=12, Not enough space
[INFO] ------------------------------------------------------------------------
[INFO] Trace
java.lang.reflect.UndeclaredThrowableException
	at org.codehaus.plexus.archiver.AbstractArchiver.getFiles(AbstractArchiver.java:519)
	at org.apache.maven.plugin.source.AbstractSourceJarMojo.packageSources(AbstractSourceJarMojo.java:262)
	at org.apache.maven.plugin.source.AbstractSourceJarMojo.packageSources(AbstractSourceJarMojo.java:232)
	at org.apache.maven.plugin.source.AbstractSourceJarMojo.execute(AbstractSourceJarMojo.java:201)
	at org.apache.maven.plugin.DefaultPluginManager.executeMojo(DefaultPluginManager.java:490)
	at hudson.maven.agent.PluginManagerInterceptor.executeMojo(PluginManagerInterceptor.java:182)
	at org.apache.maven.lifecycle.DefaultLifecycleExecutor.executeGoals(DefaultLifecycleExecutor.java:694)
	at org.apache.maven.lifecycle.DefaultLifecycleExecutor.executeGoalWithLifecycle(DefaultLifecycleExecutor.java:556)
	at org.apache.maven.lifecycle.DefaultLifecycleExecutor.executeGoal(DefaultLifecycleExecutor.java:535)
	at org.apache.maven.lifecycle.DefaultLifecycleExecutor.executeGoalAndHandleFailures(DefaultLifecycleExecutor.java:387)
	at org.apache.maven.lifecycle.DefaultLifecycleExecutor.executeTaskSegments(DefaultLifecycleExecutor.java:348)
	at org.apache.maven.lifecycle.DefaultLifecycleExecutor.execute(DefaultLifecycleExecutor.java:180)
	at org.apache.maven.lifecycle.LifecycleExecutorInterceptor.execute(LifecycleExecutorInterceptor.java:65)
	at org.apache.maven.DefaultMaven.doExecute(DefaultMaven.java:328)
	at org.apache.maven.DefaultMaven.execute(DefaultMaven.java:138)
	at org.apache.maven.cli.MavenCli.main(MavenCli.java:362)
	at sun.reflect.NativeMethodAccessorImpl.invoke0(Native Method)
	at sun.reflect.NativeMethodAccessorImpl.invoke(NativeMethodAccessorImpl.java:39)
	at sun.reflect.DelegatingMethodAccessorImpl.invoke(DelegatingMethodAccessorImpl.java:25)
	at java.lang.reflect.Method.invoke(Method.java:597)
	at org.codehaus.classworlds.Launcher.launchEnhanced(Launcher.java:315)
	at org.codehaus.classworlds.Launcher.launch(Launcher.java:255)
	at hudson.maven.agent.Main.launch(Main.java:185)
	at hudson.maven.MavenBuilder.call(MavenBuilder.java:154)
	at hudson.maven.Maven2Builder.call(Maven2Builder.java:79)
	at hudson.maven.Maven2Builder.call(Maven2Builder.java:55)
	at hudson.remoting.UserRequest.perform(UserRequest.java:118)
	at hudson.remoting.UserRequest.perform(UserRequest.java:48)
	at hudson.remoting.Request$2.run(Request.java:326)
	at hudson.remoting.InterceptingExecutorService$1.call(InterceptingExecutorService.java:72)
	at java.util.concurrent.FutureTask$Sync.innerRun(FutureTask.java:303)
	at java.util.concurrent.FutureTask.run(FutureTask.java:138)
	at java.util.concurrent.ThreadPoolExecutor$Worker.runTask(ThreadPoolExecutor.java:886)
	at java.util.concurrent.ThreadPoolExecutor$Worker.run(ThreadPoolExecutor.java:908)
	at java.lang.Thread.run(Thread.java:662)
Caused by: org.codehaus.plexus.archiver.ArchiverException: Failed to retrieve numeric file
attributes using: '/bin/sh -c ls -1laR <https://builds.apache.org/job/Myfaces-Orchestra/ws/trunk/core/src/main/java'>
	at org.codehaus.plexus.archiver.AbstractArchiver$1.hasNext(AbstractArchiver.java:427)
	at org.codehaus.plexus.archiver.AbstractArchiver$1.hasNext(AbstractArchiver.java:453)
	at org.codehaus.plexus.archiver.AbstractArchiver.getFiles(AbstractArchiver.java:507)
	... 34 more
Caused by: java.io.IOException: Failed to retrieve numeric file attributes using: '/bin/sh
-c ls -1laR <https://builds.apache.org/job/Myfaces-Orchestra/ws/trunk/core/src/main/java'>
	at org.codehaus.plexus.components.io.attributes.PlexusIoResourceAttributeUtils.executeLs(PlexusIoResourceAttributeUtils.java:287)
	at org.codehaus.plexus.components.io.attributes.PlexusIoResourceAttributeUtils.getFileAttributesByPath(PlexusIoResourceAttributeUtils.java:237)
	at org.codehaus.plexus.components.io.attributes.PlexusIoResourceAttributeUtils.getFileAttributesByPath(PlexusIoResourceAttributeUtils.java:189)
	at org.codehaus.plexus.components.io.resources.PlexusIoFileResourceCollection.getResources(PlexusIoFileResourceCollection.java:175)
	at org.codehaus.plexus.archiver.AbstractArchiver$1.hasNext(AbstractArchiver.java:423)
	... 36 more
Caused by: org.codehaus.plexus.util.cli.CommandLineException: Error while executing process.
	at org.codehaus.plexus.util.cli.Commandline.execute(Commandline.java:656)
	at org.codehaus.plexus.util.cli.CommandLineUtils.executeCommandLine(CommandLineUtils.java:144)
	at org.codehaus.plexus.util.cli.CommandLineUtils.executeCommandLine(CommandLineUtils.java:107)
	at org.codehaus.plexus.components.io.attributes.PlexusIoResourceAttributeUtils.executeLs(PlexusIoResourceAttributeUtils.java:277)
	... 40 more
Caused by: java.io.IOException: Cannot run program "/bin/sh": error=12, Not enough space
	at java.lang.ProcessBuilder.start(ProcessBuilder.java:460)
	at java.lang.Runtime.exec(Runtime.java:593)
	at java.lang.Runtime.exec(Runtime.java:509)
	at org.codehaus.plexus.util.cli.Commandline.execute(Commandline.java:636)
	... 43 more
Caused by: java.io.IOException: error=12, Not enough space
	at java.lang.UNIXProcess.forkAndExec(Native Method)
	at java.lang.UNIXProcess.<init>(UNIXProcess.java:53)
	at java.lang.ProcessImpl.start(ProcessImpl.java:65)
	at java.lang.ProcessBuilder.start(ProcessBuilder.java:453)
	... 46 more
[INFO] ------------------------------------------------------------------------
[INFO] Total time: 9 minutes 25 seconds
[INFO] Finished at: Fri Jun 28 19:02:16 GMT+00:00 2013
[INFO] Final Memory: 74M/409M
[INFO] ------------------------------------------------------------------------
channel stopped

Mime
View raw message