myfaces-commits mailing list archives

Site index · List index
Message view « Date » · « Thread »
Top « Date » · « Thread »
From Apache Jenkins Server <jenk...@builds.apache.org>
Subject Build failed in Jenkins: myfaces-current11 #813
Date Fri, 10 May 2013 00:42:00 GMT
See <https://builds.apache.org/job/myfaces-current11/813/>

------------------------------------------
[...truncated 634 lines...]
[INFO] Building jar: <https://builds.apache.org/job/myfaces-current11/ws/current11/shared/shared-impl/target/myfaces-shared-impl-2.0.15-SNAPSHOT.jar>
[INFO] Preparing source:jar
[WARNING] Removing: jar from forked lifecycle, to prevent recursive invocation.
[JENKINS] Archiving <https://builds.apache.org/job/myfaces-current11/ws/current11/shared/shared-impl/pom.xml>
to /home/hudson/hudson/jobs/myfaces-current11/modules/org.apache.myfaces.shared$myfaces-shared-impl/builds/2013-05-10_00-23-47/archive/org.apache.myfaces.shared/myfaces-shared-impl/2.0.15-SNAPSHOT/myfaces-shared-impl-2.0.15-SNAPSHOT.pom
[JENKINS] Archiving <https://builds.apache.org/job/myfaces-current11/ws/current11/shared/shared-impl/target/myfaces-shared-impl-2.0.15-SNAPSHOT.jar>
to /home/hudson/hudson/jobs/myfaces-current11/modules/org.apache.myfaces.shared$myfaces-shared-impl/builds/2013-05-10_00-23-47/archive/org.apache.myfaces.shared/myfaces-shared-impl/2.0.15-SNAPSHOT/myfaces-shared-impl-2.0.15-SNAPSHOT.jar
[INFO] [dependency:unpack {execution: unpack-sources}]
[INFO] Configured Artifact: org.apache.myfaces.shared:myfaces-shared-core:sources:2.0.15-SNAPSHOT:jar
[INFO] myfaces-shared-core-2.0.15-SNAPSHOT-sources.jar already unpacked.
[INFO] [source:jar {execution: attach-source}]
[INFO] META-INF already added, skipping
[INFO] META-INF already added, skipping
[INFO] META-INF/NOTICE already added, skipping
[INFO] META-INF/LICENSE already added, skipping
[INFO] META-INF/DEPENDENCIES already added, skipping
[INFO] Building jar: <https://builds.apache.org/job/myfaces-current11/ws/current11/shared/shared-impl/target/myfaces-shared-impl-2.0.15-SNAPSHOT-sources.jar>
[INFO] META-INF already added, skipping
[INFO] META-INF already added, skipping
[INFO] META-INF/NOTICE already added, skipping
[INFO] META-INF/LICENSE already added, skipping
[INFO] META-INF/DEPENDENCIES already added, skipping
[INFO] [checkstyle:check {execution: verify-style}]
[INFO] 
[INFO] [install:install {execution: default-install}]
[INFO] Installing <https://builds.apache.org/job/myfaces-current11/ws/current11/shared/shared-impl/target/myfaces-shared-impl-2.0.15-SNAPSHOT.jar>
to /export/home/hudson/hudson-slave/maven-repositories/0/org/apache/myfaces/shared/myfaces-shared-impl/2.0.15-SNAPSHOT/myfaces-shared-impl-2.0.15-SNAPSHOT.jar
[INFO] Installing <https://builds.apache.org/job/myfaces-current11/ws/current11/shared/shared-impl/target/myfaces-shared-impl-2.0.15-SNAPSHOT-sources.jar>
to /export/home/hudson/hudson-slave/maven-repositories/0/org/apache/myfaces/shared/myfaces-shared-impl/2.0.15-SNAPSHOT/myfaces-shared-impl-2.0.15-SNAPSHOT-sources.jar
[JENKINS] Archiving <https://builds.apache.org/job/myfaces-current11/ws/current11/shared/shared-impl/target/myfaces-shared-impl-2.0.15-SNAPSHOT-sources.jar>
to /home/hudson/hudson/jobs/myfaces-current11/modules/org.apache.myfaces.shared$myfaces-shared-impl/builds/2013-05-10_00-23-47/archive/org.apache.myfaces.shared/myfaces-shared-impl/2.0.15-SNAPSHOT/myfaces-shared-impl-2.0.15-SNAPSHOT-sources.jar
[INFO] ------------------------------------------------------------------------
[INFO] Building MyFaces Shared Tomahawk
[INFO]    task-segment: [install]
[INFO] ------------------------------------------------------------------------
[INFO] [dependency:unpack {execution: unpack-sources}]
[INFO] Configured Artifact: org.apache.myfaces.shared:myfaces-shared-core:sources:2.0.15-SNAPSHOT:jar
[INFO] myfaces-shared-core-2.0.15-SNAPSHOT-sources.jar already unpacked.
[WARNING] DEPRECATED [sourceRoot]: Use the build-helper-maven-plugin to bind source directories
[WARNING] DEPRECATED [tasks]: Use target instead
[INFO] [antrun:run {execution: refactor-shared-sources}]
[WARNING] Parameter tasks is deprecated, use target instead
[INFO] Executing tasks

main:

refactor-java-sources:
[INFO] Executed tasks
[INFO] Registering compile source root <https://builds.apache.org/job/myfaces-current11/ws/current11/shared/shared-tomahawk/target/refactored-shared-sources/main/java>
[INFO] [remote-resources:process {execution: default}]
[WARNING] DEPRECATED [tasks]: Use target instead
[INFO] [antrun:run {execution: refactor-resources}]
[WARNING] Parameter tasks is deprecated, use target instead
[INFO] Executing tasks

main:

refactor-resources:
[INFO] Executed tasks
[debug] execute contextualize
[INFO] [resources:resources {execution: default-resources}]
[INFO] Using 'UTF-8' encoding to copy filtered resources.
[INFO] Copying 2 resources
[INFO] Copying 3 resources
[INFO] [compiler:compile {execution: default-compile}]
[INFO] Nothing to compile - all classes are up to date
[debug] execute contextualize
[INFO] [resources:testResources {execution: default-testResources}]
[INFO] Using 'UTF-8' encoding to copy filtered resources.
[INFO] skip non existing resourceDirectory <https://builds.apache.org/job/myfaces-current11/ws/current11/shared/shared-tomahawk/src/test/resources>
[INFO] Copying 3 resources
[INFO] [compiler:testCompile {execution: default-testCompile}]
[INFO] No sources to compile
[INFO] [surefire:test {execution: default-test}]
[INFO] Surefire report directory: <https://builds.apache.org/job/myfaces-current11/ws/current11/shared/shared-tomahawk/target/surefire-reports>

-------------------------------------------------------
 T E S T S
-------------------------------------------------------

Results :

Tests run: 0, Failures: 0, Errors: 0, Skipped: 0

[JENKINS] Recording test results
[INFO] [jar:jar {execution: default-jar}]
[INFO] Building jar: <https://builds.apache.org/job/myfaces-current11/ws/current11/shared/shared-tomahawk/target/myfaces-shared-tomahawk-2.0.15-SNAPSHOT.jar>
[INFO] Preparing source:jar
[WARNING] Removing: jar from forked lifecycle, to prevent recursive invocation.
[JENKINS] Archiving <https://builds.apache.org/job/myfaces-current11/ws/current11/shared/shared-tomahawk/pom.xml>
to /home/hudson/hudson/jobs/myfaces-current11/modules/org.apache.myfaces.shared$myfaces-shared-tomahawk/builds/2013-05-10_00-23-48/archive/org.apache.myfaces.shared/myfaces-shared-tomahawk/2.0.15-SNAPSHOT/myfaces-shared-tomahawk-2.0.15-SNAPSHOT.pom
[JENKINS] Archiving <https://builds.apache.org/job/myfaces-current11/ws/current11/shared/shared-tomahawk/target/myfaces-shared-tomahawk-2.0.15-SNAPSHOT.jar>
to /home/hudson/hudson/jobs/myfaces-current11/modules/org.apache.myfaces.shared$myfaces-shared-tomahawk/builds/2013-05-10_00-23-48/archive/org.apache.myfaces.shared/myfaces-shared-tomahawk/2.0.15-SNAPSHOT/myfaces-shared-tomahawk-2.0.15-SNAPSHOT.jar
[INFO] [dependency:unpack {execution: unpack-sources}]
[INFO] Configured Artifact: org.apache.myfaces.shared:myfaces-shared-core:sources:2.0.15-SNAPSHOT:jar
[INFO] myfaces-shared-core-2.0.15-SNAPSHOT-sources.jar already unpacked.
[INFO] [source:jar {execution: attach-source}]
[INFO] META-INF already added, skipping
[INFO] META-INF already added, skipping
[INFO] META-INF/DEPENDENCIES already added, skipping
[INFO] META-INF/NOTICE already added, skipping
[INFO] META-INF/LICENSE already added, skipping
[INFO] Building jar: <https://builds.apache.org/job/myfaces-current11/ws/current11/shared/shared-tomahawk/target/myfaces-shared-tomahawk-2.0.15-SNAPSHOT-sources.jar>
[INFO] META-INF already added, skipping
[INFO] META-INF already added, skipping
[INFO] META-INF/DEPENDENCIES already added, skipping
[INFO] META-INF/NOTICE already added, skipping
[INFO] META-INF/LICENSE already added, skipping
[INFO] [checkstyle:check {execution: verify-style}]
[INFO] 
[INFO] [install:install {execution: default-install}]
[INFO] Installing <https://builds.apache.org/job/myfaces-current11/ws/current11/shared/shared-tomahawk/target/myfaces-shared-tomahawk-2.0.15-SNAPSHOT.jar>
to /export/home/hudson/hudson-slave/maven-repositories/0/org/apache/myfaces/shared/myfaces-shared-tomahawk/2.0.15-SNAPSHOT/myfaces-shared-tomahawk-2.0.15-SNAPSHOT.jar
[INFO] Installing <https://builds.apache.org/job/myfaces-current11/ws/current11/shared/shared-tomahawk/target/myfaces-shared-tomahawk-2.0.15-SNAPSHOT-sources.jar>
to /export/home/hudson/hudson-slave/maven-repositories/0/org/apache/myfaces/shared/myfaces-shared-tomahawk/2.0.15-SNAPSHOT/myfaces-shared-tomahawk-2.0.15-SNAPSHOT-sources.jar
[JENKINS] Archiving <https://builds.apache.org/job/myfaces-current11/ws/current11/shared/shared-tomahawk/target/myfaces-shared-tomahawk-2.0.15-SNAPSHOT-sources.jar>
to /home/hudson/hudson/jobs/myfaces-current11/modules/org.apache.myfaces.shared$myfaces-shared-tomahawk/builds/2013-05-10_00-23-48/archive/org.apache.myfaces.shared/myfaces-shared-tomahawk/2.0.15-SNAPSHOT/myfaces-shared-tomahawk-2.0.15-SNAPSHOT-sources.jar
[INFO] ------------------------------------------------------------------------
[INFO] Building Apache MyFaces Shared - Orchestra
[INFO]    task-segment: [install]
[INFO] ------------------------------------------------------------------------
[INFO] [dependency:unpack {execution: unpack-sources}]
[INFO] Configured Artifact: org.apache.myfaces.shared:myfaces-shared-core:sources:2.0.15-SNAPSHOT:jar
[INFO] myfaces-shared-core-2.0.15-SNAPSHOT-sources.jar already unpacked.
[WARNING] DEPRECATED [sourceRoot]: Use the build-helper-maven-plugin to bind source directories
[WARNING] DEPRECATED [tasks]: Use target instead
[INFO] [antrun:run {execution: refactor-shared-sources}]
[WARNING] Parameter tasks is deprecated, use target instead
[INFO] Executing tasks

main:

refactor-java-sources:
[INFO] Executed tasks
[INFO] Registering compile source root <https://builds.apache.org/job/myfaces-current11/ws/current11/shared/shared-orchestra/target/refactored-shared-sources/main/java>
[INFO] [remote-resources:process {execution: default}]
[WARNING] DEPRECATED [tasks]: Use target instead
[INFO] [antrun:run {execution: refactor-resources}]
[WARNING] Parameter tasks is deprecated, use target instead
[INFO] Executing tasks

main:

refactor-resources:
[INFO] Executed tasks
[debug] execute contextualize
[INFO] [resources:resources {execution: default-resources}]
[INFO] Using 'UTF-8' encoding to copy filtered resources.
[INFO] Copying 2 resources
[INFO] Copying 3 resources
[INFO] [compiler:compile {execution: default-compile}]
[INFO] Nothing to compile - all classes are up to date
[debug] execute contextualize
[INFO] [resources:testResources {execution: default-testResources}]
[INFO] Using 'UTF-8' encoding to copy filtered resources.
[INFO] skip non existing resourceDirectory <https://builds.apache.org/job/myfaces-current11/ws/current11/shared/shared-orchestra/src/test/resources>
[INFO] Copying 3 resources
[INFO] [compiler:testCompile {execution: default-testCompile}]
[INFO] No sources to compile
[INFO] [surefire:test {execution: default-test}]
[INFO] Surefire report directory: <https://builds.apache.org/job/myfaces-current11/ws/current11/shared/shared-orchestra/target/surefire-reports>

-------------------------------------------------------
 T E S T S
-------------------------------------------------------

Results :

Tests run: 0, Failures: 0, Errors: 0, Skipped: 0

[JENKINS] Recording test results
[INFO] [jar:jar {execution: default-jar}]
[INFO] Building jar: <https://builds.apache.org/job/myfaces-current11/ws/current11/shared/shared-orchestra/target/myfaces-shared-orchestra-2.0.15-SNAPSHOT.jar>
[INFO] Preparing source:jar
[WARNING] Removing: jar from forked lifecycle, to prevent recursive invocation.
[JENKINS] Archiving <https://builds.apache.org/job/myfaces-current11/ws/current11/shared/shared-orchestra/pom.xml>
to /home/hudson/hudson/jobs/myfaces-current11/modules/org.apache.myfaces.shared$myfaces-shared-orchestra/builds/2013-05-10_00-23-49/archive/org.apache.myfaces.shared/myfaces-shared-orchestra/2.0.15-SNAPSHOT/myfaces-shared-orchestra-2.0.15-SNAPSHOT.pom
[JENKINS] Archiving <https://builds.apache.org/job/myfaces-current11/ws/current11/shared/shared-orchestra/target/myfaces-shared-orchestra-2.0.15-SNAPSHOT.jar>
to /home/hudson/hudson/jobs/myfaces-current11/modules/org.apache.myfaces.shared$myfaces-shared-orchestra/builds/2013-05-10_00-23-49/archive/org.apache.myfaces.shared/myfaces-shared-orchestra/2.0.15-SNAPSHOT/myfaces-shared-orchestra-2.0.15-SNAPSHOT.jar
[INFO] [dependency:unpack {execution: unpack-sources}]
[INFO] Configured Artifact: org.apache.myfaces.shared:myfaces-shared-core:sources:2.0.15-SNAPSHOT:jar
[INFO] myfaces-shared-core-2.0.15-SNAPSHOT-sources.jar already unpacked.
[INFO] [source:jar {execution: attach-source}]
[INFO] ------------------------------------------------------------------------
[ERROR] FATAL ERROR
[INFO] ------------------------------------------------------------------------
[INFO] null
error=12, Not enough space
[INFO] ------------------------------------------------------------------------
[INFO] Trace
java.lang.reflect.UndeclaredThrowableException
	at org.codehaus.plexus.archiver.AbstractArchiver.getFiles(AbstractArchiver.java:519)
	at org.apache.maven.plugin.source.AbstractSourceJarMojo.packageSources(AbstractSourceJarMojo.java:262)
	at org.apache.maven.plugin.source.AbstractSourceJarMojo.packageSources(AbstractSourceJarMojo.java:232)
	at org.apache.maven.plugin.source.AbstractSourceJarMojo.execute(AbstractSourceJarMojo.java:201)
	at org.apache.maven.plugin.DefaultPluginManager.executeMojo(DefaultPluginManager.java:490)
	at hudson.maven.agent.PluginManagerInterceptor.executeMojo(PluginManagerInterceptor.java:182)
	at org.apache.maven.lifecycle.DefaultLifecycleExecutor.executeGoals(DefaultLifecycleExecutor.java:694)
	at org.apache.maven.lifecycle.DefaultLifecycleExecutor.executeGoalWithLifecycle(DefaultLifecycleExecutor.java:556)
	at org.apache.maven.lifecycle.DefaultLifecycleExecutor.executeGoal(DefaultLifecycleExecutor.java:535)
	at org.apache.maven.lifecycle.DefaultLifecycleExecutor.executeGoalAndHandleFailures(DefaultLifecycleExecutor.java:387)
	at org.apache.maven.lifecycle.DefaultLifecycleExecutor.executeTaskSegments(DefaultLifecycleExecutor.java:348)
	at org.apache.maven.lifecycle.DefaultLifecycleExecutor.execute(DefaultLifecycleExecutor.java:180)
	at org.apache.maven.lifecycle.LifecycleExecutorInterceptor.execute(LifecycleExecutorInterceptor.java:65)
	at org.apache.maven.DefaultMaven.doExecute(DefaultMaven.java:328)
	at org.apache.maven.DefaultMaven.execute(DefaultMaven.java:138)
	at org.apache.maven.cli.MavenCli.main(MavenCli.java:362)
	at sun.reflect.NativeMethodAccessorImpl.invoke0(Native Method)
	at sun.reflect.NativeMethodAccessorImpl.invoke(NativeMethodAccessorImpl.java:39)
	at sun.reflect.DelegatingMethodAccessorImpl.invoke(DelegatingMethodAccessorImpl.java:25)
	at java.lang.reflect.Method.invoke(Method.java:597)
	at org.codehaus.classworlds.Launcher.launchEnhanced(Launcher.java:315)
	at org.codehaus.classworlds.Launcher.launch(Launcher.java:255)
	at hudson.maven.agent.Main.launch(Main.java:185)
	at hudson.maven.MavenBuilder.call(MavenBuilder.java:154)
	at hudson.maven.Maven2Builder.call(Maven2Builder.java:79)
	at hudson.maven.Maven2Builder.call(Maven2Builder.java:55)
	at hudson.remoting.UserRequest.perform(UserRequest.java:118)
	at hudson.remoting.UserRequest.perform(UserRequest.java:48)
	at hudson.remoting.Request$2.run(Request.java:326)
	at hudson.remoting.InterceptingExecutorService$1.call(InterceptingExecutorService.java:72)
	at java.util.concurrent.FutureTask$Sync.innerRun(FutureTask.java:303)
	at java.util.concurrent.FutureTask.run(FutureTask.java:138)
	at java.util.concurrent.ThreadPoolExecutor$Worker.runTask(ThreadPoolExecutor.java:886)
	at java.util.concurrent.ThreadPoolExecutor$Worker.run(ThreadPoolExecutor.java:908)
	at java.lang.Thread.run(Thread.java:662)
Caused by: org.codehaus.plexus.archiver.ArchiverException: Failed to retrieve numeric file
attributes using: '/bin/sh -c ls -1nlaR <https://builds.apache.org/job/myfaces-current11/ws/current11/shared/shared-orchestra/target/maven-shared-archive-resources'>
	at org.codehaus.plexus.archiver.AbstractArchiver$1.hasNext(AbstractArchiver.java:427)
	at org.codehaus.plexus.archiver.AbstractArchiver.getFiles(AbstractArchiver.java:507)
	... 34 more
Caused by: java.io.IOException: Failed to retrieve numeric file attributes using: '/bin/sh
-c ls -1nlaR <https://builds.apache.org/job/myfaces-current11/ws/current11/shared/shared-orchestra/target/maven-shared-archive-resources'>
	at org.codehaus.plexus.components.io.attributes.PlexusIoResourceAttributeUtils.executeLs(PlexusIoResourceAttributeUtils.java:287)
	at org.codehaus.plexus.components.io.attributes.PlexusIoResourceAttributeUtils.getFileAttributesByPath(PlexusIoResourceAttributeUtils.java:223)
	at org.codehaus.plexus.components.io.attributes.PlexusIoResourceAttributeUtils.getFileAttributesByPath(PlexusIoResourceAttributeUtils.java:189)
	at org.codehaus.plexus.components.io.resources.PlexusIoFileResourceCollection.getResources(PlexusIoFileResourceCollection.java:175)
	at org.codehaus.plexus.archiver.AbstractArchiver$1.hasNext(AbstractArchiver.java:423)
	... 35 more
Caused by: org.codehaus.plexus.util.cli.CommandLineException: Error while executing process.
	at org.codehaus.plexus.util.cli.Commandline.execute(Commandline.java:656)
	at org.codehaus.plexus.util.cli.CommandLineUtils.executeCommandLine(CommandLineUtils.java:144)
	at org.codehaus.plexus.util.cli.CommandLineUtils.executeCommandLine(CommandLineUtils.java:107)
	at org.codehaus.plexus.components.io.attributes.PlexusIoResourceAttributeUtils.executeLs(PlexusIoResourceAttributeUtils.java:277)
	... 39 more
Caused by: java.io.IOException: Cannot run program "/bin/sh": error=12, Not enough space
	at java.lang.ProcessBuilder.start(ProcessBuilder.java:460)
	at java.lang.Runtime.exec(Runtime.java:593)
	at java.lang.Runtime.exec(Runtime.java:509)
	at org.codehaus.plexus.util.cli.Commandline.execute(Commandline.java:636)
	... 42 more
Caused by: java.io.IOException: error=12, Not enough space
	at java.lang.UNIXProcess.forkAndExec(Native Method)
	at java.lang.UNIXProcess.<init>(UNIXProcess.java:53)
	at java.lang.ProcessImpl.start(ProcessImpl.java:65)
	at java.lang.ProcessBuilder.start(ProcessBuilder.java:453)
	... 45 more
[INFO] ------------------------------------------------------------------------
[INFO] Total time: 13 minutes 44 seconds
[INFO] Finished at: Fri May 10 00:41:47 GMT+00:00 2013
[INFO] Final Memory: 79M/413M
[INFO] ------------------------------------------------------------------------
channel stopped

Mime
View raw message