myfaces-commits mailing list archives

Site index · List index
Message view « Date » · « Thread »
Top « Date » · « Thread »
From Apache Jenkins Server <jenk...@builds.apache.org>
Subject Build failed in Jenkins: myfaces-orchestra-core12 #1040
Date Thu, 09 May 2013 12:11:05 GMT
See <https://builds.apache.org/job/myfaces-orchestra-core12/1040/>

------------------------------------------
Started by upstream project "maven-plugins" build number 1532
originally caused by: 
 Started by an SCM change
Building remotely on solaris1 in workspace <https://builds.apache.org/job/myfaces-orchestra-core12/ws/>
Updating http://svn.apache.org/repos/asf/myfaces/orchestra/trunk/core12
At revision 1480596
no change for http://svn.apache.org/repos/asf/myfaces/orchestra/trunk/core12 since the previous
build
Parsing POMs
[core12] $ /zonestorage/hudson_solaris/home/hudson/hudson-slave/tools/jdk6-u26-auto-install//bin/java
-cp /export/home/hudson/hudson-slave/maven-agent.jar:/export/home/hudson/hudson-slave/classworlds.jar
hudson.maven.agent.Main /home/hudson/tools/maven/apache-maven-2.2.1 /zonestorage/hudson_solaris/home/hudson/hudson-slave/slave.jar
/export/home/hudson/hudson-slave/maven-interceptor.jar 42190 /export/home/hudson/hudson-slave/maven2.1-interceptor.jar
<===[JENKINS REMOTING CAPACITY]===>channel started
   log4j:WARN No appenders could be found for logger (org.apache.commons.beanutils.converters.BooleanConverter).
log4j:WARN Please initialize the log4j system properly.
Executing Maven:  -B -f <https://builds.apache.org/job/myfaces-orchestra-core12/ws/core12/pom.xml>
-Dmaven.repo.local=/export/home/hudson/hudson-slave/maven-repositories/0 clean install deploy
[INFO] Scanning for projects...
[INFO] ------------------------------------------------------------------------
[INFO] Building MyFaces Orchestra Core 12
[INFO]    task-segment: [clean, install, deploy]
[INFO] ------------------------------------------------------------------------
[INFO] [clean:clean {execution: default-clean}]
[INFO] Deleting <https://builds.apache.org/job/myfaces-orchestra-core12/ws/core12/target>
[WARNING] DEPRECATED [tasks]: Use target instead
[INFO] [antrun:run {execution: javadoc.resources}]
[WARNING] Parameter tasks is deprecated, use target instead
[INFO] Executing tasks

main:
     [copy] Copying 2 files to <https://builds.apache.org/job/myfaces-orchestra-core12/ws/core12/target/apidocs/META-INF>
[INFO] Executed tasks
[INFO] [build-helper:add-source {execution: add-source}]
[INFO] Source directory: <https://builds.apache.org/job/myfaces-orchestra-core12/ws/core12/target/shared_sources>
added.
[INFO] Source directory: <https://builds.apache.org/job/myfaces-orchestra-core12/ws/core12/target/orchestra11_sources>
added.
[INFO] [myfaces-builder:unpack {execution: unpack-orchestra11}]
[INFO] Adding: org/apache/myfaces/orchestra/lib/jsf/_PortletFacesContextWrapper.java
[INFO] Adding: org/apache/myfaces/orchestra/lib/jsf/PortletExternalContextWrapper.java
[INFO] Adding: org/apache/myfaces/orchestra/lib/jsf/_FacesContextWrapper.java
[INFO] Configured Artifact: org.apache.myfaces.orchestra:myfaces-orchestra-core:sources:1.6-SNAPSHOT:jar
[INFO] snapshot org.apache.myfaces.orchestra:myfaces-orchestra-core:1.6-SNAPSHOT: checking
for updates from apache.snapshots
Downloading: http://repository.apache.org/snapshots/org/apache/myfaces/orchestra/myfaces-orchestra-core/1.6-SNAPSHOT/myfaces-orchestra-core-1.6-20130509.105222-1647-sources.jar
466K downloaded  (myfaces-orchestra-core-1.6-20130509.105222-1647-sources.jar)
[INFO] Unpacking /export/home/hudson/hudson-slave/maven-repositories/0/org/apache/myfaces/orchestra/myfaces-orchestra-core/1.6-SNAPSHOT/myfaces-orchestra-core-1.6-SNAPSHOT-sources.jar
to <https://builds.apache.org/job/myfaces-orchestra-core12/ws/core12/target/orchestra11_sources>
with includes "**/*.java" and excludes "**/*.class,**/org/apache/myfaces/shared_orchestra/**,**/META-INF/**,org/apache/myfaces/orchestra/lib/jsf/_PortletFacesContextWrapper.java,org/apache/myfaces/orchestra/lib/jsf/PortletExternalContextWrapper.java,org/apache/myfaces/orchestra/lib/jsf/_FacesContextWrapper.java"
[INFO] [dependency:unpack {execution: unpack-shared-impl-sources}]
[INFO] Configured Artifact: org.apache.myfaces.shared:myfaces-shared-orchestra:sources:2.0.13:jar
[INFO] Unpacking /export/home/hudson/hudson-slave/maven-repositories/0/org/apache/myfaces/shared/myfaces-shared-orchestra/2.0.13/myfaces-shared-orchestra-2.0.13-sources.jar
to <https://builds.apache.org/job/myfaces-orchestra-core12/ws/core12/target/shared_sources>
with includes "" and excludes "META-INF/*"
[INFO] [xslt:transform {execution: default}]
[ERROR] XSL file does not exist: <https://builds.apache.org/job/myfaces-orchestra-core12/ws/core12/src/main/tld/misc/resolve_entities.xsl>
[INFO] [remote-resources:process {execution: default}]
[INFO] [myfaces-builder:unpack {execution: unpack-orchestra-resources}]
[INFO] Configured Artifact: org.apache.myfaces.orchestra:myfaces-orchestra-core:1.6-SNAPSHOT:jar
Downloading: http://repository.apache.org/snapshots/org/apache/myfaces/orchestra/myfaces-orchestra-core/1.6-SNAPSHOT/myfaces-orchestra-core-1.6-20130509.105222-1647.jar
405K downloaded  (myfaces-orchestra-core-1.6-20130509.105222-1647.jar)
[INFO] Unpacking /export/home/hudson/hudson-slave/maven-repositories/0/org/apache/myfaces/orchestra/myfaces-orchestra-core/1.6-SNAPSHOT/myfaces-orchestra-core-1.6-SNAPSHOT.jar
to <https://builds.apache.org/job/myfaces-orchestra-core12/ws/core12/target/orchestra11_resources>
with includes "" and excludes "**/*.class,**/META-INF/maven/**,**/META-INF/MANIFEST.MF,"
[debug] execute contextualize
[INFO] [resources:resources {execution: default-resources}]
[INFO] Using 'UTF-8' encoding to copy filtered resources.
[INFO] Copying 0 resource
[INFO] Copying 12 resources
[INFO] Copying 3 resources
[INFO] [compiler:compile {execution: default-compile}]
[INFO] Compiling 230 source files to <https://builds.apache.org/job/myfaces-orchestra-core12/ws/core12/target/classes>
[debug] execute contextualize
[INFO] [resources:testResources {execution: default-testResources}]
[INFO] Using 'UTF-8' encoding to copy filtered resources.
[INFO] skip non existing resourceDirectory <https://builds.apache.org/job/myfaces-orchestra-core12/ws/core12/src/test/resources>
[INFO] Copying 3 resources
[INFO] [compiler:testCompile {execution: default-testCompile}]
[INFO] No sources to compile
[INFO] [surefire:test {execution: default-test}]
[INFO] Surefire report directory: <https://builds.apache.org/job/myfaces-orchestra-core12/ws/core12/target/surefire-reports>

-------------------------------------------------------
 T E S T S
-------------------------------------------------------

Results :

Tests run: 0, Failures: 0, Errors: 0, Skipped: 0

[JENKINS] Recording test results
[INFO] [jar:jar {execution: default-jar}]
[INFO] Building jar: <https://builds.apache.org/job/myfaces-orchestra-core12/ws/core12/target/myfaces-orchestra-core12-1.6-SNAPSHOT.jar>
[INFO] Preparing source:jar
[WARNING] Removing: jar from forked lifecycle, to prevent recursive invocation.
[WARNING] DEPRECATED [tasks]: Use target instead
[JENKINS] Archiving <https://builds.apache.org/job/myfaces-orchestra-core12/ws/core12/pom.xml>
to /home/hudson/hudson/jobs/myfaces-orchestra-core12/modules/org.apache.myfaces.orchestra$myfaces-orchestra-core12/builds/2013-05-09_12-02-35/archive/org.apache.myfaces.orchestra/myfaces-orchestra-core12/1.6-SNAPSHOT/myfaces-orchestra-core12-1.6-SNAPSHOT.pom
[JENKINS] Archiving <https://builds.apache.org/job/myfaces-orchestra-core12/ws/core12/target/myfaces-orchestra-core12-1.6-SNAPSHOT.jar>
to /home/hudson/hudson/jobs/myfaces-orchestra-core12/modules/org.apache.myfaces.orchestra$myfaces-orchestra-core12/builds/2013-05-09_12-02-35/archive/org.apache.myfaces.orchestra/myfaces-orchestra-core12/1.6-SNAPSHOT/myfaces-orchestra-core12-1.6-SNAPSHOT.jar
[INFO] [antrun:run {execution: javadoc.resources}]
[WARNING] Parameter tasks is deprecated, use target instead
[INFO] Executing tasks

main:
[INFO] Executed tasks
[INFO] [build-helper:add-source {execution: add-source}]
[INFO] Source directory: <https://builds.apache.org/job/myfaces-orchestra-core12/ws/core12/target/shared_sources>
added.
[INFO] Source directory: <https://builds.apache.org/job/myfaces-orchestra-core12/ws/core12/target/orchestra11_sources>
added.
[INFO] [myfaces-builder:unpack {execution: unpack-orchestra11}]
[INFO] Adding: org/apache/myfaces/orchestra/lib/jsf/_PortletFacesContextWrapper.java
[INFO] Adding: org/apache/myfaces/orchestra/lib/jsf/PortletExternalContextWrapper.java
[INFO] Adding: org/apache/myfaces/orchestra/lib/jsf/_FacesContextWrapper.java
[INFO] Configured Artifact: org.apache.myfaces.orchestra:myfaces-orchestra-core:sources:1.6-SNAPSHOT:jar
[INFO] Unpacking /export/home/hudson/hudson-slave/maven-repositories/0/org/apache/myfaces/orchestra/myfaces-orchestra-core/1.6-SNAPSHOT/myfaces-orchestra-core-1.6-SNAPSHOT-sources.jar
to <https://builds.apache.org/job/myfaces-orchestra-core12/ws/core12/target/orchestra11_sources>
with includes "**/*.java" and excludes "**/*.class,**/org/apache/myfaces/shared_orchestra/**,**/META-INF/**,org/apache/myfaces/orchestra/lib/jsf/_PortletFacesContextWrapper.java,org/apache/myfaces/orchestra/lib/jsf/PortletExternalContextWrapper.java,org/apache/myfaces/orchestra/lib/jsf/_FacesContextWrapper.java"
[INFO] [source:jar {execution: attach-source}]
[INFO] ------------------------------------------------------------------------
[ERROR] FATAL ERROR
[INFO] ------------------------------------------------------------------------
[INFO] null
error=12, Not enough space
[INFO] ------------------------------------------------------------------------
[INFO] Trace
java.lang.reflect.UndeclaredThrowableException
	at org.codehaus.plexus.archiver.AbstractArchiver.getFiles(AbstractArchiver.java:519)
	at org.apache.maven.plugin.source.AbstractSourceJarMojo.packageSources(AbstractSourceJarMojo.java:262)
	at org.apache.maven.plugin.source.AbstractSourceJarMojo.packageSources(AbstractSourceJarMojo.java:232)
	at org.apache.maven.plugin.source.AbstractSourceJarMojo.execute(AbstractSourceJarMojo.java:201)
	at org.apache.maven.plugin.DefaultPluginManager.executeMojo(DefaultPluginManager.java:490)
	at hudson.maven.agent.PluginManagerInterceptor.executeMojo(PluginManagerInterceptor.java:182)
	at org.apache.maven.lifecycle.DefaultLifecycleExecutor.executeGoals(DefaultLifecycleExecutor.java:694)
	at org.apache.maven.lifecycle.DefaultLifecycleExecutor.executeGoalWithLifecycle(DefaultLifecycleExecutor.java:556)
	at org.apache.maven.lifecycle.DefaultLifecycleExecutor.executeGoal(DefaultLifecycleExecutor.java:535)
	at org.apache.maven.lifecycle.DefaultLifecycleExecutor.executeGoalAndHandleFailures(DefaultLifecycleExecutor.java:387)
	at org.apache.maven.lifecycle.DefaultLifecycleExecutor.executeTaskSegments(DefaultLifecycleExecutor.java:348)
	at org.apache.maven.lifecycle.DefaultLifecycleExecutor.execute(DefaultLifecycleExecutor.java:180)
	at org.apache.maven.lifecycle.LifecycleExecutorInterceptor.execute(LifecycleExecutorInterceptor.java:65)
	at org.apache.maven.DefaultMaven.doExecute(DefaultMaven.java:328)
	at org.apache.maven.DefaultMaven.execute(DefaultMaven.java:138)
	at org.apache.maven.cli.MavenCli.main(MavenCli.java:362)
	at sun.reflect.NativeMethodAccessorImpl.invoke0(Native Method)
	at sun.reflect.NativeMethodAccessorImpl.invoke(NativeMethodAccessorImpl.java:39)
	at sun.reflect.DelegatingMethodAccessorImpl.invoke(DelegatingMethodAccessorImpl.java:25)
	at java.lang.reflect.Method.invoke(Method.java:597)
	at org.codehaus.classworlds.Launcher.launchEnhanced(Launcher.java:315)
	at org.codehaus.classworlds.Launcher.launch(Launcher.java:255)
	at hudson.maven.agent.Main.launch(Main.java:185)
	at hudson.maven.MavenBuilder.call(MavenBuilder.java:154)
	at hudson.maven.Maven2Builder.call(Maven2Builder.java:79)
	at hudson.maven.Maven2Builder.call(Maven2Builder.java:55)
	at hudson.remoting.UserRequest.perform(UserRequest.java:118)
	at hudson.remoting.UserRequest.perform(UserRequest.java:48)
	at hudson.remoting.Request$2.run(Request.java:326)
	at hudson.remoting.InterceptingExecutorService$1.call(InterceptingExecutorService.java:72)
	at java.util.concurrent.FutureTask$Sync.innerRun(FutureTask.java:303)
	at java.util.concurrent.FutureTask.run(FutureTask.java:138)
	at java.util.concurrent.ThreadPoolExecutor$Worker.runTask(ThreadPoolExecutor.java:886)
	at java.util.concurrent.ThreadPoolExecutor$Worker.run(ThreadPoolExecutor.java:908)
	at java.lang.Thread.run(Thread.java:662)
Caused by: org.codehaus.plexus.archiver.ArchiverException: Failed to retrieve numeric file
attributes using: '/bin/sh -c ls -1nlaR <https://builds.apache.org/job/myfaces-orchestra-core12/ws/core12/target/maven-shared-archive-resources'>
	at org.codehaus.plexus.archiver.AbstractArchiver$1.hasNext(AbstractArchiver.java:427)
	at org.codehaus.plexus.archiver.AbstractArchiver.getFiles(AbstractArchiver.java:507)
	... 34 more
Caused by: java.io.IOException: Failed to retrieve numeric file attributes using: '/bin/sh
-c ls -1nlaR <https://builds.apache.org/job/myfaces-orchestra-core12/ws/core12/target/maven-shared-archive-resources'>
	at org.codehaus.plexus.components.io.attributes.PlexusIoResourceAttributeUtils.executeLs(PlexusIoResourceAttributeUtils.java:287)
	at org.codehaus.plexus.components.io.attributes.PlexusIoResourceAttributeUtils.getFileAttributesByPath(PlexusIoResourceAttributeUtils.java:223)
	at org.codehaus.plexus.components.io.attributes.PlexusIoResourceAttributeUtils.getFileAttributesByPath(PlexusIoResourceAttributeUtils.java:189)
	at org.codehaus.plexus.components.io.resources.PlexusIoFileResourceCollection.getResources(PlexusIoFileResourceCollection.java:175)
	at org.codehaus.plexus.archiver.AbstractArchiver$1.hasNext(AbstractArchiver.java:423)
	... 35 more
Caused by: org.codehaus.plexus.util.cli.CommandLineException: Error while executing process.
	at org.codehaus.plexus.util.cli.Commandline.execute(Commandline.java:656)
	at org.codehaus.plexus.util.cli.CommandLineUtils.executeCommandLine(CommandLineUtils.java:144)
	at org.codehaus.plexus.util.cli.CommandLineUtils.executeCommandLine(CommandLineUtils.java:107)
	at org.codehaus.plexus.components.io.attributes.PlexusIoResourceAttributeUtils.executeLs(PlexusIoResourceAttributeUtils.java:277)
	... 39 more
Caused by: java.io.IOException: Cannot run program "/bin/sh": error=12, Not enough space
	at java.lang.ProcessBuilder.start(ProcessBuilder.java:460)
	at java.lang.Runtime.exec(Runtime.java:593)
	at java.lang.Runtime.exec(Runtime.java:509)
	at org.codehaus.plexus.util.cli.Commandline.execute(Commandline.java:636)
	... 42 more
Caused by: java.io.IOException: error=12, Not enough space
	at java.lang.UNIXProcess.forkAndExec(Native Method)
	at java.lang.UNIXProcess.<init>(UNIXProcess.java:53)
	at java.lang.ProcessImpl.start(ProcessImpl.java:65)
	at java.lang.ProcessBuilder.start(ProcessBuilder.java:453)
	... 45 more
[INFO] ------------------------------------------------------------------------
[INFO] Total time: 4 minutes 28 seconds
[INFO] Finished at: Thu May 09 12:10:58 GMT+00:00 2013
[INFO] Final Memory: 52M/398M
[INFO] ------------------------------------------------------------------------
channel stopped

Mime
View raw message