myfaces-commits mailing list archives

Site index · List index
Message view « Date » · « Thread »
Top « Date » · « Thread »
From Apache Jenkins Server <jenk...@builds.apache.org>
Subject Build failed in Jenkins: myfaces-current-2.0 #1860
Date Wed, 08 May 2013 14:18:08 GMT
See <https://builds.apache.org/job/myfaces-current-2.0/1860/>

------------------------------------------
[...truncated 996 lines...]
WARNING: No Renderer found for component {Component-Path : [Class: javax.faces.component.UIViewRoot,ViewId:
null][Class: javax.faces.component.UIInput,Id: testId]} (component-family=javax.faces.Input,
renderer-type=javax.faces.Text)
No Renderer found for component {Component-Path : [Class: javax.faces.component.UIViewRoot,ViewId:
null][Class: javax.faces.component.UIInput,Id: testId]} (component-family=javax.faces.Input,
renderer-type=javax.faces.Text)
May 8, 2013 2:11:34 PM javax.faces.component.UIComponentBase getRenderer
WARNING: No Renderer found for component {Component-Path : [Class: javax.faces.component.UIViewRoot,ViewId:
null][Class: javax.faces.component.UIInput,Id: testId]} (component-family=javax.faces.Input,
renderer-type=javax.faces.Text)
No Renderer found for component {Component-Path : [Class: javax.faces.component.UIInput,Id:
testId]} (component-family=javax.faces.Input, renderer-type=javax.faces.Text)
May 8, 2013 2:11:34 PM javax.faces.component.UIComponentBase getRenderer
WARNING: No Renderer found for component {Component-Path : [Class: javax.faces.component.UIInput,Id:
testId]} (component-family=javax.faces.Input, renderer-type=javax.faces.Text)
No Renderer found for component {Component-Path : [Class: javax.faces.component.UIInput,Id:
testId]} (component-family=javax.faces.Input, renderer-type=javax.faces.Text)
May 8, 2013 2:11:34 PM javax.faces.component.UIComponentBase getRenderer
WARNING: No Renderer found for component {Component-Path : [Class: javax.faces.component.UIInput,Id:
testId]} (component-family=javax.faces.Input, renderer-type=javax.faces.Text)
No Renderer found for component {Component-Path : [Class: javax.faces.component.UIInput,Id:
testId]} (component-family=javax.faces.Input, renderer-type=javax.faces.Text)
May 8, 2013 2:11:34 PM javax.faces.component.UIComponentBase getRenderer
WARNING: No Renderer found for component {Component-Path : [Class: javax.faces.component.UIInput,Id:
testId]} (component-family=javax.faces.Input, renderer-type=javax.faces.Text)
No Renderer found for component {Component-Path : [Class: javax.faces.component.UIInput,Id:
testId]} (component-family=javax.faces.Input, renderer-type=javax.faces.Text)
May 8, 2013 2:11:34 PM javax.faces.component.UIComponentBase getRenderer
WARNING: No Renderer found for component {Component-Path : [Class: javax.faces.component.UIInput,Id:
testId]} (component-family=javax.faces.Input, renderer-type=javax.faces.Text)
No Renderer found for component {Component-Path : [Class: javax.faces.component.UIInput,Id:
testId]} (component-family=javax.faces.Input, renderer-type=javax.faces.Text)
May 8, 2013 2:11:34 PM javax.faces.component.UIComponentBase getRenderer
WARNING: No Renderer found for component {Component-Path : [Class: javax.faces.component.UIInput,Id:
testId]} (component-family=javax.faces.Input, renderer-type=javax.faces.Text)
descriptor(class=javax.faces.component._SharedRendererUtilsTest$Bean, name=pojoCollectionValue
  Found BeanInfo java.beans.GenericBeanInfo@b57e9a
  Found PropertyDescriptor java.beans.PropertyDescriptor@9b3e58aedescriptor(class=javax.faces.component._SharedRendererUtilsTest$Bean,
name=pojoCollectionValue
  Found BeanInfo java.beans.GenericBeanInfo@b57e9a
  Found PropertyDescriptor java.beans.PropertyDescriptor@9b3e58aedescriptor(class=javax.faces.component._SharedRendererUtilsTest$Bean,
name=pojoArrayValue
  Found BeanInfo java.beans.GenericBeanInfo@b57e9a
  Found PropertyDescriptor java.beans.PropertyDescriptor@f94358bbdescriptor(class=javax.faces.component._SharedRendererUtilsTest$Bean,
name=pojoArrayValue
  Found BeanInfo java.beans.GenericBeanInfo@b57e9a
  Found PropertyDescriptor java.beans.PropertyDescriptor@f94358bbdescriptor(class=javax.faces.component._SharedRendererUtilsTest$Bean,
name=pojoCollectionValue
  Found BeanInfo java.beans.GenericBeanInfo@b57e9a
  Found PropertyDescriptor java.beans.PropertyDescriptor@9b3e58aedescriptor(class=javax.faces.component._SharedRendererUtilsTest$Bean,
name=pojoCollectionValue
  Found BeanInfo java.beans.GenericBeanInfo@b57e9a
  Found PropertyDescriptor java.beans.PropertyDescriptor@9b3e58aedescriptor(class=javax.faces.component._SharedRendererUtilsTest$Bean,
name=intArrayValue
  Found BeanInfo java.beans.GenericBeanInfo@b57e9a
  Found PropertyDescriptor java.beans.PropertyDescriptor@7558c272descriptor(class=javax.faces.component._SharedRendererUtilsTest$Bean,
name=floatArrayValue
  Found BeanInfo java.beans.GenericBeanInfo@b57e9a
  Found PropertyDescriptor java.beans.PropertyDescriptor@96b08772No Renderer found for component
{Component-Path : [Class: javax.faces.component.UIInput,Id: j_id__v_0]} (component-family=javax.faces.Input,
renderer-type=javax.faces.Text)
May 8, 2013 2:11:35 PM javax.faces.component.UIComponentBase getRenderer
WARNING: No Renderer found for component {Component-Path : [Class: javax.faces.component.UIInput,Id:
j_id__v_0]} (component-family=javax.faces.Input, renderer-type=javax.faces.Text)
No Renderer found for component {Component-Path : [Class: javax.faces.component.UIInput,Id:
j_id__v_0]} (component-family=javax.faces.Input, renderer-type=javax.faces.Text)
May 8, 2013 2:11:35 PM javax.faces.component.UIComponentBase getRenderer
WARNING: No Renderer found for component {Component-Path : [Class: javax.faces.component.UIInput,Id:
j_id__v_0]} (component-family=javax.faces.Input, renderer-type=javax.faces.Text)
No Renderer found for component {Component-Path : [Class: javax.faces.component.UIInput,Id:
j_id__v_0]} (component-family=javax.faces.Input, renderer-type=javax.faces.Text)
May 8, 2013 2:11:35 PM javax.faces.component.UIComponentBase getRenderer
WARNING: No Renderer found for component {Component-Path : [Class: javax.faces.component.UIInput,Id:
j_id__v_0]} (component-family=javax.faces.Input, renderer-type=javax.faces.Text)
No Renderer found for component {Component-Path : [Class: javax.faces.component.UIInput,Id:
j_id__v_0]} (component-family=javax.faces.Input, renderer-type=javax.faces.Text)
May 8, 2013 2:11:35 PM javax.faces.component.UIComponentBase getRenderer
WARNING: No Renderer found for component {Component-Path : [Class: javax.faces.component.UIInput,Id:
j_id__v_0]} (component-family=javax.faces.Input, renderer-type=javax.faces.Text)
No Renderer found for component {Component-Path : [Class: javax.faces.component.UIInput,Id:
j_id__v_0]} (component-family=javax.faces.Input, renderer-type=javax.faces.Text)
May 8, 2013 2:11:35 PM javax.faces.component.UIComponentBase getRenderer
WARNING: No Renderer found for component {Component-Path : [Class: javax.faces.component.UIInput,Id:
j_id__v_0]} (component-family=javax.faces.Input, renderer-type=javax.faces.Text)
No Renderer found for component {Component-Path : [Class: javax.faces.component.UIInput,Id:
j_id__v_0]} (component-family=javax.faces.Input, renderer-type=javax.faces.Text)
May 8, 2013 2:11:35 PM javax.faces.component.UIComponentBase getRenderer
WARNING: No Renderer found for component {Component-Path : [Class: javax.faces.component.UIInput,Id:
j_id__v_0]} (component-family=javax.faces.Input, renderer-type=javax.faces.Text)
No Renderer found for component {Component-Path : [Class: javax.faces.component.UIInput,Id:
j_id__v_0]} (component-family=javax.faces.Input, renderer-type=javax.faces.Text)
May 8, 2013 2:11:35 PM javax.faces.component.UIComponentBase getRenderer
WARNING: No Renderer found for component {Component-Path : [Class: javax.faces.component.UIInput,Id:
j_id__v_0]} (component-family=javax.faces.Input, renderer-type=javax.faces.Text)
No Renderer found for component {Component-Path : [Class: javax.faces.component.html.HtmlInputText,Id:
testId]} (component-family=javax.faces.Input, renderer-type=javax.faces.Text)
May 8, 2013 2:11:35 PM javax.faces.component.UIComponentBase getRenderer
WARNING: No Renderer found for component {Component-Path : [Class: javax.faces.component.html.HtmlInputText,Id:
testId]} (component-family=javax.faces.Input, renderer-type=javax.faces.Text)
Tests run: 323, Failures: 0, Errors: 0, Skipped: 0, Time elapsed: 3.667 sec

Results :

Tests run: 323, Failures: 0, Errors: 0, Skipped: 0

[JENKINS] Recording test results
[INFO] [jar:jar {execution: default-jar}]
[INFO] Building jar: <https://builds.apache.org/job/myfaces-current-2.0/ws/current20/core/api/target/myfaces-api-2.0.18-SNAPSHOT.jar>
[INFO] Preparing source:jar
[WARNING] Removing: jar from forked lifecycle, to prevent recursive invocation.
[JENKINS] Archiving <https://builds.apache.org/job/myfaces-current-2.0/ws/current20/core/api/pom.xml>
to /home/hudson/hudson/jobs/myfaces-current-2.0/modules/org.apache.myfaces.core$myfaces-api/builds/2013-05-08_14-01-38/archive/org.apache.myfaces.core/myfaces-api/2.0.18-SNAPSHOT/myfaces-api-2.0.18-SNAPSHOT.pom
[JENKINS] Archiving <https://builds.apache.org/job/myfaces-current-2.0/ws/current20/core/api/target/myfaces-api-2.0.18-SNAPSHOT.jar>
to /home/hudson/hudson/jobs/myfaces-current-2.0/modules/org.apache.myfaces.core$myfaces-api/builds/2013-05-08_14-01-38/archive/org.apache.myfaces.core/myfaces-api/2.0.18-SNAPSHOT/myfaces-api-2.0.18-SNAPSHOT.jar
[INFO] [myfaces-builder:build-metadata {execution: default}]
[INFO] [myfaces-builder:make-components {execution: makecomp}]
[INFO] Using template from file loader: <https://builds.apache.org/job/myfaces-current-2.0/ws/current20/core/api/src/main/resources/META-INF/componentClass20.vm>
[WARNING] *******************************************************************
[WARNING] RuntimeInstance initializing.
[WARNING] Default ResourceManager initializing. (class org.apache.velocity.runtime.resource.ResourceManagerImpl)
[WARNING] FileResourceLoader : initialization starting.
[WARNING] FileResourceLoader : initialization complete.
[WARNING] RelativeClasspathResourceLoader : initialization complete.
[INFO] RelativeClasspathResourceLoader : adding path 'META-INF'
[WARNING] RelativeClasspathResourceLoader : initialization complete.
[WARNING] Default ResourceManager initialization complete.
[WARNING] Velocimacro : initialization starting.
[WARNING] Velocimacro : VM library registration complete.
[WARNING] Velocimacro : Velocimacro : initialization complete.
[WARNING] RuntimeInstance successfully initialized.
[INFO] Generating component class:javax.faces.component.UIMessage
[INFO] Generating component class:javax.faces.component.UIMessages
[INFO] Generating component class:javax.faces.component.UIParameter
[INFO] Generating component class:javax.faces.component.UISelectItem
[INFO] Generating component class:javax.faces.component.UISelectItems
[INFO] Generating component class:javax.faces.component.html.HtmlBody
[INFO] Generating component class:javax.faces.component.html.HtmlColumn
[INFO] Generating component class:javax.faces.component.html.HtmlCommandButton
[INFO] Generating component class:javax.faces.component.html.HtmlCommandLink
[INFO] Generating component class:javax.faces.component.html.HtmlDataTable
[INFO] Generating component class:javax.faces.component.html.HtmlForm
[INFO] Generating component class:javax.faces.component.html.HtmlGraphicImage
[INFO] Generating component class:javax.faces.component.html.HtmlHead
[INFO] Generating component class:javax.faces.component.html.HtmlInputSecret
[INFO] Generating component class:javax.faces.component.html.HtmlInputText
[INFO] Generating component class:javax.faces.component.html.HtmlInputTextarea
[INFO] Generating component class:javax.faces.component.html.HtmlMessage
[INFO] Generating component class:javax.faces.component.html.HtmlMessages
[INFO] Generating component class:javax.faces.component.html.HtmlOutcomeTargetButton
[INFO] Generating component class:javax.faces.component.html.HtmlOutcomeTargetLink
[INFO] Generating component class:javax.faces.component.html.HtmlOutputFormat
[INFO] Generating component class:javax.faces.component.html.HtmlOutputLabel
[INFO] Generating component class:javax.faces.component.html.HtmlOutputLink
[INFO] Generating component class:javax.faces.component.html.HtmlOutputText
[INFO] Generating component class:javax.faces.component.html.HtmlPanelGrid
[INFO] Generating component class:javax.faces.component.html.HtmlPanelGroup
[INFO] Generating component class:javax.faces.component.html.HtmlSelectBooleanCheckbox
[INFO] Generating component class:javax.faces.component.html.HtmlSelectManyCheckbox
[INFO] Generating component class:javax.faces.component.html.HtmlSelectManyListbox
[INFO] Generating component class:javax.faces.component.html.HtmlSelectManyMenu
[INFO] Generating component class:javax.faces.component.html.HtmlSelectOneListbox
[INFO] Generating component class:javax.faces.component.html.HtmlSelectOneMenu
[INFO] Generating component class:javax.faces.component.html.HtmlSelectOneRadio
[INFO] [source:jar {execution: attach-source}]
[INFO] Building jar: <https://builds.apache.org/job/myfaces-current-2.0/ws/current20/core/api/target/myfaces-api-2.0.18-SNAPSHOT-sources.jar>
[INFO] [jar:test-jar {execution: default}]
[INFO] Building jar: <https://builds.apache.org/job/myfaces-current-2.0/ws/current20/core/api/target/myfaces-api-2.0.18-SNAPSHOT-tests.jar>
[INFO] [checkstyle:check {execution: verify-style}]
[INFO] 
[INFO] [install:install {execution: default-install}]
[INFO] Installing <https://builds.apache.org/job/myfaces-current-2.0/ws/current20/core/api/target/myfaces-api-2.0.18-SNAPSHOT.jar>
to /export/home/hudson/hudson-slave/maven-repositories/1/org/apache/myfaces/core/myfaces-api/2.0.18-SNAPSHOT/myfaces-api-2.0.18-SNAPSHOT.jar
[INFO] Installing <https://builds.apache.org/job/myfaces-current-2.0/ws/current20/core/api/target/myfaces-api-2.0.18-SNAPSHOT-sources.jar>
to /export/home/hudson/hudson-slave/maven-repositories/1/org/apache/myfaces/core/myfaces-api/2.0.18-SNAPSHOT/myfaces-api-2.0.18-SNAPSHOT-sources.jar
[INFO] Installing <https://builds.apache.org/job/myfaces-current-2.0/ws/current20/core/api/target/myfaces-api-2.0.18-SNAPSHOT-tests.jar>
to /export/home/hudson/hudson-slave/maven-repositories/1/org/apache/myfaces/core/myfaces-api/2.0.18-SNAPSHOT/myfaces-api-2.0.18-SNAPSHOT-tests.jar
[INFO] [deploy:deploy {execution: default-deploy}]
[INFO] Retrieving previous build number from apache.snapshots.https
[WARNING] *** CHECKSUM FAILED - Checksum failed on download: local = '0b7c6d419de3560c79a92faba383937e7d73bc13';
remote = '42648333795a861f7d0bf1b737139604793ebd08' - RETRYING
[WARNING] *** CHECKSUM FAILED - Checksum failed on download: local = '0b7c6d419de3560c79a92faba383937e7d73bc13';
remote = '42648333795a861f7d0bf1b737139604793ebd08' - IGNORING
Uploading: https://repository.apache.org/content/repositories/snapshots/org/apache/myfaces/core/myfaces-api/2.0.18-SNAPSHOT/myfaces-api-2.0.18-20130508.140811-31.jar
1104K uploaded  (myfaces-api-2.0.18-20130508.140811-31.jar)
[INFO] Uploading project information for myfaces-api 2.0.18-20130508.140811-31
[INFO] Retrieving previous metadata from apache.snapshots.https
[WARNING] *** CHECKSUM FAILED - Checksum failed on download: local = '0b7c6d419de3560c79a92faba383937e7d73bc13';
remote = '42648333795a861f7d0bf1b737139604793ebd08' - RETRYING
[WARNING] *** CHECKSUM FAILED - Checksum failed on download: local = '0b7c6d419de3560c79a92faba383937e7d73bc13';
remote = '42648333795a861f7d0bf1b737139604793ebd08' - IGNORING
[INFO] Uploading repository metadata for: 'snapshot org.apache.myfaces.core:myfaces-api:2.0.18-SNAPSHOT'
[INFO] Retrieving previous metadata from apache.snapshots.https
[INFO] Uploading repository metadata for: 'artifact org.apache.myfaces.core:myfaces-api'
[INFO] Retrieving previous build number from apache.snapshots.https
Uploading: https://repository.apache.org/content/repositories/snapshots/org/apache/myfaces/core/myfaces-api/2.0.18-SNAPSHOT/myfaces-api-2.0.18-20130508.140811-31-sources.jar
870K uploaded  (myfaces-api-2.0.18-20130508.140811-31-sources.jar)
[INFO] Retrieving previous build number from apache.snapshots.https
Uploading: https://repository.apache.org/content/repositories/snapshots/org/apache/myfaces/core/myfaces-api/2.0.18-SNAPSHOT/myfaces-api-2.0.18-20130508.140811-31-tests.jar
199K uploaded  (myfaces-api-2.0.18-20130508.140811-31-tests.jar)
[JENKINS] Archiving <https://builds.apache.org/job/myfaces-current-2.0/ws/current20/core/api/target/myfaces-api-2.0.18-SNAPSHOT.jar>
to /home/hudson/hudson/jobs/myfaces-current-2.0/modules/org.apache.myfaces.core$myfaces-api/builds/2013-05-08_14-01-38/archive/org.apache.myfaces.core/myfaces-api/2.0.18-20130508.140811-31/myfaces-api-2.0.18-20130508.140811-31.jar
[JENKINS] Archiving <https://builds.apache.org/job/myfaces-current-2.0/ws/current20/core/api/target/myfaces-api-2.0.18-SNAPSHOT-sources.jar>
to /home/hudson/hudson/jobs/myfaces-current-2.0/modules/org.apache.myfaces.core$myfaces-api/builds/2013-05-08_14-01-38/archive/org.apache.myfaces.core/myfaces-api/2.0.18-20130508.140811-31/myfaces-api-2.0.18-20130508.140811-31-sources.jar
[JENKINS] Archiving <https://builds.apache.org/job/myfaces-current-2.0/ws/current20/core/api/target/myfaces-api-2.0.18-SNAPSHOT-tests.jar>
to /home/hudson/hudson/jobs/myfaces-current-2.0/modules/org.apache.myfaces.core$myfaces-api/builds/2013-05-08_14-01-38/archive/org.apache.myfaces.core/myfaces-api/2.0.18-20130508.140811-31/myfaces-api-2.0.18-20130508.140811-31-tests.jar
[INFO] ------------------------------------------------------------------------
[INFO] Building Apache MyFaces Shared For JSF 2.0 - Project
[INFO]    task-segment: [clean, deploy]
[INFO] ------------------------------------------------------------------------
[INFO] [clean:clean {execution: default-clean}]
[INFO] Deleting <https://builds.apache.org/job/myfaces-current-2.0/ws/current20/shared/target>
[INFO] [remote-resources:process {execution: default}]
[INFO] [site:attach-descriptor {execution: default-attach-descriptor}]
[INFO] [checkstyle:check {execution: verify-style}]
[INFO] 
[INFO] [install:install {execution: default-install}]
[INFO] Installing <https://builds.apache.org/job/myfaces-current-2.0/ws/current20/shared/pom.xml>
to /export/home/hudson/hudson-slave/maven-repositories/1/org/apache/myfaces/shared/myfaces-shared-project/4.0.18-SNAPSHOT/myfaces-shared-project-4.0.18-SNAPSHOT.pom
[INFO] Installing <https://builds.apache.org/job/myfaces-current-2.0/ws/current20/shared/target/myfaces-shared-project-4.0.18-SNAPSHOT-site.xml>
to /export/home/hudson/hudson-slave/maven-repositories/1/org/apache/myfaces/shared/myfaces-shared-project/4.0.18-SNAPSHOT/myfaces-shared-project-4.0.18-SNAPSHOT-site.xml
[INFO] [deploy:deploy {execution: default-deploy}]
[INFO] Retrieving previous build number from apache.snapshots.https
[WARNING] *** CHECKSUM FAILED - Checksum failed on download: local = 'be025b80e8e173cc61c936823323fa00bd47629b';
remote = '27eff5bb77936a5882ff046098bb225fd6798575' - RETRYING
[WARNING] *** CHECKSUM FAILED - Checksum failed on download: local = 'be025b80e8e173cc61c936823323fa00bd47629b';
remote = '27eff5bb77936a5882ff046098bb225fd6798575' - IGNORING
Uploading: https://repository.apache.org/content/repositories/snapshots/org/apache/myfaces/shared/myfaces-shared-project/4.0.18-SNAPSHOT/myfaces-shared-project-4.0.18-20130508.140811-31.pom
7K uploaded  (myfaces-shared-project-4.0.18-20130508.140811-31.pom)
[INFO] Retrieving previous metadata from apache.snapshots.https
[WARNING] *** CHECKSUM FAILED - Checksum failed on download: local = 'be025b80e8e173cc61c936823323fa00bd47629b';
remote = '27eff5bb77936a5882ff046098bb225fd6798575' - RETRYING
[WARNING] *** CHECKSUM FAILED - Checksum failed on download: local = 'be025b80e8e173cc61c936823323fa00bd47629b';
remote = '27eff5bb77936a5882ff046098bb225fd6798575' - IGNORING
[INFO] Uploading repository metadata for: 'snapshot org.apache.myfaces.shared:myfaces-shared-project:4.0.18-SNAPSHOT'
[INFO] Retrieving previous metadata from apache.snapshots.https
[INFO] Uploading repository metadata for: 'artifact org.apache.myfaces.shared:myfaces-shared-project'
[INFO] Retrieving previous build number from apache.snapshots.https
Uploading: https://repository.apache.org/content/repositories/snapshots/org/apache/myfaces/shared/myfaces-shared-project/4.0.18-SNAPSHOT/myfaces-shared-project-4.0.18-20130508.140811-31-site.xml
2K uploaded  (myfaces-shared-project-4.0.18-20130508.140811-31-site.xml)
[JENKINS] Archiving <https://builds.apache.org/job/myfaces-current-2.0/ws/current20/shared/pom.xml>
to /home/hudson/hudson/jobs/myfaces-current-2.0/modules/org.apache.myfaces.shared$myfaces-shared-project/builds/2013-05-08_14-01-32/archive/org.apache.myfaces.shared/myfaces-shared-project/4.0.18-SNAPSHOT/myfaces-shared-project-4.0.18-SNAPSHOT.pom
[JENKINS] Archiving /export/home/hudson/hudson-slave/maven-repositories/1/org/apache/myfaces/shared/myfaces-shared-project/4.0.18-SNAPSHOT/myfaces-shared-project-4.0.18-SNAPSHOT.pom
to /home/hudson/hudson/jobs/myfaces-current-2.0/modules/org.apache.myfaces.shared$myfaces-shared-project/builds/2013-05-08_14-01-32/archive/org.apache.myfaces.shared/myfaces-shared-project/4.0.18-20130508.140811-31/myfaces-shared-project-4.0.18-20130508.140811-31.pom
[JENKINS] Archiving <https://builds.apache.org/job/myfaces-current-2.0/ws/current20/shared/target/myfaces-shared-project-4.0.18-SNAPSHOT-site.xml>
to /home/hudson/hudson/jobs/myfaces-current-2.0/modules/org.apache.myfaces.shared$myfaces-shared-project/builds/2013-05-08_14-01-32/archive/org.apache.myfaces.shared/myfaces-shared-project/4.0.18-20130508.140811-31/myfaces-shared-project-4.0.18-20130508.140811-31-site.xml
[INFO] ------------------------------------------------------------------------
[INFO] Building Apache MyFaces Shared For JSF 2.0 - Core Mirror
[INFO]    task-segment: [clean, deploy]
[INFO] ------------------------------------------------------------------------
[INFO] [clean:clean {execution: default-clean}]
[INFO] Deleting <https://builds.apache.org/job/myfaces-current-2.0/ws/current20/shared/core/target>
[INFO] [remote-resources:process {execution: default}]
[INFO] [build-helper:add-resource {execution: add-resource}]
[INFO] [myfaces-javascript:compile {execution: compile-myfacesscripts}]
[INFO] Reading assembler descriptor <https://builds.apache.org/job/myfaces-current-2.0/ws/current20/shared/core/src/assembler/myfacesscripts-compiler.xml>
[INFO] [myfaces-javascript:compile {execution: compile-myfacesscripts-uncompressed}]
[INFO] Reading assembler descriptor <https://builds.apache.org/job/myfaces-current-2.0/ws/current20/shared/core/src/assembler/myfacesscripts-uncompressed-compiler.xml>
[INFO] [myfaces-javascript:compress {execution: compress-myfacesscripts}]
[INFO] Compressing javascript using YahooUI
[INFO] ------------------------------------------------------------------------------

[WARNING] [WARNING] The variable i has already been declared in the same scope...
&&params!=null){for(var i ---> = <--- 0,param;(param=params[

[WARNING] [WARNING] The variable param has already been declared in the same scope...
){for(var i=0,param ---> ; <--- (param=params[i]);
[INFO] oamSubmit.js (5,742 bytes) ................................. compressed at 67%
[INFO] ------------------------------------------------------------------------------
[INFO] compression saved 3,868 bytes
[debug] execute contextualize
[INFO] [resources:resources {execution: default-resources}]
[INFO] Using 'UTF-8' encoding to copy filtered resources.
[INFO] Copying 3 resources
[INFO] Copying 3 resources
[INFO] Copying 2 resources
[INFO] [compiler:compile {execution: default-compile}]
[INFO] Compiling 140 source files to <https://builds.apache.org/job/myfaces-current-2.0/ws/current20/shared/core/target/classes>
[debug] execute contextualize
[INFO] [resources:testResources {execution: default-testResources}]
[INFO] Using 'UTF-8' encoding to copy filtered resources.
[INFO] Copying 15 resources
[INFO] Copying 3 resources
[INFO] [compiler:testCompile {execution: default-testCompile}]
[INFO] Compiling 21 source files to <https://builds.apache.org/job/myfaces-current-2.0/ws/current20/shared/core/target/test-classes>
[INFO] [surefire:test {execution: default-test}]
[INFO] Surefire report directory: <https://builds.apache.org/job/myfaces-current-2.0/ws/current20/shared/core/target/surefire-reports>

-------------------------------------------------------
 T E S T S
-------------------------------------------------------

Results :

Tests run: 0, Failures: 0, Errors: 0, Skipped: 0

[JENKINS] Recording test results
[JENKINS] Archiving <https://builds.apache.org/job/myfaces-current-2.0/ws/current20/shared/core/pom.xml>
to /home/hudson/hudson/jobs/myfaces-current-2.0/modules/org.apache.myfaces.shared$myfaces-shared-core/builds/2013-05-08_14-01-33/archive/org.apache.myfaces.shared/myfaces-shared-core/4.0.18-SNAPSHOT/myfaces-shared-core-4.0.18-SNAPSHOT.pom
[INFO] ------------------------------------------------------------------------
[ERROR] BUILD ERROR
[INFO] ------------------------------------------------------------------------
[INFO] Error while executing forked tests.; nested exception is java.io.IOException: Cannot
run program "/bin/sh" (in directory "<https://builds.apache.org/job/myfaces-current-2.0/ws/current20/shared/core")>:
error=12, Not enough space

[INFO] ------------------------------------------------------------------------
[INFO] For more information, run Maven with the -e switch
[INFO] ------------------------------------------------------------------------
[INFO] Total time: 11 minutes 46 seconds
[INFO] Finished at: Wed May 08 14:17:46 GMT+00:00 2013
[INFO] Final Memory: 111M/444M
[INFO] ------------------------------------------------------------------------
channel stopped

Mime
View raw message