myfaces-commits mailing list archives

Site index · List index
Message view « Date » · « Thread »
Top « Date » · « Thread »
From Apache Jenkins Server <jenk...@builds.apache.org>
Subject Build failed in Jenkins: tobago-trunk-deploy #338
Date Thu, 14 Mar 2013 01:42:08 GMT
See <https://builds.apache.org/job/tobago-trunk-deploy/338/changes>

Changes:

[lofwyr] put the tomahawk dependency back

[lofwyr] TOBAGO-1229: Using Facelets 2.0 from JSF 2.0 instead of Facelets 1.1 from Sun
- not writing the tags "description" and "display-name" in the root tag, because of SAXParser
exception (see MYFACES-3537)

------------------------------------------
[...truncated 2983 lines...]
[WARNING] Some problems were encountered while building the effective model for org.apache.myfaces.tobago:tobago-example-data:jar:1.6.0-beta-3-SNAPSHOT
[WARNING] 'reporting.plugins.plugin.version' for org.codehaus.mojo:rat-maven-plugin is missing.
@ org.apache.myfaces.tobago:tobago:1.6.0-beta-3-SNAPSHOT, <https://builds.apache.org/job/tobago-trunk-deploy/ws/trunk-deploy/pom.xml,>
line 363, column 15
[WARNING] 
[WARNING] Some problems were encountered while building the effective model for org.apache.myfaces.tobago:tobago-example-demo:war:1.6.0-beta-3-SNAPSHOT
[WARNING] 'reporting.plugins.plugin.version' for org.codehaus.mojo:rat-maven-plugin is missing.
@ org.apache.myfaces.tobago:tobago:1.6.0-beta-3-SNAPSHOT, <https://builds.apache.org/job/tobago-trunk-deploy/ws/trunk-deploy/pom.xml,>
line 363, column 15
[WARNING] 
[WARNING] Some problems were encountered while building the effective model for org.apache.myfaces.tobago:tobago-example-nonfacesrequest:war:1.6.0-beta-3-SNAPSHOT
[WARNING] 'reporting.plugins.plugin.version' for org.codehaus.mojo:rat-maven-plugin is missing.
@ org.apache.myfaces.tobago:tobago:1.6.0-beta-3-SNAPSHOT, <https://builds.apache.org/job/tobago-trunk-deploy/ws/trunk-deploy/pom.xml,>
line 363, column 15
[WARNING] 
[WARNING] Some problems were encountered while building the effective model for org.apache.myfaces.tobago:tobago-example-experimental:war:1.6.0-beta-3-SNAPSHOT
[WARNING] 'reporting.plugins.plugin.version' for org.codehaus.mojo:rat-maven-plugin is missing.
@ org.apache.myfaces.tobago:tobago:1.6.0-beta-3-SNAPSHOT, <https://builds.apache.org/job/tobago-trunk-deploy/ws/trunk-deploy/pom.xml,>
line 363, column 15
[WARNING] 
[WARNING] Some problems were encountered while building the effective model for org.apache.myfaces.tobago:tobago-example-test:war:1.6.0-beta-3-SNAPSHOT
[WARNING] 'reporting.plugins.plugin.version' for org.codehaus.mojo:rat-maven-plugin is missing.
@ org.apache.myfaces.tobago:tobago:1.6.0-beta-3-SNAPSHOT, <https://builds.apache.org/job/tobago-trunk-deploy/ws/trunk-deploy/pom.xml,>
line 363, column 15
[WARNING] 
[WARNING] Some problems were encountered while building the effective model for org.apache.myfaces.tobago:tobago-example-assembly:pom:1.6.0-beta-3-SNAPSHOT
[WARNING] 'reporting.plugins.plugin.version' for org.codehaus.mojo:rat-maven-plugin is missing.
@ org.apache.myfaces.tobago:tobago:1.6.0-beta-3-SNAPSHOT, <https://builds.apache.org/job/tobago-trunk-deploy/ws/trunk-deploy/pom.xml,>
line 363, column 15
[WARNING] 
[WARNING] Some problems were encountered while building the effective model for org.apache.myfaces.tobago:tobago-example:pom:1.6.0-beta-3-SNAPSHOT
[WARNING] 'reporting.plugins.plugin.version' for org.codehaus.mojo:rat-maven-plugin is missing.
@ org.apache.myfaces.tobago:tobago:1.6.0-beta-3-SNAPSHOT, <https://builds.apache.org/job/tobago-trunk-deploy/ws/trunk-deploy/pom.xml,>
line 363, column 15
[WARNING] 
[WARNING] Some problems were encountered while building the effective model for org.apache.myfaces.tobago:tobago-assembly:pom:1.6.0-beta-3-SNAPSHOT
[WARNING] 'reporting.plugins.plugin.version' for org.codehaus.mojo:rat-maven-plugin is missing.
@ org.apache.myfaces.tobago:tobago:1.6.0-beta-3-SNAPSHOT, <https://builds.apache.org/job/tobago-trunk-deploy/ws/trunk-deploy/pom.xml,>
line 363, column 15
[WARNING] 
[WARNING] Some problems were encountered while building the effective model for org.apache.myfaces.tobago:tobago:pom:1.6.0-beta-3-SNAPSHOT
[WARNING] 'reporting.plugins.plugin.version' for org.codehaus.mojo:rat-maven-plugin is missing.
@ line 363, column 15
[WARNING] 
[WARNING] It is highly recommended to fix these problems because they threaten the stability
of your build.
[WARNING] 
[WARNING] For this reason, future Maven versions might no longer support building such malformed
projects.
[WARNING] 
[INFO] ------------------------------------------------------------------------
[INFO] Reactor Build Order:
[INFO] 
[INFO] Apache Tobago
[INFO] Tobago Tool
[INFO] Tobago Tool Annotation
[INFO] Tobago Tool Apt
[INFO] Tobago Maven2 Theme Plugin
[INFO] Tobago Core
[INFO] Tobago Themes
[INFO] Tobago Theme Standard
[INFO] Tobago Theme Scarborough
[INFO] Tobago Theme Speyside
[INFO] Tobago Theme Richmond
[INFO] Tobago Theme Charlotteville
[INFO] Tobago Extensions
[INFO] Tobago Deprecation
[INFO] Tobago Fileupload
[INFO] Tobago Sandbox
[INFO] Tobago Security
[INFO] Tobago Examples
[INFO] Tobago Example Addressbook
[INFO] Tobago Example Addressbook (Java EE 6)
[INFO] Tobago Example Blank
[INFO] Tobago Example Data
[INFO] Tobago Example Demo
[INFO] Tobago Example Non-Faces-Request
[INFO] Tobago Example Experimental
[INFO] Tobago Example Test
[INFO] Tobago Example Assembly
[INFO] Tobago Assembly
[INFO]                                                                         
[INFO] ------------------------------------------------------------------------
[INFO] Building Apache Tobago 1.6.0-beta-3-SNAPSHOT
[INFO] ------------------------------------------------------------------------
[INFO] 
[INFO] --- maven-clean-plugin:2.4.1:clean (default-clean) @ tobago ---
[INFO] 
[INFO] --- animal-sniffer-maven-plugin:1.7:check (default-cli) @ tobago ---
[INFO] Checking unresolved references to org.codehaus.mojo.signature:java15:1.0
[INFO] 
[INFO] --- maven-enforcer-plugin:1.1:enforce (enforce) @ tobago ---
[INFO] 
[INFO] --- buildnumber-maven-plugin:1.0:create (default) @ tobago ---
[INFO] Checking for local modifications: skipped.
[INFO] Updating project files from SCM: skipped.
[INFO] Executing: /bin/sh -c cd <https://builds.apache.org/job/tobago-trunk-deploy/ws/trunk-deploy>
&& svn --non-interactive info
[INFO] Working directory: <https://builds.apache.org/job/tobago-trunk-deploy/ws/trunk-deploy>
[INFO] Storing buildNumber: 1456305 at timestamp: 1363225218701
[INFO] Executing: /bin/sh -c cd <https://builds.apache.org/job/tobago-trunk-deploy/ws/trunk-deploy>
&& svn --non-interactive info
[INFO] Working directory: <https://builds.apache.org/job/tobago-trunk-deploy/ws/trunk-deploy>
[INFO] Storing buildScmBranch: trunk
[INFO] 
[INFO] --- maven-remote-resources-plugin:1.2.1:process (default) @ tobago ---
[INFO] 
[INFO] --- maven-site-plugin:2.3:attach-descriptor (attach-descriptor) @ tobago ---
[INFO] 
[INFO] --- maven-javadoc-plugin:2.8:jar (attach-javadoc) @ tobago ---
[INFO] Not executing Javadoc as the project is not a Java classpath-capable package
[INFO] 
[INFO] --- maven-enforcer-plugin:1.1:enforce (enforce) @ tobago ---
[INFO] 
[INFO] --- buildnumber-maven-plugin:1.0:create (default) @ tobago ---
Mar 14, 2013 1:40:22 AM hudson.maven.ExecutedMojo <init>
WARNING: Failed to getClass for org.apache.maven.plugin.source.SourceJarMojo
[INFO] 
[INFO] --- maven-source-plugin:2.1.2:jar (attach-source) @ tobago ---
[INFO] 
[INFO] --- maven-assembly-plugin:2.2.1:single (source-release-assembly) @ tobago ---
[INFO] tobago-1.6.0-beta-3-SNAPSHOT/ already added, skipping
[INFO] Building zip: <https://builds.apache.org/job/tobago-trunk-deploy/ws/trunk-deploy/target/tobago-1.6.0-beta-3-SNAPSHOT-source-release.zip>
[INFO] tobago-1.6.0-beta-3-SNAPSHOT/ already added, skipping
[INFO] ------------------------------------------------------------------------
[INFO] Reactor Summary:
[INFO] 
[INFO] Apache Tobago ..................................... FAILURE [50.407s]
[INFO] Tobago Tool ....................................... SKIPPED
[INFO] Tobago Tool Annotation ............................ SKIPPED
[INFO] Tobago Tool Apt ................................... SKIPPED
[INFO] Tobago Maven2 Theme Plugin ........................ SKIPPED
[INFO] Tobago Core ....................................... SKIPPED
[INFO] Tobago Themes ..................................... SKIPPED
[INFO] Tobago Theme Standard ............................. SKIPPED
[INFO] Tobago Theme Scarborough .......................... SKIPPED
[INFO] Tobago Theme Speyside ............................. SKIPPED
[INFO] Tobago Theme Richmond ............................. SKIPPED
[INFO] Tobago Theme Charlotteville ....................... SKIPPED
[INFO] Tobago Extensions ................................. SKIPPED
[INFO] Tobago Deprecation ................................ SKIPPED
[INFO] Tobago Fileupload ................................. SKIPPED
[INFO] Tobago Sandbox .................................... SKIPPED
[INFO] Tobago Security ................................... SKIPPED
[INFO] Tobago Examples ................................... SKIPPED
[INFO] Tobago Example Addressbook ........................ SKIPPED
[INFO] Tobago Example Addressbook (Java EE 6) ............ SKIPPED
[INFO] Tobago Example Blank .............................. SKIPPED
[INFO] Tobago Example Data ............................... SKIPPED
[INFO] Tobago Example Demo ............................... SKIPPED
[INFO] Tobago Example Non-Faces-Request .................. SKIPPED
[INFO] Tobago Example Experimental ....................... SKIPPED
[INFO] Tobago Example Test ............................... SKIPPED
[INFO] Tobago Example Assembly ........................... SKIPPED
[INFO] Tobago Assembly ................................... SKIPPED
[INFO] ------------------------------------------------------------------------
[INFO] BUILD FAILURE
[INFO] ------------------------------------------------------------------------
[INFO] Total time: 55.746s
[INFO] Finished at: Thu Mar 14 01:40:39 UTC 2013
[INFO] Final Memory: 28M/377M
[INFO] ------------------------------------------------------------------------
[JENKINS] Archiving <https://builds.apache.org/job/tobago-trunk-deploy/ws/trunk-deploy/tobago-theme/tobago-theme-standard/pom.xml>
to /home/hudson/hudson/jobs/tobago-trunk-deploy/modules/org.apache.myfaces.tobago$tobago-theme-standard/builds/2013-03-14_01-39-23/archive/org.apache.myfaces.tobago/tobago-theme-standard/1.6.0-beta-3-SNAPSHOT/tobago-theme-standard-1.6.0-beta-3-SNAPSHOT.pom
[JENKINS] Archiving <https://builds.apache.org/job/tobago-trunk-deploy/ws/trunk-deploy/tobago-theme/tobago-theme-scarborough/pom.xml>
to /home/hudson/hudson/jobs/tobago-trunk-deploy/modules/org.apache.myfaces.tobago$tobago-theme-scarborough/builds/2013-03-14_01-39-23/archive/org.apache.myfaces.tobago/tobago-theme-scarborough/1.6.0-beta-3-SNAPSHOT/tobago-theme-scarborough-1.6.0-beta-3-SNAPSHOT.pom
[JENKINS] Archiving <https://builds.apache.org/job/tobago-trunk-deploy/ws/trunk-deploy/tobago-tool/tobago-tool-annotation/pom.xml>
to /home/hudson/hudson/jobs/tobago-trunk-deploy/modules/org.apache.myfaces.tobago$tobago-tool-annotation/builds/2013-03-14_01-39-23/archive/org.apache.myfaces.tobago/tobago-tool-annotation/1.6.0-beta-3-SNAPSHOT/tobago-tool-annotation-1.6.0-beta-3-SNAPSHOT.pom
[JENKINS] Archiving <https://builds.apache.org/job/tobago-trunk-deploy/ws/trunk-deploy/tobago-extension/tobago-sandbox/pom.xml>
to /home/hudson/hudson/jobs/tobago-trunk-deploy/modules/org.apache.myfaces.tobago$tobago-sandbox/builds/2013-03-14_01-39-24/archive/org.apache.myfaces.tobago/tobago-sandbox/1.6.0-beta-3-SNAPSHOT/tobago-sandbox-1.6.0-beta-3-SNAPSHOT.pom
[JENKINS] Archiving <https://builds.apache.org/job/tobago-trunk-deploy/ws/trunk-deploy/tobago-theme/tobago-theme-richmond/pom.xml>
to /home/hudson/hudson/jobs/tobago-trunk-deploy/modules/org.apache.myfaces.tobago$tobago-theme-richmond/builds/2013-03-14_01-39-23/archive/org.apache.myfaces.tobago/tobago-theme-richmond/1.6.0-beta-3-SNAPSHOT/tobago-theme-richmond-1.6.0-beta-3-SNAPSHOT.pom
[JENKINS] Archiving <https://builds.apache.org/job/tobago-trunk-deploy/ws/trunk-deploy/tobago-extension/tobago-fileupload/pom.xml>
to /home/hudson/hudson/jobs/tobago-trunk-deploy/modules/org.apache.myfaces.tobago$tobago-fileupload/builds/2013-03-14_01-39-24/archive/org.apache.myfaces.tobago/tobago-fileupload/1.6.0-beta-3-SNAPSHOT/tobago-fileupload-1.6.0-beta-3-SNAPSHOT.pom
[JENKINS] Archiving <https://builds.apache.org/job/tobago-trunk-deploy/ws/trunk-deploy/tobago-core/pom.xml>
to /home/hudson/hudson/jobs/tobago-trunk-deploy/modules/org.apache.myfaces.tobago$tobago-core/builds/2013-03-14_01-39-23/archive/org.apache.myfaces.tobago/tobago-core/1.6.0-beta-3-SNAPSHOT/tobago-core-1.6.0-beta-3-SNAPSHOT.pom
[JENKINS] Archiving <https://builds.apache.org/job/tobago-trunk-deploy/ws/trunk-deploy/tobago-extension/pom.xml>
to /home/hudson/hudson/jobs/tobago-trunk-deploy/modules/org.apache.myfaces.tobago$tobago-extension/builds/2013-03-14_01-39-24/archive/org.apache.myfaces.tobago/tobago-extension/1.6.0-beta-3-SNAPSHOT/tobago-extension-1.6.0-beta-3-SNAPSHOT.pom
[JENKINS] Archiving <https://builds.apache.org/job/tobago-trunk-deploy/ws/trunk-deploy/pom.xml>
to /home/hudson/hudson/jobs/tobago-trunk-deploy/modules/org.apache.myfaces.tobago$tobago/builds/2013-03-14_01-39-23/archive/org.apache.myfaces.tobago/tobago/1.6.0-beta-3-SNAPSHOT/tobago-1.6.0-beta-3-SNAPSHOT.pom
[JENKINS] Archiving <https://builds.apache.org/job/tobago-trunk-deploy/ws/trunk-deploy/target/tobago-1.6.0-beta-3-SNAPSHOT-site.xml>
to /home/hudson/hudson/jobs/tobago-trunk-deploy/modules/org.apache.myfaces.tobago$tobago/builds/2013-03-14_01-39-23/archive/org.apache.myfaces.tobago/tobago/1.6.0-beta-3-SNAPSHOT/tobago-1.6.0-beta-3-SNAPSHOT-site.xml
[JENKINS] Archiving <https://builds.apache.org/job/tobago-trunk-deploy/ws/trunk-deploy/target/tobago-1.6.0-beta-3-SNAPSHOT-source-release.zip>
to /home/hudson/hudson/jobs/tobago-trunk-deploy/modules/org.apache.myfaces.tobago$tobago/builds/2013-03-14_01-39-23/archive/org.apache.myfaces.tobago/tobago/1.6.0-beta-3-SNAPSHOT/tobago-1.6.0-beta-3-SNAPSHOT-source-release.zip
[JENKINS] Archiving <https://builds.apache.org/job/tobago-trunk-deploy/ws/trunk-deploy/tobago-example/tobago-example-blank/pom.xml>
to /home/hudson/hudson/jobs/tobago-trunk-deploy/modules/org.apache.myfaces.tobago$tobago-example-blank/builds/2013-03-14_01-39-24/archive/org.apache.myfaces.tobago/tobago-example-blank/1.6.0-beta-3-SNAPSHOT/tobago-example-blank-1.6.0-beta-3-SNAPSHOT.pom
[JENKINS] Archiving <https://builds.apache.org/job/tobago-trunk-deploy/ws/trunk-deploy/tobago-example/tobago-example-nonfacesrequest/pom.xml>
to /home/hudson/hudson/jobs/tobago-trunk-deploy/modules/org.apache.myfaces.tobago$tobago-example-nonfacesrequest/builds/2013-03-14_01-39-24/archive/org.apache.myfaces.tobago/tobago-example-nonfacesrequest/1.6.0-beta-3-SNAPSHOT/tobago-example-nonfacesrequest-1.6.0-beta-3-SNAPSHOT.pom
[JENKINS] Archiving <https://builds.apache.org/job/tobago-trunk-deploy/ws/trunk-deploy/tobago-theme/pom.xml>
to /home/hudson/hudson/jobs/tobago-trunk-deploy/modules/org.apache.myfaces.tobago$tobago-theme/builds/2013-03-14_01-39-23/archive/org.apache.myfaces.tobago/tobago-theme/1.6.0-beta-3-SNAPSHOT/tobago-theme-1.6.0-beta-3-SNAPSHOT.pom
[JENKINS] Archiving <https://builds.apache.org/job/tobago-trunk-deploy/ws/trunk-deploy/tobago-example/tobago-example-addressbook/pom.xml>
to /home/hudson/hudson/jobs/tobago-trunk-deploy/modules/org.apache.myfaces.tobago$tobago-example-addressbook/builds/2013-03-14_01-39-24/archive/org.apache.myfaces.tobago/tobago-example-addressbook/1.6.0-beta-3-SNAPSHOT/tobago-example-addressbook-1.6.0-beta-3-SNAPSHOT.pom
[JENKINS] Archiving <https://builds.apache.org/job/tobago-trunk-deploy/ws/trunk-deploy/tobago-example/tobago-example-data/pom.xml>
to /home/hudson/hudson/jobs/tobago-trunk-deploy/modules/org.apache.myfaces.tobago$tobago-example-data/builds/2013-03-14_01-39-24/archive/org.apache.myfaces.tobago/tobago-example-data/1.6.0-beta-3-SNAPSHOT/tobago-example-data-1.6.0-beta-3-SNAPSHOT.pom
[JENKINS] Archiving <https://builds.apache.org/job/tobago-trunk-deploy/ws/trunk-deploy/tobago-assembly/pom.xml>
to /home/hudson/hudson/jobs/tobago-trunk-deploy/modules/org.apache.myfaces.tobago$tobago-assembly/builds/2013-03-14_01-39-25/archive/org.apache.myfaces.tobago/tobago-assembly/1.6.0-beta-3-SNAPSHOT/tobago-assembly-1.6.0-beta-3-SNAPSHOT.pom
[JENKINS] Archiving <https://builds.apache.org/job/tobago-trunk-deploy/ws/trunk-deploy/tobago-tool/tobago-theme-plugin/pom.xml>
to /home/hudson/hudson/jobs/tobago-trunk-deploy/modules/org.apache.myfaces.tobago$tobago-theme-plugin/builds/2013-03-14_01-39-23/archive/org.apache.myfaces.tobago/tobago-theme-plugin/1.6.0-beta-3-SNAPSHOT/tobago-theme-plugin-1.6.0-beta-3-SNAPSHOT.pom
[JENKINS] Archiving <https://builds.apache.org/job/tobago-trunk-deploy/ws/trunk-deploy/tobago-theme/tobago-theme-charlotteville/pom.xml>
to /home/hudson/hudson/jobs/tobago-trunk-deploy/modules/org.apache.myfaces.tobago$tobago-theme-charlotteville/builds/2013-03-14_01-39-23/archive/org.apache.myfaces.tobago/tobago-theme-charlotteville/1.6.0-beta-3-SNAPSHOT/tobago-theme-charlotteville-1.6.0-beta-3-SNAPSHOT.pom
[JENKINS] Archiving <https://builds.apache.org/job/tobago-trunk-deploy/ws/trunk-deploy/tobago-extension/tobago-deprecation/pom.xml>
to /home/hudson/hudson/jobs/tobago-trunk-deploy/modules/org.apache.myfaces.tobago$tobago-deprecation/builds/2013-03-14_01-39-24/archive/org.apache.myfaces.tobago/tobago-deprecation/1.6.0-beta-3-SNAPSHOT/tobago-deprecation-1.6.0-beta-3-SNAPSHOT.pom
[JENKINS] Archiving <https://builds.apache.org/job/tobago-trunk-deploy/ws/trunk-deploy/tobago-tool/tobago-tool-apt/pom.xml>
to /home/hudson/hudson/jobs/tobago-trunk-deploy/modules/org.apache.myfaces.tobago$tobago-tool-apt/builds/2013-03-14_01-39-23/archive/org.apache.myfaces.tobago/tobago-tool-apt/1.6.0-beta-3-SNAPSHOT/tobago-tool-apt-1.6.0-beta-3-SNAPSHOT.pom
[JENKINS] Archiving <https://builds.apache.org/job/tobago-trunk-deploy/ws/trunk-deploy/tobago-example/tobago-example-experimental/pom.xml>
to /home/hudson/hudson/jobs/tobago-trunk-deploy/modules/org.apache.myfaces.tobago$tobago-example-experimental/builds/2013-03-14_01-39-24/archive/org.apache.myfaces.tobago/tobago-example-experimental/1.6.0-beta-3-SNAPSHOT/tobago-example-experimental-1.6.0-beta-3-SNAPSHOT.pom
[JENKINS] Archiving <https://builds.apache.org/job/tobago-trunk-deploy/ws/trunk-deploy/tobago-example/tobago-example-addressbook-cdi/pom.xml>
to /home/hudson/hudson/jobs/tobago-trunk-deploy/modules/org.apache.myfaces.tobago$tobago-example-addressbook-cdi/builds/2013-03-14_01-39-24/archive/org.apache.myfaces.tobago/tobago-example-addressbook-cdi/1.6.0-beta-3-SNAPSHOT/tobago-example-addressbook-cdi-1.6.0-beta-3-SNAPSHOT.pom
[JENKINS] Archiving <https://builds.apache.org/job/tobago-trunk-deploy/ws/trunk-deploy/tobago-extension/tobago-security/pom.xml>
to /home/hudson/hudson/jobs/tobago-trunk-deploy/modules/org.apache.myfaces.tobago$tobago-security/builds/2013-03-14_01-39-24/archive/org.apache.myfaces.tobago/tobago-security/1.6.0-beta-3-SNAPSHOT/tobago-security-1.6.0-beta-3-SNAPSHOT.pom
[JENKINS] Archiving <https://builds.apache.org/job/tobago-trunk-deploy/ws/trunk-deploy/tobago-example/pom.xml>
to /home/hudson/hudson/jobs/tobago-trunk-deploy/modules/org.apache.myfaces.tobago$tobago-example/builds/2013-03-14_01-39-24/archive/org.apache.myfaces.tobago/tobago-example/1.6.0-beta-3-SNAPSHOT/tobago-example-1.6.0-beta-3-SNAPSHOT.pom
[JENKINS] Archiving <https://builds.apache.org/job/tobago-trunk-deploy/ws/trunk-deploy/tobago-example/tobago-example-test/pom.xml>
to /home/hudson/hudson/jobs/tobago-trunk-deploy/modules/org.apache.myfaces.tobago$tobago-example-test/builds/2013-03-14_01-39-24/archive/org.apache.myfaces.tobago/tobago-example-test/1.6.0-beta-3-SNAPSHOT/tobago-example-test-1.6.0-beta-3-SNAPSHOT.pom
[JENKINS] Archiving <https://builds.apache.org/job/tobago-trunk-deploy/ws/trunk-deploy/tobago-example/tobago-example-assembly/pom.xml>
to /home/hudson/hudson/jobs/tobago-trunk-deploy/modules/org.apache.myfaces.tobago$tobago-example-assembly/builds/2013-03-14_01-39-24/archive/org.apache.myfaces.tobago/tobago-example-assembly/1.6.0-beta-3-SNAPSHOT/tobago-example-assembly-1.6.0-beta-3-SNAPSHOT.pom
[JENKINS] Archiving <https://builds.apache.org/job/tobago-trunk-deploy/ws/trunk-deploy/tobago-tool/pom.xml>
to /home/hudson/hudson/jobs/tobago-trunk-deploy/modules/org.apache.myfaces.tobago$tobago-tool/builds/2013-03-14_01-39-23/archive/org.apache.myfaces.tobago/tobago-tool/1.6.0-beta-3-SNAPSHOT/tobago-tool-1.6.0-beta-3-SNAPSHOT.pom
[JENKINS] Archiving <https://builds.apache.org/job/tobago-trunk-deploy/ws/trunk-deploy/tobago-example/tobago-example-demo/pom.xml>
to /home/hudson/hudson/jobs/tobago-trunk-deploy/modules/org.apache.myfaces.tobago$tobago-example-demo/builds/2013-03-14_01-39-24/archive/org.apache.myfaces.tobago/tobago-example-demo/1.6.0-beta-3-SNAPSHOT/tobago-example-demo-1.6.0-beta-3-SNAPSHOT.pom
[JENKINS] Archiving <https://builds.apache.org/job/tobago-trunk-deploy/ws/trunk-deploy/tobago-theme/tobago-theme-speyside/pom.xml>
to /home/hudson/hudson/jobs/tobago-trunk-deploy/modules/org.apache.myfaces.tobago$tobago-theme-speyside/builds/2013-03-14_01-39-23/archive/org.apache.myfaces.tobago/tobago-theme-speyside/1.6.0-beta-3-SNAPSHOT/tobago-theme-speyside-1.6.0-beta-3-SNAPSHOT.pom
Waiting for Jenkins to finish collecting data
mavenExecutionResult exceptions not empty
message : Internal error: java.lang.reflect.UndeclaredThrowableException
cause : null
Stack trace : 
org.apache.maven.InternalErrorException: Internal error: java.lang.reflect.UndeclaredThrowableException
	at org.apache.maven.lifecycle.internal.BuilderCommon.handleBuildError(BuilderCommon.java:128)
	at org.apache.maven.lifecycle.internal.LifecycleModuleBuilder.buildProject(LifecycleModuleBuilder.java:95)
	at org.apache.maven.lifecycle.internal.LifecycleModuleBuilder.buildProject(LifecycleModuleBuilder.java:59)
	at org.apache.maven.lifecycle.internal.LifecycleStarter.singleThreadedBuild(LifecycleStarter.java:183)
	at org.apache.maven.lifecycle.internal.LifecycleStarter.execute(LifecycleStarter.java:161)
	at org.apache.maven.DefaultMaven.doExecute(DefaultMaven.java:320)
	at org.apache.maven.DefaultMaven.execute(DefaultMaven.java:156)
	at org.jvnet.hudson.maven3.launcher.Maven3Launcher.main(Maven3Launcher.java:79)
	at sun.reflect.NativeMethodAccessorImpl.invoke0(Native Method)
	at sun.reflect.NativeMethodAccessorImpl.invoke(NativeMethodAccessorImpl.java:39)
	at sun.reflect.DelegatingMethodAccessorImpl.invoke(DelegatingMethodAccessorImpl.java:25)
	at java.lang.reflect.Method.invoke(Method.java:597)
	at org.codehaus.plexus.classworlds.launcher.Launcher.launchStandard(Launcher.java:329)
	at org.codehaus.plexus.classworlds.launcher.Launcher.launch(Launcher.java:239)
	at org.jvnet.hudson.maven3.agent.Maven3Main.launch(Maven3Main.java:158)
	at hudson.maven.Maven3Builder.call(Maven3Builder.java:100)
	at hudson.maven.Maven3Builder.call(Maven3Builder.java:66)
	at hudson.remoting.UserRequest.perform(UserRequest.java:118)
	at hudson.remoting.UserRequest.perform(UserRequest.java:48)
	at hudson.remoting.Request$2.run(Request.java:326)
	at hudson.remoting.InterceptingExecutorService$1.call(InterceptingExecutorService.java:72)
	at java.util.concurrent.FutureTask$Sync.innerRun(FutureTask.java:303)
	at java.util.concurrent.FutureTask.run(FutureTask.java:138)
	at java.util.concurrent.ThreadPoolExecutor$Worker.runTask(ThreadPoolExecutor.java:886)
	at java.util.concurrent.ThreadPoolExecutor$Worker.run(ThreadPoolExecutor.java:908)
	at java.lang.Thread.run(Thread.java:662)
Caused by: java.lang.reflect.UndeclaredThrowableException
	at $Proxy2.setExecutedMojos(Unknown Source)
	at hudson.maven.MavenBuildProxy$Filter.setExecutedMojos(MavenBuildProxy.java:243)
	at hudson.maven.Maven3Builder$MavenExecutionListener.recordMojoEnded(Maven3Builder.java:439)
	at hudson.maven.Maven3Builder$MavenExecutionListener.mojoSucceeded(Maven3Builder.java:425)
	at org.apache.maven.lifecycle.internal.DefaultExecutionEventCatapult.fire(DefaultExecutionEventCatapult.java:87)
	at org.apache.maven.lifecycle.internal.DefaultExecutionEventCatapult.fire(DefaultExecutionEventCatapult.java:42)
	at org.apache.maven.lifecycle.internal.MojoExecutor.execute(MojoExecutor.java:228)
	at org.apache.maven.lifecycle.internal.MojoExecutor.execute(MojoExecutor.java:153)
	at org.apache.maven.lifecycle.internal.MojoExecutor.execute(MojoExecutor.java:145)
	at org.apache.maven.lifecycle.internal.LifecycleModuleBuilder.buildProject(LifecycleModuleBuilder.java:84)
	... 24 more
Caused by: java.io.StreamCorruptedException: invalid type code: 00
	at java.io.ObjectInputStream.readObject0(ObjectInputStream.java:1374)
	at java.io.ObjectInputStream.defaultReadFields(ObjectInputStream.java:1970)
	at java.io.ObjectInputStream.readSerialData(ObjectInputStream.java:1894)
	at java.io.ObjectInputStream.readOrdinaryObject(ObjectInputStream.java:1777)
	at java.io.ObjectInputStream.readObject0(ObjectInputStream.java:1347)
	at java.io.ObjectInputStream.readObject(ObjectInputStream.java:369)
	at java.util.concurrent.CopyOnWriteArrayList.readObject(CopyOnWriteArrayList.java:879)
	at sun.reflect.GeneratedMethodAccessor10547.invoke(Unknown Source)
	at sun.reflect.DelegatingMethodAccessorImpl.invoke(DelegatingMethodAccessorImpl.java:43)
	at java.lang.reflect.Method.invoke(Method.java:601)
	at java.io.ObjectStreamClass.invokeReadObject(ObjectStreamClass.java:1004)
	at java.io.ObjectInputStream.readSerialData(ObjectInputStream.java:1872)
	at java.io.ObjectInputStream.readOrdinaryObject(ObjectInputStream.java:1777)
	at java.io.ObjectInputStream.readObject0(ObjectInputStream.java:1347)
	at java.io.ObjectInputStream.readArray(ObjectInputStream.java:1685)
	at java.io.ObjectInputStream.readObject0(ObjectInputStream.java:1341)
	at java.io.ObjectInputStream.defaultReadFields(ObjectInputStream.java:1970)
	at java.io.ObjectInputStream.readSerialData(ObjectInputStream.java:1894)
	at java.io.ObjectInputStream.readOrdinaryObject(ObjectInputStream.java:1777)
	at java.io.ObjectInputStream.readObject0(ObjectInputStream.java:1347)
	at java.io.ObjectInputStream.readObject(ObjectInputStream.java:369)
	at hudson.remoting.UserRequest.deserialize(UserRequest.java:182)
	at hudson.remoting.UserRequest.perform(UserRequest.java:98)
	at hudson.remoting.UserRequest.perform(UserRequest.java:48)
	at hudson.remoting.Request$2.run(Request.java:326)
	at hudson.remoting.InterceptingExecutorService$1.call(InterceptingExecutorService.java:72)
	at java.util.concurrent.FutureTask$Sync.innerRun(FutureTask.java:334)
	at java.util.concurrent.FutureTask.run(FutureTask.java:166)
	at java.util.concurrent.ThreadPoolExecutor.runWorker(ThreadPoolExecutor.java:1145)
	at java.util.concurrent.ThreadPoolExecutor$Worker.run(ThreadPoolExecutor.java:615)
	at java.lang.Thread.run(Thread.java:722)
Sending e-mails to: commits@myfaces.apache.org
channel stopped

Mime
View raw message