myfaces-commits mailing list archives

Site index · List index
Message view « Date » · « Thread »
Top « Date » · « Thread »
From Apache Jenkins Server <jenk...@builds.apache.org>
Subject Build failed in Jenkins: tobago-1.0.x-deploy #550
Date Wed, 13 Mar 2013 03:43:34 GMT
See <https://builds.apache.org/job/tobago-1.0.x-deploy/550/>

------------------------------------------
[...truncated 2355 lines...]
A         sandbox/src/main/resources/org/apache/myfaces/tobago/renderkit/html
A         sandbox/src/main/resources/org/apache/myfaces/tobago/renderkit/html/standard
A         sandbox/src/main/resources/org/apache/myfaces/tobago/renderkit/html/standard/standard
A         sandbox/src/main/resources/org/apache/myfaces/tobago/renderkit/html/standard/standard/script
AU        sandbox/src/main/resources/org/apache/myfaces/tobago/renderkit/html/standard/standard/script/tobago-tree.js
A         sandbox/src/main/resources/org/apache/myfaces/tobago/renderkit/html/sandbox
A         sandbox/src/main/resources/org/apache/myfaces/tobago/renderkit/html/sandbox/standard
A         sandbox/src/main/resources/org/apache/myfaces/tobago/renderkit/html/sandbox/standard/style
AU        sandbox/src/main/resources/org/apache/myfaces/tobago/renderkit/html/sandbox/standard/style/style.css
A         sandbox/src/main/resources/org/apache/myfaces/tobago/renderkit/html/sandbox/standard/image
AU        sandbox/src/main/resources/org/apache/myfaces/tobago/renderkit/html/sandbox/standard/image/sliderTriangle.gif
AU        sandbox/src/main/resources/org/apache/myfaces/tobago/renderkit/html/sandbox/standard/image/sliderEnd.gif
A         sandbox/src/main/resources/org/apache/myfaces/tobago/renderkit/html/sandbox/standard/property
AU        sandbox/src/main/resources/org/apache/myfaces/tobago/renderkit/html/sandbox/standard/property/tobago-theme-config.properties
A         sandbox/src/main/resources/org/apache/myfaces/tobago/renderkit/html/sandbox/mozilla
A         sandbox/src/main/resources/org/apache/myfaces/tobago/renderkit/html/sandbox/mozilla/style
AU        sandbox/src/main/resources/org/apache/myfaces/tobago/renderkit/html/sandbox/mozilla/style/style.css
A         sandbox/src/main/resources/org/apache/myfaces/tobago/renderkit/html/scarborough
A         sandbox/src/main/resources/org/apache/myfaces/tobago/renderkit/html/scarborough/standard
A         sandbox/src/main/resources/org/apache/myfaces/tobago/renderkit/html/scarborough/standard/script
AU        sandbox/src/main/resources/org/apache/myfaces/tobago/renderkit/html/scarborough/standard/script/tobago-tree.js
AU        sandbox/pom.xml
AU        sandbox/readme.txt
 U        .
At revision 1455786
no change for http://svn.apache.org/repos/asf/myfaces/tobago/branches/tobago-1.0.x since the
previous build
Parsing POMs
[tobago-1.0.x-deploy] $ /home/hudson/tools/java/latest1.5/bin/java -cp /home/jenkins/jenkins-slave/maven-agent.jar:/home/jenkins/jenkins-slave/classworlds.jar
hudson.maven.agent.Main /home/hudson/tools/maven/apache-maven-2.2.1 /home/jenkins/jenkins-slave/slave.jar
/home/jenkins/jenkins-slave/maven-interceptor.jar 50064 /home/jenkins/jenkins-slave/maven2.1-interceptor.jar
<===[JENKINS REMOTING CAPACITY]===>channel started
   log4j:WARN No appenders could be found for logger (org.apache.commons.beanutils.converters.BooleanConverter).
log4j:WARN Please initialize the log4j system properly.
Executing Maven:  -B -f <https://builds.apache.org/job/tobago-1.0.x-deploy/ws/tobago-1.0.x-deploy/pom.xml>
-Dmaven.repo.local=/home/jenkins/jenkins-slave/maven-repositories/1 clean source:jar deploy
-Pgenerate-assembly
[INFO] Scanning for projects...
[INFO] Reactor build order: 
[INFO]   Apache Tobago
[INFO]   Tobago Tool
[INFO]   Maven Apt Plugin
[INFO]   Maven Tobago Theme Plugin
[INFO]   Tobago Annotation
[INFO]   Tobago Apt
[INFO]   Tobago Core
[INFO]   Tobago Themes
[INFO]   Theme Standard
[INFO]   Theme Scarborough
[INFO]   Theme Speyside
[INFO]   Theme Richmond
[INFO]   Theme Charlotteville
[INFO]   Tobago Extensions
[INFO]   Tobago Facelets
[INFO]   Tobago Fileupload
[INFO]   Tobago Security
[INFO]   Tobago FacesMessage Ordering Fix
[INFO]   Tobago Examples
[INFO]   Example Addressbook
[INFO]   Example Addressbook Library
[INFO]   Example Addressbook Webapp
[INFO]   Example Blank
[INFO]   Data for Examples
[INFO]   Example Demo
[INFO]   Example Non-Faces-Request
[INFO]   Tobago Example Experimental
[INFO]   Tobago Example Test
[INFO]   Example Assembly
[INFO]   Tobago Sandbox
[INFO]   Tobago Assembly
[INFO] Searching repository for plugin with prefix: 'source'.
[INFO] ------------------------------------------------------------------------
[INFO] Building Apache Tobago
[INFO]    task-segment: [clean, source:jar, deploy]
[INFO] ------------------------------------------------------------------------
[INFO] [clean:clean {execution: default-clean}]
[INFO] Preparing source:jar
[JENKINS] Archiving <https://builds.apache.org/job/tobago-1.0.x-deploy/ws/tobago-1.0.x-deploy/pom.xml>
to /home/hudson/hudson/jobs/tobago-1.0.x-deploy/modules/org.apache.myfaces.tobago$tobago/builds/2013-03-13_03-40-07/archive/org.apache.myfaces.tobago/tobago/1.0.41-SNAPSHOT/tobago-1.0.41-SNAPSHOT.pom
[INFO] [buildnumber:create {execution: default}]
[INFO] Checking for local modifications: skipped.
[INFO] Updating project files from SCM: skipped.
[INFO] Executing: /bin/sh -c cd <https://builds.apache.org/job/tobago-1.0.x-deploy/ws/tobago-1.0.x-deploy>
&& svn --non-interactive info
[INFO] Working directory: <https://builds.apache.org/job/tobago-1.0.x-deploy/ws/tobago-1.0.x-deploy>
[INFO] Storing buildNumber: 1455786 at timestamp: 1363146060816
[INFO] Executing: /bin/sh -c cd <https://builds.apache.org/job/tobago-1.0.x-deploy/ws/tobago-1.0.x-deploy>
&& svn --non-interactive info
[INFO] Working directory: <https://builds.apache.org/job/tobago-1.0.x-deploy/ws/tobago-1.0.x-deploy>
[INFO] Storing buildScmBranch: branches/tobago-1.0.x
[INFO] [source:jar {execution: default-cli}]
[INFO] [buildnumber:create {execution: default}]
[INFO] Setting property: classpath.resource.loader.class => 'org.codehaus.plexus.velocity.ContextClassLoaderResourceLoader'.
[INFO] Setting property: velocimacro.messages.on => 'false'.
[INFO] Setting property: resource.loader => 'classpath'.
[INFO] Setting property: resource.manager.logwhenfound => 'false'.
[INFO] [remote-resources:process {execution: default}]
[INFO] [site:attach-descriptor {execution: default-attach-descriptor}]
[INFO] Parent project loaded from repository.
[INFO] [assembly:single {execution: source-release-assembly}]
[INFO] tobago-1.0.41-SNAPSHOT/ already added, skipping
[INFO] Building zip: <https://builds.apache.org/job/tobago-1.0.x-deploy/ws/tobago-1.0.x-deploy/target/tobago-1.0.41-SNAPSHOT-source-release.zip>
[INFO] tobago-1.0.41-SNAPSHOT/ already added, skipping
[INFO] [install:install {execution: default-install}]
[INFO] Installing <https://builds.apache.org/job/tobago-1.0.x-deploy/ws/tobago-1.0.x-deploy/pom.xml>
to /home/jenkins/jenkins-slave/maven-repositories/1/org/apache/myfaces/tobago/tobago/1.0.41-SNAPSHOT/tobago-1.0.41-SNAPSHOT.pom
[INFO] Installing <https://builds.apache.org/job/tobago-1.0.x-deploy/ws/tobago-1.0.x-deploy/target/tobago-1.0.41-SNAPSHOT-site.xml>
to /home/jenkins/jenkins-slave/maven-repositories/1/org/apache/myfaces/tobago/tobago/1.0.41-SNAPSHOT/tobago-1.0.41-SNAPSHOT-site.xml
[INFO] Installing <https://builds.apache.org/job/tobago-1.0.x-deploy/ws/tobago-1.0.x-deploy/target/tobago-1.0.41-SNAPSHOT-source-release.zip>
to /home/jenkins/jenkins-slave/maven-repositories/1/org/apache/myfaces/tobago/tobago/1.0.41-SNAPSHOT/tobago-1.0.41-SNAPSHOT-source-release.zip
[INFO] [deploy:deploy {execution: default-deploy}]
[INFO] Retrieving previous build number from apache.snapshots.https
[WARNING] *** CHECKSUM FAILED - Checksum failed on download: local = '63293d860ddb4ffd888349c3a626a97460afe7d8';
remote = 'f371ca5248ed430431d45bba2b11be4ab6559708' - RETRYING
[WARNING] *** CHECKSUM FAILED - Checksum failed on download: local = '63293d860ddb4ffd888349c3a626a97460afe7d8';
remote = 'f371ca5248ed430431d45bba2b11be4ab6559708' - IGNORING
Uploading: https://repository.apache.org/content/repositories/snapshots/org/apache/myfaces/tobago/tobago/1.0.41-SNAPSHOT/tobago-1.0.41-SNAPSHOT.pom
42K uploaded  (tobago-1.0.41-SNAPSHOT.pom)
[INFO] Retrieving previous metadata from apache.snapshots.https
[WARNING] *** CHECKSUM FAILED - Checksum failed on download: local = '63293d860ddb4ffd888349c3a626a97460afe7d8';
remote = 'f371ca5248ed430431d45bba2b11be4ab6559708' - RETRYING
[WARNING] *** CHECKSUM FAILED - Checksum failed on download: local = '63293d860ddb4ffd888349c3a626a97460afe7d8';
remote = 'f371ca5248ed430431d45bba2b11be4ab6559708' - IGNORING
[INFO] Uploading repository metadata for: 'snapshot org.apache.myfaces.tobago:tobago:1.0.41-SNAPSHOT'
[INFO] Retrieving previous metadata from apache.snapshots.https
[INFO] Uploading repository metadata for: 'artifact org.apache.myfaces.tobago:tobago'
[INFO] Retrieving previous build number from apache.snapshots.https
Uploading: https://repository.apache.org/content/repositories/snapshots/org/apache/myfaces/tobago/tobago/1.0.41-SNAPSHOT/tobago-1.0.41-SNAPSHOT-site.xml
3K uploaded  (tobago-1.0.41-SNAPSHOT-site.xml)
[INFO] Retrieving previous build number from apache.snapshots.https
Uploading: https://repository.apache.org/content/repositories/snapshots/org/apache/myfaces/tobago/tobago/1.0.41-SNAPSHOT/tobago-1.0.41-SNAPSHOT-source-release.zip
2944K uploaded  (tobago-1.0.41-SNAPSHOT-source-release.zip)
[JENKINS] Archiving <https://builds.apache.org/job/tobago-1.0.x-deploy/ws/tobago-1.0.x-deploy/target/tobago-1.0.41-SNAPSHOT-site.xml>
to /home/hudson/hudson/jobs/tobago-1.0.x-deploy/modules/org.apache.myfaces.tobago$tobago/builds/2013-03-13_03-40-07/archive/org.apache.myfaces.tobago/tobago/1.0.41-SNAPSHOT/tobago-1.0.41-SNAPSHOT-site.xml
[JENKINS] Archiving <https://builds.apache.org/job/tobago-1.0.x-deploy/ws/tobago-1.0.x-deploy/target/tobago-1.0.41-SNAPSHOT-source-release.zip>
to /home/hudson/hudson/jobs/tobago-1.0.x-deploy/modules/org.apache.myfaces.tobago$tobago/builds/2013-03-13_03-40-07/archive/org.apache.myfaces.tobago/tobago/1.0.41-SNAPSHOT/tobago-1.0.41-SNAPSHOT-source-release.zip
[INFO] ------------------------------------------------------------------------
[INFO] Building Tobago Tool
[INFO]    task-segment: [clean, source:jar, deploy]
[INFO] ------------------------------------------------------------------------
[INFO] [clean:clean {execution: default-clean}]
[INFO] Preparing source:jar
[JENKINS] Archiving <https://builds.apache.org/job/tobago-1.0.x-deploy/ws/tobago-1.0.x-deploy/tobago-tool/pom.xml>
to /home/hudson/hudson/jobs/tobago-1.0.x-deploy/modules/org.apache.myfaces.tobago$tobago-tool/builds/2013-03-13_03-40-07/archive/org.apache.myfaces.tobago/tobago-tool/1.0.41-SNAPSHOT/tobago-tool-1.0.41-SNAPSHOT.pom
[INFO] [buildnumber:create {execution: default}]
[INFO] [source:jar {execution: default-cli}]
[INFO] [buildnumber:create {execution: default}]
[INFO] [remote-resources:process {execution: default}]
[INFO] [site:attach-descriptor {execution: default-attach-descriptor}]
[INFO] [assembly:single {execution: source-release-assembly}]
[INFO] Skipping the assembly in this project because it's not the Execution Root
[INFO] [install:install {execution: default-install}]
[INFO] Installing <https://builds.apache.org/job/tobago-1.0.x-deploy/ws/tobago-1.0.x-deploy/tobago-tool/pom.xml>
to /home/jenkins/jenkins-slave/maven-repositories/1/org/apache/myfaces/tobago/tobago-tool/1.0.41-SNAPSHOT/tobago-tool-1.0.41-SNAPSHOT.pom
[INFO] [deploy:deploy {execution: default-deploy}]
[INFO] Retrieving previous build number from apache.snapshots.https
[WARNING] *** CHECKSUM FAILED - Checksum failed on download: local = 'a2bb310f7cd6b12a929da250d3fb53277da3c1de';
remote = '9d8dbf66d23a5c74e4dd878946fe16f96cc543a7' - RETRYING
[WARNING] *** CHECKSUM FAILED - Checksum failed on download: local = 'a2bb310f7cd6b12a929da250d3fb53277da3c1de';
remote = '9d8dbf66d23a5c74e4dd878946fe16f96cc543a7' - IGNORING
Uploading: https://repository.apache.org/content/repositories/snapshots/org/apache/myfaces/tobago/tobago-tool/1.0.41-SNAPSHOT/tobago-tool-1.0.41-SNAPSHOT.pom
1K uploaded  (tobago-tool-1.0.41-SNAPSHOT.pom)
[INFO] Retrieving previous metadata from apache.snapshots.https
[INFO] Uploading repository metadata for: 'artifact org.apache.myfaces.tobago:tobago-tool'
[INFO] Retrieving previous metadata from apache.snapshots.https
[WARNING] *** CHECKSUM FAILED - Checksum failed on download: local = 'a2bb310f7cd6b12a929da250d3fb53277da3c1de';
remote = '9d8dbf66d23a5c74e4dd878946fe16f96cc543a7' - RETRYING
[WARNING] *** CHECKSUM FAILED - Checksum failed on download: local = 'a2bb310f7cd6b12a929da250d3fb53277da3c1de';
remote = '9d8dbf66d23a5c74e4dd878946fe16f96cc543a7' - IGNORING
[INFO] Uploading repository metadata for: 'snapshot org.apache.myfaces.tobago:tobago-tool:1.0.41-SNAPSHOT'
[INFO] ------------------------------------------------------------------------
[INFO] Building Maven Apt Plugin
[INFO]    task-segment: [clean, source:jar, deploy]
[INFO] ------------------------------------------------------------------------
[INFO] [clean:clean {execution: default-clean}]
[INFO] Preparing source:jar
[JENKINS] Archiving <https://builds.apache.org/job/tobago-1.0.x-deploy/ws/tobago-1.0.x-deploy/tobago-tool/maven-apt-plugin/pom.xml>
to /home/hudson/hudson/jobs/tobago-1.0.x-deploy/modules/org.apache.myfaces.tobago$maven-apt-plugin/builds/2013-03-13_03-40-07/archive/org.apache.myfaces.tobago/maven-apt-plugin/1.0.41-SNAPSHOT/maven-apt-plugin-1.0.41-SNAPSHOT.pom
[INFO] [buildnumber:create {execution: default}]
[INFO] [source:jar {execution: default-cli}]
[INFO] Building jar: <https://builds.apache.org/job/tobago-1.0.x-deploy/ws/tobago-1.0.x-deploy/tobago-tool/maven-apt-plugin/target/maven-apt-plugin-1.0.41-SNAPSHOT-sources.jar>
[INFO] [buildnumber:create {execution: default}]
[INFO] [plugin:descriptor {execution: default-descriptor}]
[INFO] Using 'UTF-8' encoding to read mojo metadata.
[INFO] Applying mojo extractor for language: java
[INFO] Mojo extractor for language: java found 2 mojo descriptors.
[INFO] Applying mojo extractor for language: bsh
[INFO] Mojo extractor for language: bsh found 0 mojo descriptors.
[INFO] [remote-resources:process {execution: default}]
[INFO] [resources:resources {execution: default-resources}]
[INFO] Using 'UTF-8' encoding to copy filtered resources.
[INFO] Copying 2 resources
[INFO] Copying 3 resources
[INFO] [compiler:compile {execution: default-compile}]
[INFO] Compiling 4 source files to <https://builds.apache.org/job/tobago-1.0.x-deploy/ws/tobago-1.0.x-deploy/tobago-tool/maven-apt-plugin/target/classes>
[INFO] [resources:testResources {execution: default-testResources}]
[INFO] Using 'UTF-8' encoding to copy filtered resources.
[INFO] skip non existing resourceDirectory <https://builds.apache.org/job/tobago-1.0.x-deploy/ws/tobago-1.0.x-deploy/tobago-tool/maven-apt-plugin/src/test/resources>
[INFO] Copying 3 resources
[INFO] [compiler:testCompile {execution: default-testCompile}]
[INFO] No sources to compile
[INFO] [surefire:test {execution: default-test}]
[INFO] Surefire report directory: <https://builds.apache.org/job/tobago-1.0.x-deploy/ws/tobago-1.0.x-deploy/tobago-tool/maven-apt-plugin/target/surefire-reports>

-------------------------------------------------------
 T E S T S
-------------------------------------------------------
There are no tests to run.

Results :

Tests run: 0, Failures: 0, Errors: 0, Skipped: 0

[JENKINS] Archiving <https://builds.apache.org/job/tobago-1.0.x-deploy/ws/tobago-1.0.x-deploy/tobago-tool/maven-apt-plugin/target/maven-apt-plugin-1.0.41-SNAPSHOT-sources.jar>
to /home/hudson/hudson/jobs/tobago-1.0.x-deploy/modules/org.apache.myfaces.tobago$maven-apt-plugin/builds/2013-03-13_03-40-07/archive/org.apache.myfaces.tobago/maven-apt-plugin/1.0.41-SNAPSHOT/maven-apt-plugin-1.0.41-SNAPSHOT-sources.jar
[INFO] ------------------------------------------------------------------------
[ERROR] FATAL ERROR
[INFO] ------------------------------------------------------------------------
[INFO] Failed to load hudson.maven.reporters.Messages
Invalid pc in LineNumberTable in class file hudson/maven/reporters/Messages
[INFO] ------------------------------------------------------------------------
[INFO] Trace
java.lang.ClassFormatError: Failed to load hudson.maven.reporters.Messages
	at hudson.remoting.RemoteClassLoader.loadClassFile(RemoteClassLoader.java:193)
	at hudson.remoting.RemoteClassLoader.findClass(RemoteClassLoader.java:144)
	at java.lang.ClassLoader.loadClass(ClassLoader.java:307)
	at java.lang.ClassLoader.loadClass(ClassLoader.java:252)
	at java.lang.ClassLoader.loadClassInternal(ClassLoader.java:320)
	at hudson.maven.reporters.SurefireArchiver.postExecute(SurefireArchiver.java:120)
	at hudson.maven.Maven2Builder.postExecute(Maven2Builder.java:157)
	at hudson.maven.MavenBuilder$Adapter.postExecute(MavenBuilder.java:334)
	at hudson.maven.agent.PluginManagerInterceptor$1MojoIntercepterImpl.callPost(PluginManagerInterceptor.java:170)
	at hudson.maven.agent.PluginManagerInterceptor.executeMojo(PluginManagerInterceptor.java:183)
	at org.apache.maven.lifecycle.DefaultLifecycleExecutor.executeGoals(DefaultLifecycleExecutor.java:694)
	at org.apache.maven.lifecycle.DefaultLifecycleExecutor.executeGoalWithLifecycle(DefaultLifecycleExecutor.java:556)
	at org.apache.maven.lifecycle.DefaultLifecycleExecutor.executeGoal(DefaultLifecycleExecutor.java:535)
	at org.apache.maven.lifecycle.DefaultLifecycleExecutor.executeGoalAndHandleFailures(DefaultLifecycleExecutor.java:387)
	at org.apache.maven.lifecycle.DefaultLifecycleExecutor.executeTaskSegments(DefaultLifecycleExecutor.java:348)
	at org.apache.maven.lifecycle.DefaultLifecycleExecutor.execute(DefaultLifecycleExecutor.java:180)
	at org.apache.maven.lifecycle.LifecycleExecutorInterceptor.execute(LifecycleExecutorInterceptor.java:65)
	at org.apache.maven.DefaultMaven.doExecute(DefaultMaven.java:328)
	at org.apache.maven.DefaultMaven.execute(DefaultMaven.java:138)
	at org.apache.maven.cli.MavenCli.main(MavenCli.java:362)
	at sun.reflect.NativeMethodAccessorImpl.invoke0(Native Method)
	at sun.reflect.NativeMethodAccessorImpl.invoke(NativeMethodAccessorImpl.java:39)
	at sun.reflect.DelegatingMethodAccessorImpl.invoke(DelegatingMethodAccessorImpl.java:25)
	at java.lang.reflect.Method.invoke(Method.java:592)
	at org.codehaus.classworlds.Launcher.launchEnhanced(Launcher.java:315)
	at org.codehaus.classworlds.Launcher.launch(Launcher.java:255)
	at hudson.maven.agent.Main.launch(Main.java:185)
	at hudson.maven.MavenBuilder.call(MavenBuilder.java:154)
	at hudson.maven.Maven2Builder.call(Maven2Builder.java:79)
	at hudson.maven.Maven2Builder.call(Maven2Builder.java:55)
	at hudson.remoting.UserRequest.perform(UserRequest.java:118)
	at hudson.remoting.UserRequest.perform(UserRequest.java:48)
	at hudson.remoting.Request$2.run(Request.java:326)
	at hudson.remoting.InterceptingExecutorService$1.call(InterceptingExecutorService.java:72)
	at java.util.concurrent.FutureTask$Sync.innerRun(FutureTask.java:269)
	at java.util.concurrent.FutureTask.run(FutureTask.java:123)
	at java.util.concurrent.ThreadPoolExecutor$Worker.runTask(ThreadPoolExecutor.java:651)
	at java.util.concurrent.ThreadPoolExecutor$Worker.run(ThreadPoolExecutor.java:676)
	at java.lang.Thread.run(Thread.java:595)
Caused by: java.lang.ClassFormatError: Invalid pc in LineNumberTable in class file hudson/maven/reporters/Messages
	at java.lang.ClassLoader.defineClass1(Native Method)
	at java.lang.ClassLoader.defineClass(ClassLoader.java:621)
	at java.lang.ClassLoader.defineClass(ClassLoader.java:466)
	at hudson.remoting.RemoteClassLoader.loadClassFile(RemoteClassLoader.java:191)
	... 38 more
[INFO] ------------------------------------------------------------------------
[INFO] Total time: 1 minute 17 seconds
[INFO] Finished at: Wed Mar 13 03:41:58 UTC 2013
[INFO] Final Memory: 58M/325M
[INFO] ------------------------------------------------------------------------
channel stopped

Mime
View raw message