myfaces-commits mailing list archives

Site index · List index
Message view « Date » · « Thread »
Top « Date » · « Thread »
From Apache Jenkins Server <jenk...@builds.apache.org>
Subject Build failed in Jenkins: tobago-trunk #977
Date Fri, 15 Mar 2013 18:48:06 GMT
See <https://builds.apache.org/job/tobago-trunk/977/changes>

Changes:

[lofwyr] fixing class init problems

[lofwyr] fix logging of the layout token

[lofwyr] TOBAGO-1229: Using Facelets 2.0 from JSF 2.0 instead of Facelets 1.1 from Sun 
- cleanup: removing JSF 1.2 support

[lofwyr] TOBAGO-1241: Duplicate include of theme resources

------------------------------------------
[...truncated 3183 lines...]
[INFO] 
[INFO] --- maven-enforcer-plugin:1.1:enforce (enforce) @ tobago-tool-apt ---
[INFO] 
[INFO] --- maven-remote-resources-plugin:1.2.1:process (default) @ tobago-tool-apt ---
[debug] execute contextualize
[INFO] [INFO] Using 'UTF-8' encoding to copy filtered resources.
[INFO] Copying 6 resources
[INFO] Copying 3 resources

[INFO] --- maven-resources-plugin:2.5:resources (default-resources) @ tobago-tool-apt ---
[INFO] 
[INFO] --- maven-compiler-plugin:2.4:compile (default-compile) @ tobago-tool-apt ---
[INFO] Compiling 15 source files to <https://builds.apache.org/job/tobago-trunk/ws/tobago-trunk/tobago-tool/tobago-tool-apt/target/classes>
[INFO] [debug] execute contextualize
[INFO] Using 'UTF-8' encoding to copy filtered resources.
[INFO] skip non existing resourceDirectory <https://builds.apache.org/job/tobago-trunk/ws/tobago-trunk/tobago-tool/tobago-tool-apt/src/test/resources>
[INFO] Copying 3 resources

[INFO] --- maven-resources-plugin:2.5:testResources (default-testResources) @ tobago-tool-apt
---
[INFO] [INFO] No sources to compile

[INFO] --- maven-compiler-plugin:2.4:testCompile (default-testCompile) @ tobago-tool-apt ---
[INFO] Surefire report directory: <https://builds.apache.org/job/tobago-trunk/ws/tobago-trunk/tobago-tool/tobago-tool-apt/target/surefire-reports>
[INFO] 
-------------------------------------------------------
 T E S T S
-------------------------------------------------------

[INFO] --- maven-surefire-plugin:2.9:test (default-test) @ tobago-tool-apt ---

Results :

Tests run: 0, Failures: 0, Errors: 0, Skipped: 0

[JENKINS] Recording test results
[INFO] 
[INFO] --- maven-jar-plugin:2.3.2:jar (default-jar) @ tobago-tool-apt ---
[INFO] Building jar: <https://builds.apache.org/job/tobago-trunk/ws/tobago-trunk/tobago-tool/tobago-tool-apt/target/tobago-tool-apt-1.6.0-beta-3-SNAPSHOT.jar>
[INFO] 
[INFO] --- maven-site-plugin:2.3:attach-descriptor (attach-descriptor) @ tobago-tool-apt ---
[INFO] 
[INFO] --- maven-checkstyle-plugin:2.7:check (verify-style) @ tobago-tool-apt ---
[INFO] 
[INFO] Installing <https://builds.apache.org/job/tobago-trunk/ws/tobago-trunk/tobago-tool/tobago-tool-apt/target/tobago-tool-apt-1.6.0-beta-3-SNAPSHOT.jar>
to /home/jenkins/jenkins-slave/maven-repositories/0/org/apache/myfaces/tobago/tobago-tool-apt/1.6.0-beta-3-SNAPSHOT/tobago-tool-apt-1.6.0-beta-3-SNAPSHOT.jar
[INFO] 
[INFO] --- maven-install-plugin:2.3.1:install (default-install) @ tobago-tool-apt ---
[INFO] Installing <https://builds.apache.org/job/tobago-trunk/ws/tobago-trunk/tobago-tool/tobago-tool-apt/pom.xml>
to /home/jenkins/jenkins-slave/maven-repositories/0/org/apache/myfaces/tobago/tobago-tool-apt/1.6.0-beta-3-SNAPSHOT/tobago-tool-apt-1.6.0-beta-3-SNAPSHOT.pom
[INFO]                                                                         
[INFO] ------------------------------------------------------------------------
[INFO] Building Tobago Maven2 Theme Plugin 1.6.0-beta-3-SNAPSHOT
[INFO] ------------------------------------------------------------------------
[INFO] 
[INFO] --- maven-clean-plugin:2.4.1:clean (default-clean) @ tobago-theme-plugin ---
[INFO] Checking unresolved references to org.codehaus.mojo.signature:java15:1.0
[INFO] 
[INFO] --- animal-sniffer-maven-plugin:1.7:check (default-cli) @ tobago-theme-plugin ---
[INFO] 
[INFO] --- maven-checkstyle-plugin:2.7:check (default-cli) @ tobago-theme-plugin ---
[INFO] 
[INFO] 
[INFO] --- maven-enforcer-plugin:1.1:enforce (enforce) @ tobago-theme-plugin ---
[INFO] 
[INFO] --- maven-plugin-plugin:2.4.1:descriptor (default-descriptor) @ tobago-theme-plugin
---
[INFO] Using 2 extractors.
[INFO] Applying extractor for language: java
[INFO] Extractor for language: java found 1 mojo descriptors.
[INFO] Applying extractor for language: bsh
[INFO] Extractor for language: bsh found 0 mojo descriptors.
[INFO] 
[INFO] --- maven-remote-resources-plugin:1.2.1:process (default) @ tobago-theme-plugin ---
[debug] execute contextualize
[INFO] Using 'UTF-8' encoding to copy filtered resources.
[INFO] Copying 2 resources
[INFO] [INFO] Copying 3 resources

[INFO] --- maven-resources-plugin:2.5:resources (default-resources) @ tobago-theme-plugin
---
[INFO] 
[INFO] --- maven-compiler-plugin:2.3.2:compile (default-compile) @ tobago-theme-plugin ---
[INFO] Compiling 2 source files to <https://builds.apache.org/job/tobago-trunk/ws/tobago-trunk/tobago-tool/tobago-theme-plugin/target/classes>
[debug] execute contextualize
[INFO] Using 'UTF-8' encoding to copy filtered resources.
[INFO] skip non existing resourceDirectory <https://builds.apache.org/job/tobago-trunk/ws/tobago-trunk/tobago-tool/tobago-theme-plugin/src/test/resources>
[INFO] Copying 3 resources
[INFO] 
[INFO] --- maven-resources-plugin:2.5:testResources (default-testResources) @ tobago-theme-plugin
---
[INFO] No sources to compile
[INFO] 
[INFO] --- maven-compiler-plugin:2.3.2:testCompile (default-testCompile) @ tobago-theme-plugin
---
[INFO] [INFO] Surefire report directory: <https://builds.apache.org/job/tobago-trunk/ws/tobago-trunk/tobago-tool/tobago-theme-plugin/target/surefire-reports>

-------------------------------------------------------
 T E S T S
-------------------------------------------------------

[INFO] --- maven-surefire-plugin:2.9:test (default-test) @ tobago-theme-plugin ---

Results :

Tests run: 0, Failures: 0, Errors: 0, Skipped: 0

[JENKINS] Recording test results
[INFO] 
[INFO] --- maven-jar-plugin:2.3.2:jar (default-jar) @ tobago-theme-plugin ---
[INFO] Building jar: <https://builds.apache.org/job/tobago-trunk/ws/tobago-trunk/tobago-tool/tobago-theme-plugin/target/tobago-theme-plugin-1.6.0-beta-3-SNAPSHOT.jar>
[INFO] 
[INFO] --- maven-plugin-plugin:2.4.1:addPluginArtifactMetadata (default-addPluginArtifactMetadata)
@ tobago-theme-plugin ---
[INFO] 
[INFO] --- maven-site-plugin:2.3:attach-descriptor (attach-descriptor) @ tobago-theme-plugin
---
[INFO] 
[INFO] --- maven-checkstyle-plugin:2.7:check (verify-style) @ tobago-theme-plugin ---
[INFO] 
[INFO] [INFO] Installing <https://builds.apache.org/job/tobago-trunk/ws/tobago-trunk/tobago-tool/tobago-theme-plugin/target/tobago-theme-plugin-1.6.0-beta-3-SNAPSHOT.jar>
to /home/jenkins/jenkins-slave/maven-repositories/0/org/apache/myfaces/tobago/tobago-theme-plugin/1.6.0-beta-3-SNAPSHOT/tobago-theme-plugin-1.6.0-beta-3-SNAPSHOT.jar

[INFO] --- maven-install-plugin:2.3.1:install (default-install) @ tobago-theme-plugin ---
[INFO] Installing <https://builds.apache.org/job/tobago-trunk/ws/tobago-trunk/tobago-tool/tobago-theme-plugin/pom.xml>
to /home/jenkins/jenkins-slave/maven-repositories/0/org/apache/myfaces/tobago/tobago-theme-plugin/1.6.0-beta-3-SNAPSHOT/tobago-theme-plugin-1.6.0-beta-3-SNAPSHOT.pom
[INFO]                                                                         
[INFO] ------------------------------------------------------------------------
[INFO] Building Tobago Core 1.6.0-beta-3-SNAPSHOT
[INFO] ------------------------------------------------------------------------
[INFO] 
[INFO] --- maven-clean-plugin:2.4.1:clean (default-clean) @ tobago-core ---
[INFO] Checking unresolved references to org.codehaus.mojo.signature:java15:1.0
[INFO] 
[INFO] --- animal-sniffer-maven-plugin:1.7:check (default-cli) @ tobago-core ---
[INFO] 
[INFO] --- maven-checkstyle-plugin:2.7:check (default-cli) @ tobago-core ---
[INFO] 
[INFO] There are 1 checkstyle errors.
[INFO] ------------------------------------------------------------------------
[INFO] Reactor Summary:
[INFO] 
[INFO] Apache Tobago ..................................... SUCCESS [40.441s]
[INFO] Tobago Tool ....................................... SUCCESS [3.866s]
[INFO] Tobago Tool Annotation ............................ SUCCESS [15.654s]
[INFO] Tobago Tool Apt ................................... SUCCESS [11.518s]
[INFO] Tobago Maven2 Theme Plugin ........................ SUCCESS [11.785s]
[INFO] Tobago Core ....................................... FAILURE [13.121s]
[INFO] Tobago Themes ..................................... SKIPPED
[INFO] Tobago Theme Standard ............................. SKIPPED
[INFO] Tobago Theme Scarborough .......................... SKIPPED
[INFO] Tobago Theme Speyside ............................. SKIPPED
[INFO] Tobago Theme Richmond ............................. SKIPPED
[INFO] Tobago Theme Charlotteville ....................... SKIPPED
[INFO] Tobago Extensions ................................. SKIPPED
[INFO] Tobago Deprecation ................................ SKIPPED
[INFO] Tobago Fileupload ................................. SKIPPED
[INFO] Tobago Sandbox .................................... SKIPPED
[INFO] Tobago Security ................................... SKIPPED
[INFO] Tobago Examples ................................... SKIPPED
[INFO] Tobago Example Addressbook ........................ SKIPPED
[INFO] Tobago Example Addressbook (Java EE 6) ............ SKIPPED
[INFO] Tobago Example Blank .............................. SKIPPED
[INFO] Tobago Example Data ............................... SKIPPED
[INFO] Tobago Example Demo ............................... SKIPPED
[INFO] Tobago Example Non-Faces-Request .................. SKIPPED
[INFO] Tobago Example Experimental ....................... SKIPPED
[INFO] Tobago Example Test ............................... SKIPPED
[INFO] Tobago Example for Portlets ....................... SKIPPED
[INFO] Tobago Example Sandbox ............................ SKIPPED
[INFO] Tobago Example Security ........................... SKIPPED
[INFO] Tobago Example Assembly ........................... SKIPPED
[INFO] Tobago Theme Example .............................. SKIPPED
[INFO] Tobago Assembly ................................... SKIPPED
[INFO] ------------------------------------------------------------------------
[INFO] BUILD FAILURE
[INFO] ------------------------------------------------------------------------
[INFO] Total time: 1:47.429s
[INFO] Finished at: Fri Mar 15 18:47:13 UTC 2013
[INFO] Final Memory: 39M/391M
[INFO] ------------------------------------------------------------------------
[JENKINS] Archiving <https://builds.apache.org/job/tobago-trunk/ws/tobago-trunk/tobago-theme/tobago-theme-standard/pom.xml>
to /home/hudson/hudson/jobs/tobago-trunk/modules/org.apache.myfaces.tobago$tobago-theme-standard/builds/2013-03-15_18-45-01/archive/org.apache.myfaces.tobago/tobago-theme-standard/1.6.0-beta-3-SNAPSHOT/tobago-theme-standard-1.6.0-beta-3-SNAPSHOT.pom
[JENKINS] Archiving <https://builds.apache.org/job/tobago-trunk/ws/tobago-trunk/tobago-theme/tobago-theme-scarborough/pom.xml>
to /home/hudson/hudson/jobs/tobago-trunk/modules/org.apache.myfaces.tobago$tobago-theme-scarborough/builds/2013-03-15_18-45-01/archive/org.apache.myfaces.tobago/tobago-theme-scarborough/1.6.0-beta-3-SNAPSHOT/tobago-theme-scarborough-1.6.0-beta-3-SNAPSHOT.pom
[JENKINS] Archiving <https://builds.apache.org/job/tobago-trunk/ws/tobago-trunk/tobago-tool/tobago-tool-annotation/pom.xml>
to /home/hudson/hudson/jobs/tobago-trunk/modules/org.apache.myfaces.tobago$tobago-tool-annotation/builds/2013-03-15_18-45-00/archive/org.apache.myfaces.tobago/tobago-tool-annotation/1.6.0-beta-3-SNAPSHOT/tobago-tool-annotation-1.6.0-beta-3-SNAPSHOT.pom
[JENKINS] Archiving <https://builds.apache.org/job/tobago-trunk/ws/tobago-trunk/tobago-tool/tobago-tool-annotation/target/tobago-tool-annotation-1.6.0-beta-3-SNAPSHOT.jar>
to /home/hudson/hudson/jobs/tobago-trunk/modules/org.apache.myfaces.tobago$tobago-tool-annotation/builds/2013-03-15_18-45-00/archive/org.apache.myfaces.tobago/tobago-tool-annotation/1.6.0-beta-3-SNAPSHOT/tobago-tool-annotation-1.6.0-beta-3-SNAPSHOT.jar
[JENKINS] Archiving <https://builds.apache.org/job/tobago-trunk/ws/tobago-trunk/tobago-extension/tobago-sandbox/pom.xml>
to /home/hudson/hudson/jobs/tobago-trunk/modules/org.apache.myfaces.tobago$tobago-sandbox/builds/2013-03-15_18-45-03/archive/org.apache.myfaces.tobago/tobago-sandbox/1.6.0-beta-3-SNAPSHOT/tobago-sandbox-1.6.0-beta-3-SNAPSHOT.pom
[JENKINS] Archiving <https://builds.apache.org/job/tobago-trunk/ws/tobago-trunk/tobago-theme/tobago-theme-richmond/pom.xml>
to /home/hudson/hudson/jobs/tobago-trunk/modules/org.apache.myfaces.tobago$tobago-theme-richmond/builds/2013-03-15_18-45-02/archive/org.apache.myfaces.tobago/tobago-theme-richmond/1.6.0-beta-3-SNAPSHOT/tobago-theme-richmond-1.6.0-beta-3-SNAPSHOT.pom
[JENKINS] Archiving <https://builds.apache.org/job/tobago-trunk/ws/tobago-trunk/tobago-extension/tobago-fileupload/pom.xml>
to /home/hudson/hudson/jobs/tobago-trunk/modules/org.apache.myfaces.tobago$tobago-fileupload/builds/2013-03-15_18-45-03/archive/org.apache.myfaces.tobago/tobago-fileupload/1.6.0-beta-3-SNAPSHOT/tobago-fileupload-1.6.0-beta-3-SNAPSHOT.pom
[JENKINS] Archiving <https://builds.apache.org/job/tobago-trunk/ws/tobago-trunk/tobago-core/pom.xml>
to /home/hudson/hudson/jobs/tobago-trunk/modules/org.apache.myfaces.tobago$tobago-core/builds/2013-03-15_18-45-01/archive/org.apache.myfaces.tobago/tobago-core/1.6.0-beta-3-SNAPSHOT/tobago-core-1.6.0-beta-3-SNAPSHOT.pom
[JENKINS] Archiving <https://builds.apache.org/job/tobago-trunk/ws/tobago-trunk/tobago-extension/pom.xml>
to /home/hudson/hudson/jobs/tobago-trunk/modules/org.apache.myfaces.tobago$tobago-extension/builds/2013-03-15_18-45-02/archive/org.apache.myfaces.tobago/tobago-extension/1.6.0-beta-3-SNAPSHOT/tobago-extension-1.6.0-beta-3-SNAPSHOT.pom
[JENKINS] Archiving <https://builds.apache.org/job/tobago-trunk/ws/tobago-trunk/pom.xml>
to /home/hudson/hudson/jobs/tobago-trunk/modules/org.apache.myfaces.tobago$tobago/builds/2013-03-15_18-44-59/archive/org.apache.myfaces.tobago/tobago/1.6.0-beta-3-SNAPSHOT/tobago-1.6.0-beta-3-SNAPSHOT.pom
[JENKINS] Archiving <https://builds.apache.org/job/tobago-trunk/ws/tobago-trunk/target/tobago-1.6.0-beta-3-SNAPSHOT-site.xml>
to /home/hudson/hudson/jobs/tobago-trunk/modules/org.apache.myfaces.tobago$tobago/builds/2013-03-15_18-44-59/archive/org.apache.myfaces.tobago/tobago/1.6.0-beta-3-SNAPSHOT/tobago-1.6.0-beta-3-SNAPSHOT-site.xml
[JENKINS] Archiving <https://builds.apache.org/job/tobago-trunk/ws/tobago-trunk/tobago-example/tobago-example-sandbox/pom.xml>
to /home/hudson/hudson/jobs/tobago-trunk/modules/org.apache.myfaces.tobago$tobago-example-sandbox/builds/2013-03-15_18-45-05/archive/org.apache.myfaces.tobago/tobago-example-sandbox/1.6.0-beta-3-SNAPSHOT/tobago-example-sandbox-1.6.0-beta-3-SNAPSHOT.pom
[JENKINS] Archiving <https://builds.apache.org/job/tobago-trunk/ws/tobago-trunk/tobago-example/tobago-example-blank/pom.xml>
to /home/hudson/hudson/jobs/tobago-trunk/modules/org.apache.myfaces.tobago$tobago-example-blank/builds/2013-03-15_18-45-04/archive/org.apache.myfaces.tobago/tobago-example-blank/1.6.0-beta-3-SNAPSHOT/tobago-example-blank-1.6.0-beta-3-SNAPSHOT.pom
[JENKINS] Archiving <https://builds.apache.org/job/tobago-trunk/ws/tobago-trunk/tobago-example/tobago-example-nonfacesrequest/pom.xml>
to /home/hudson/hudson/jobs/tobago-trunk/modules/org.apache.myfaces.tobago$tobago-example-nonfacesrequest/builds/2013-03-15_18-45-04/archive/org.apache.myfaces.tobago/tobago-example-nonfacesrequest/1.6.0-beta-3-SNAPSHOT/tobago-example-nonfacesrequest-1.6.0-beta-3-SNAPSHOT.pom
[JENKINS] Archiving <https://builds.apache.org/job/tobago-trunk/ws/tobago-trunk/tobago-theme/pom.xml>
to /home/hudson/hudson/jobs/tobago-trunk/modules/org.apache.myfaces.tobago$tobago-theme/builds/2013-03-15_18-45-01/archive/org.apache.myfaces.tobago/tobago-theme/1.6.0-beta-3-SNAPSHOT/tobago-theme-1.6.0-beta-3-SNAPSHOT.pom
[JENKINS] Archiving <https://builds.apache.org/job/tobago-trunk/ws/tobago-trunk/tobago-example/tobago-example-portlet/pom.xml>
to /home/hudson/hudson/jobs/tobago-trunk/modules/org.apache.myfaces.tobago$tobago-example-portlet/builds/2013-03-15_18-45-05/archive/org.apache.myfaces.tobago/tobago-example-portlet/1.6.0-beta-3-SNAPSHOT/tobago-example-portlet-1.6.0-beta-3-SNAPSHOT.pom
[JENKINS] Archiving <https://builds.apache.org/job/tobago-trunk/ws/tobago-trunk/tobago-example/tobago-example-addressbook/pom.xml>
to /home/hudson/hudson/jobs/tobago-trunk/modules/org.apache.myfaces.tobago$tobago-example-addressbook/builds/2013-03-15_18-45-03/archive/org.apache.myfaces.tobago/tobago-example-addressbook/1.6.0-beta-3-SNAPSHOT/tobago-example-addressbook-1.6.0-beta-3-SNAPSHOT.pom
[JENKINS] Archiving <https://builds.apache.org/job/tobago-trunk/ws/tobago-trunk/tobago-example/tobago-example-data/pom.xml>
to /home/hudson/hudson/jobs/tobago-trunk/modules/org.apache.myfaces.tobago$tobago-example-data/builds/2013-03-15_18-45-04/archive/org.apache.myfaces.tobago/tobago-example-data/1.6.0-beta-3-SNAPSHOT/tobago-example-data-1.6.0-beta-3-SNAPSHOT.pom
[JENKINS] Archiving <https://builds.apache.org/job/tobago-trunk/ws/tobago-trunk/tobago-assembly/pom.xml>
to /home/hudson/hudson/jobs/tobago-trunk/modules/org.apache.myfaces.tobago$tobago-assembly/builds/2013-03-15_18-45-06/archive/org.apache.myfaces.tobago/tobago-assembly/1.6.0-beta-3-SNAPSHOT/tobago-assembly-1.6.0-beta-3-SNAPSHOT.pom
[JENKINS] Archiving <https://builds.apache.org/job/tobago-trunk/ws/tobago-trunk/tobago-example/tobago-theme-example/pom.xml>
to /home/hudson/hudson/jobs/tobago-trunk/modules/org.apache.myfaces.tobago$tobago-theme-example/builds/2013-03-15_18-45-06/archive/org.apache.myfaces.tobago/tobago-theme-example/1.6.0-beta-3-SNAPSHOT/tobago-theme-example-1.6.0-beta-3-SNAPSHOT.pom
[JENKINS] Archiving <https://builds.apache.org/job/tobago-trunk/ws/tobago-trunk/tobago-tool/tobago-theme-plugin/pom.xml>
to /home/hudson/hudson/jobs/tobago-trunk/modules/org.apache.myfaces.tobago$tobago-theme-plugin/builds/2013-03-15_18-45-01/archive/org.apache.myfaces.tobago/tobago-theme-plugin/1.6.0-beta-3-SNAPSHOT/tobago-theme-plugin-1.6.0-beta-3-SNAPSHOT.pom
[JENKINS] Archiving <https://builds.apache.org/job/tobago-trunk/ws/tobago-trunk/tobago-tool/tobago-theme-plugin/target/tobago-theme-plugin-1.6.0-beta-3-SNAPSHOT.jar>
to /home/hudson/hudson/jobs/tobago-trunk/modules/org.apache.myfaces.tobago$tobago-theme-plugin/builds/2013-03-15_18-45-01/archive/org.apache.myfaces.tobago/tobago-theme-plugin/1.6.0-beta-3-SNAPSHOT/tobago-theme-plugin-1.6.0-beta-3-SNAPSHOT.jar
[JENKINS] Archiving <https://builds.apache.org/job/tobago-trunk/ws/tobago-trunk/tobago-theme/tobago-theme-charlotteville/pom.xml>
to /home/hudson/hudson/jobs/tobago-trunk/modules/org.apache.myfaces.tobago$tobago-theme-charlotteville/builds/2013-03-15_18-45-02/archive/org.apache.myfaces.tobago/tobago-theme-charlotteville/1.6.0-beta-3-SNAPSHOT/tobago-theme-charlotteville-1.6.0-beta-3-SNAPSHOT.pom
[JENKINS] Archiving <https://builds.apache.org/job/tobago-trunk/ws/tobago-trunk/tobago-extension/tobago-deprecation/pom.xml>
to /home/hudson/hudson/jobs/tobago-trunk/modules/org.apache.myfaces.tobago$tobago-deprecation/builds/2013-03-15_18-45-02/archive/org.apache.myfaces.tobago/tobago-deprecation/1.6.0-beta-3-SNAPSHOT/tobago-deprecation-1.6.0-beta-3-SNAPSHOT.pom
[JENKINS] Archiving <https://builds.apache.org/job/tobago-trunk/ws/tobago-trunk/tobago-tool/tobago-tool-apt/pom.xml>
to /home/hudson/hudson/jobs/tobago-trunk/modules/org.apache.myfaces.tobago$tobago-tool-apt/builds/2013-03-15_18-45-00/archive/org.apache.myfaces.tobago/tobago-tool-apt/1.6.0-beta-3-SNAPSHOT/tobago-tool-apt-1.6.0-beta-3-SNAPSHOT.pom
[JENKINS] Archiving <https://builds.apache.org/job/tobago-trunk/ws/tobago-trunk/tobago-tool/tobago-tool-apt/target/tobago-tool-apt-1.6.0-beta-3-SNAPSHOT.jar>
to /home/hudson/hudson/jobs/tobago-trunk/modules/org.apache.myfaces.tobago$tobago-tool-apt/builds/2013-03-15_18-45-00/archive/org.apache.myfaces.tobago/tobago-tool-apt/1.6.0-beta-3-SNAPSHOT/tobago-tool-apt-1.6.0-beta-3-SNAPSHOT.jar
[JENKINS] Archiving <https://builds.apache.org/job/tobago-trunk/ws/tobago-trunk/tobago-example/tobago-example-experimental/pom.xml>
to /home/hudson/hudson/jobs/tobago-trunk/modules/org.apache.myfaces.tobago$tobago-example-experimental/builds/2013-03-15_18-45-05/archive/org.apache.myfaces.tobago/tobago-example-experimental/1.6.0-beta-3-SNAPSHOT/tobago-example-experimental-1.6.0-beta-3-SNAPSHOT.pom
[JENKINS] Archiving <https://builds.apache.org/job/tobago-trunk/ws/tobago-trunk/tobago-example/tobago-example-addressbook-cdi/pom.xml>
to /home/hudson/hudson/jobs/tobago-trunk/modules/org.apache.myfaces.tobago$tobago-example-addressbook-cdi/builds/2013-03-15_18-45-04/archive/org.apache.myfaces.tobago/tobago-example-addressbook-cdi/1.6.0-beta-3-SNAPSHOT/tobago-example-addressbook-cdi-1.6.0-beta-3-SNAPSHOT.pom
[JENKINS] Archiving <https://builds.apache.org/job/tobago-trunk/ws/tobago-trunk/tobago-extension/tobago-security/pom.xml>
to /home/hudson/hudson/jobs/tobago-trunk/modules/org.apache.myfaces.tobago$tobago-security/builds/2013-03-15_18-45-03/archive/org.apache.myfaces.tobago/tobago-security/1.6.0-beta-3-SNAPSHOT/tobago-security-1.6.0-beta-3-SNAPSHOT.pom
[JENKINS] Archiving <https://builds.apache.org/job/tobago-trunk/ws/tobago-trunk/tobago-example/pom.xml>
to /home/hudson/hudson/jobs/tobago-trunk/modules/org.apache.myfaces.tobago$tobago-example/builds/2013-03-15_18-45-03/archive/org.apache.myfaces.tobago/tobago-example/1.6.0-beta-3-SNAPSHOT/tobago-example-1.6.0-beta-3-SNAPSHOT.pom
[JENKINS] Archiving <https://builds.apache.org/job/tobago-trunk/ws/tobago-trunk/tobago-example/tobago-example-test/pom.xml>
to /home/hudson/hudson/jobs/tobago-trunk/modules/org.apache.myfaces.tobago$tobago-example-test/builds/2013-03-15_18-45-05/archive/org.apache.myfaces.tobago/tobago-example-test/1.6.0-beta-3-SNAPSHOT/tobago-example-test-1.6.0-beta-3-SNAPSHOT.pom
[JENKINS] Archiving <https://builds.apache.org/job/tobago-trunk/ws/tobago-trunk/tobago-example/tobago-example-security/pom.xml>
to /home/hudson/hudson/jobs/tobago-trunk/modules/org.apache.myfaces.tobago$tobago-example-security/builds/2013-03-15_18-45-06/archive/org.apache.myfaces.tobago/tobago-example-security/1.6.0-beta-3-SNAPSHOT/tobago-example-security-1.6.0-beta-3-SNAPSHOT.pom
[JENKINS] Archiving <https://builds.apache.org/job/tobago-trunk/ws/tobago-trunk/tobago-example/tobago-example-assembly/pom.xml>
to /home/hudson/hudson/jobs/tobago-trunk/modules/org.apache.myfaces.tobago$tobago-example-assembly/builds/2013-03-15_18-45-06/archive/org.apache.myfaces.tobago/tobago-example-assembly/1.6.0-beta-3-SNAPSHOT/tobago-example-assembly-1.6.0-beta-3-SNAPSHOT.pom
[JENKINS] Archiving <https://builds.apache.org/job/tobago-trunk/ws/tobago-trunk/tobago-tool/pom.xml>
to /home/hudson/hudson/jobs/tobago-trunk/modules/org.apache.myfaces.tobago$tobago-tool/builds/2013-03-15_18-45-00/archive/org.apache.myfaces.tobago/tobago-tool/1.6.0-beta-3-SNAPSHOT/tobago-tool-1.6.0-beta-3-SNAPSHOT.pom
[JENKINS] Archiving <https://builds.apache.org/job/tobago-trunk/ws/tobago-trunk/tobago-example/tobago-example-demo/pom.xml>
to /home/hudson/hudson/jobs/tobago-trunk/modules/org.apache.myfaces.tobago$tobago-example-demo/builds/2013-03-15_18-45-04/archive/org.apache.myfaces.tobago/tobago-example-demo/1.6.0-beta-3-SNAPSHOT/tobago-example-demo-1.6.0-beta-3-SNAPSHOT.pom
[JENKINS] Archiving <https://builds.apache.org/job/tobago-trunk/ws/tobago-trunk/tobago-theme/tobago-theme-speyside/pom.xml>
to /home/hudson/hudson/jobs/tobago-trunk/modules/org.apache.myfaces.tobago$tobago-theme-speyside/builds/2013-03-15_18-45-02/archive/org.apache.myfaces.tobago/tobago-theme-speyside/1.6.0-beta-3-SNAPSHOT/tobago-theme-speyside-1.6.0-beta-3-SNAPSHOT.pom
Waiting for Jenkins to finish collecting data
mavenExecutionResult exceptions not empty
message : Failed to execute goal org.apache.maven.plugins:maven-checkstyle-plugin:2.7:check
(default-cli) on project tobago-core: You have 1 Checkstyle violation.
cause : You have 1 Checkstyle violation.
Stack trace : 
org.apache.maven.lifecycle.LifecycleExecutionException: Failed to execute goal org.apache.maven.plugins:maven-checkstyle-plugin:2.7:check
(default-cli) on project tobago-core: You have 1 Checkstyle violation.
	at org.apache.maven.lifecycle.internal.MojoExecutor.execute(MojoExecutor.java:213)
	at org.apache.maven.lifecycle.internal.MojoExecutor.execute(MojoExecutor.java:153)
	at org.apache.maven.lifecycle.internal.MojoExecutor.execute(MojoExecutor.java:145)
	at org.apache.maven.lifecycle.internal.LifecycleModuleBuilder.buildProject(LifecycleModuleBuilder.java:84)
	at org.apache.maven.lifecycle.internal.LifecycleModuleBuilder.buildProject(LifecycleModuleBuilder.java:59)
	at org.apache.maven.lifecycle.internal.LifecycleStarter.singleThreadedBuild(LifecycleStarter.java:183)
	at org.apache.maven.lifecycle.internal.LifecycleStarter.execute(LifecycleStarter.java:161)
	at org.apache.maven.DefaultMaven.doExecute(DefaultMaven.java:320)
	at org.apache.maven.DefaultMaven.execute(DefaultMaven.java:156)
	at org.jvnet.hudson.maven3.launcher.Maven3Launcher.main(Maven3Launcher.java:79)
	at sun.reflect.NativeMethodAccessorImpl.invoke0(Native Method)
	at sun.reflect.NativeMethodAccessorImpl.invoke(NativeMethodAccessorImpl.java:39)
	at sun.reflect.DelegatingMethodAccessorImpl.invoke(DelegatingMethodAccessorImpl.java:25)
	at java.lang.reflect.Method.invoke(Method.java:597)
	at org.codehaus.plexus.classworlds.launcher.Launcher.launchStandard(Launcher.java:329)
	at org.codehaus.plexus.classworlds.launcher.Launcher.launch(Launcher.java:239)
	at org.jvnet.hudson.maven3.agent.Maven3Main.launch(Maven3Main.java:158)
	at hudson.maven.Maven3Builder.call(Maven3Builder.java:100)
	at hudson.maven.Maven3Builder.call(Maven3Builder.java:66)
	at hudson.remoting.UserRequest.perform(UserRequest.java:118)
	at hudson.remoting.UserRequest.perform(UserRequest.java:48)
	at hudson.remoting.Request$2.run(Request.java:326)
	at hudson.remoting.InterceptingExecutorService$1.call(InterceptingExecutorService.java:72)
	at java.util.concurrent.FutureTask$Sync.innerRun(FutureTask.java:303)
	at java.util.concurrent.FutureTask.run(FutureTask.java:138)
	at java.util.concurrent.ThreadPoolExecutor$Worker.runTask(ThreadPoolExecutor.java:886)
	at java.util.concurrent.ThreadPoolExecutor$Worker.run(ThreadPoolExecutor.java:908)
	at java.lang.Thread.run(Thread.java:662)
Caused by: org.apache.maven.plugin.MojoFailureException: You have 1 Checkstyle violation.
	at org.apache.maven.plugin.checkstyle.CheckstyleViolationCheckMojo.execute(CheckstyleViolationCheckMojo.java:430)
	at org.apache.maven.plugin.DefaultBuildPluginManager.executeMojo(DefaultBuildPluginManager.java:101)
	at org.apache.maven.lifecycle.internal.MojoExecutor.execute(MojoExecutor.java:209)
	... 27 more
Sending e-mails to: commits@myfaces.apache.org
channel stopped
Updating TOBAGO-1241
Updating TOBAGO-1229

Mime
View raw message