myfaces-commits mailing list archives

Site index · List index
Message view « Date » · « Thread »
Top « Date » · « Thread »
From Apache Jenkins Server <jenk...@builds.apache.org>
Subject Build failed in Jenkins: myfaces-current22 #788
Date Mon, 18 Mar 2013 07:30:57 GMT
See <https://builds.apache.org/job/myfaces-current22/788/>

------------------------------------------
[...truncated 3974 lines...]

Tests run: 0, Failures: 0, Errors: 0, Skipped: 0

[JENKINS] Recording test results
[INFO] 
[INFO] --- maven-bundle-plugin:2.3.4:bundle (default-bundle) @ myfaces-bundle ---
[INFO] 
[INFO] --- maven-site-plugin:3.0:attach-descriptor (attach-descriptor) @ myfaces-bundle ---
Mar 18, 2013 7:30:28 AM hudson.maven.ExecutedMojo <init>
WARNING: Failed to getClass for org.apache.maven.plugin.source.SourceJarMojo
[INFO] 
[INFO] --- maven-source-plugin:2.0.4:jar (attach-source) @ myfaces-bundle ---
[INFO] Building jar: <https://builds.apache.org/job/myfaces-current22/ws/2.2.x/bundle/target/myfaces-bundle-2.2.0-SNAPSHOT-sources.jar>
[INFO] 
[INFO] --- maven-checkstyle-plugin:2.7:check (verify-style) @ myfaces-bundle ---
[INFO] 
[INFO] 
[INFO] --- maven-install-plugin:2.3.1:install (default-install) @ myfaces-bundle ---
[INFO] Installing <https://builds.apache.org/job/myfaces-current22/ws/2.2.x/bundle/target/myfaces-bundle-2.2.0-SNAPSHOT.jar>
to /home/jenkins/jenkins-slave/maven-repositories/1/org/apache/myfaces/core/myfaces-bundle/2.2.0-SNAPSHOT/myfaces-bundle-2.2.0-SNAPSHOT.jar
[INFO] Installing <https://builds.apache.org/job/myfaces-current22/ws/2.2.x/bundle/pom.xml>
to /home/jenkins/jenkins-slave/maven-repositories/1/org/apache/myfaces/core/myfaces-bundle/2.2.0-SNAPSHOT/myfaces-bundle-2.2.0-SNAPSHOT.pom
[INFO] Installing <https://builds.apache.org/job/myfaces-current22/ws/2.2.x/bundle/target/myfaces-bundle-2.2.0-SNAPSHOT-sources.jar>
to /home/jenkins/jenkins-slave/maven-repositories/1/org/apache/myfaces/core/myfaces-bundle/2.2.0-SNAPSHOT/myfaces-bundle-2.2.0-SNAPSHOT-sources.jar
[INFO] 
[INFO] --- maven-bundle-plugin:2.3.4:install (default-install) @ myfaces-bundle ---
[WARNING] Exception while updating local OBR: Unable to read repository xml: file:/home/jenkins/jenkins-slave/maven-repositories/1/repository.xml
org.apache.maven.plugin.MojoExecutionException: Unable to read repository xml: file:/home/jenkins/jenkins-slave/maven-repositories/1/repository.xml
	at org.apache.felix.obrplugin.ObrUpdate.parseRepositoryXml(ObrUpdate.java:295)
	at org.apache.felix.obrplugin.ObrInstall.execute(ObrInstall.java:140)
	at org.apache.maven.plugin.DefaultBuildPluginManager.executeMojo(DefaultBuildPluginManager.java:101)
	at org.apache.maven.lifecycle.internal.MojoExecutor.execute(MojoExecutor.java:209)
	at org.apache.maven.lifecycle.internal.MojoExecutor.execute(MojoExecutor.java:153)
	at org.apache.maven.lifecycle.internal.MojoExecutor.execute(MojoExecutor.java:145)
	at org.apache.maven.lifecycle.internal.LifecycleModuleBuilder.buildProject(LifecycleModuleBuilder.java:84)
	at org.apache.maven.lifecycle.internal.LifecycleModuleBuilder.buildProject(LifecycleModuleBuilder.java:59)
	at org.apache.maven.lifecycle.internal.LifecycleStarter.singleThreadedBuild(LifecycleStarter.java:183)
	at org.apache.maven.lifecycle.internal.LifecycleStarter.execute(LifecycleStarter.java:161)
	at org.apache.maven.DefaultMaven.doExecute(DefaultMaven.java:320)
	at org.apache.maven.DefaultMaven.execute(DefaultMaven.java:156)
	at org.jvnet.hudson.maven3.launcher.Maven3Launcher.main(Maven3Launcher.java:79)
	at sun.reflect.NativeMethodAccessorImpl.invoke0(Native Method)
	at sun.reflect.NativeMethodAccessorImpl.invoke(NativeMethodAccessorImpl.java:39)
	at sun.reflect.DelegatingMethodAccessorImpl.invoke(DelegatingMethodAccessorImpl.java:25)
	at java.lang.reflect.Method.invoke(Method.java:597)
	at org.codehaus.plexus.classworlds.launcher.Launcher.launchStandard(Launcher.java:329)
	at org.codehaus.plexus.classworlds.launcher.Launcher.launch(Launcher.java:239)
	at org.jvnet.hudson.maven3.agent.Maven3Main.launch(Maven3Main.java:158)
	at hudson.maven.Maven3Builder.call(Maven3Builder.java:100)
	at hudson.maven.Maven3Builder.call(Maven3Builder.java:66)
	at hudson.remoting.UserRequest.perform(UserRequest.java:118)
	at hudson.remoting.UserRequest.perform(UserRequest.java:48)
	at hudson.remoting.Request$2.run(Request.java:326)
	at hudson.remoting.InterceptingExecutorService$1.call(InterceptingExecutorService.java:72)
	at java.util.concurrent.FutureTask$Sync.innerRun(FutureTask.java:303)
	at java.util.concurrent.FutureTask.run(FutureTask.java:138)
	at java.util.concurrent.ThreadPoolExecutor$Worker.runTask(ThreadPoolExecutor.java:886)
	at java.util.concurrent.ThreadPoolExecutor$Worker.run(ThreadPoolExecutor.java:908)
	at java.lang.Thread.run(Thread.java:662)
Caused by: org.xmlpull.v1.XmlPullParserException: unexpected type (position:END_DOCUMENT null@3:1
in java.io.InputStreamReader@a80456) 
	at org.kxml2.io.KXmlParser.exception(Unknown Source)
	at org.kxml2.io.KXmlParser.nextTag(Unknown Source)
	at org.apache.felix.bundlerepository.impl.PullParser.parseRepository(PullParser.java:43)
	at org.apache.felix.bundlerepository.impl.DataModelHelperImpl.repository(DataModelHelperImpl.java:147)
	at org.apache.felix.bundlerepository.impl.DataModelHelperImpl.repository(DataModelHelperImpl.java:118)
	at org.apache.felix.obrplugin.ObrUpdate.parseRepositoryXml(ObrUpdate.java:291)
	... 30 more
[INFO]                                                                         
[INFO] ------------------------------------------------------------------------
[INFO] Building Apache MyFaces JSF-2.2 Core Module 2.2.0-SNAPSHOT
[INFO] ------------------------------------------------------------------------
[INFO] 
[INFO] --- maven-remote-resources-plugin:1.2.1:process (default) @ myfaces-core-module ---
[INFO] 
[INFO] --- maven-site-plugin:3.0:attach-descriptor (attach-descriptor) @ myfaces-core-module
---
[INFO] 
[INFO] --- maven-checkstyle-plugin:2.7:check (verify-style) @ myfaces-core-module ---
[INFO] 
[INFO] [INFO] Installing <https://builds.apache.org/job/myfaces-current22/ws/2.2.x/pom.xml>
to /home/jenkins/jenkins-slave/maven-repositories/1/org/apache/myfaces/core/myfaces-core-module/2.2.0-SNAPSHOT/myfaces-core-module-2.2.0-SNAPSHOT.pom

[INFO] --- maven-install-plugin:2.3.1:install (default-install) @ myfaces-core-module ---
[INFO]                                                                         
[INFO] ------------------------------------------------------------------------
[INFO] Building client-window-example 2.2.0-SNAPSHOT
[INFO] ------------------------------------------------------------------------
[INFO] 
[INFO] --- maven-remote-resources-plugin:1.2.1:process (default) @ client-window-example ---
[debug] execute contextualize
[INFO] [INFO] Using 'UTF-8' encoding to copy filtered resources.

[INFO] --- maven-resources-plugin:2.5:resources (default-resources) @ client-window-example
---
[INFO] Copying 0 resource
[INFO] Copying 3 resources
[INFO] 
[INFO] --- maven-compiler-plugin:2.3.2:compile (default-compile) @ client-window-example ---
[INFO] Compiling 9 source files to <https://builds.apache.org/job/myfaces-current22/ws/2.2.x/client-window-example/target/classes>
[INFO] 
[INFO] --- build-helper-maven-plugin:1.7:add-test-resource (add-webapp-folder-as-test) @ client-window-example
---
[debug] execute contextualize
[INFO] [INFO] Using 'UTF-8' encoding to copy filtered resources.

[INFO] --- maven-resources-plugin:2.5:testResources (default-testResources) @ client-window-example
---
[INFO] Copying 1 resource
[INFO] Copying 3 resources
[INFO] Copying 25 resources to webapp
[INFO] 
[INFO] --- maven-compiler-plugin:2.3.2:testCompile (default-testCompile) @ client-window-example
---
[INFO] Compiling 1 source file to <https://builds.apache.org/job/myfaces-current22/ws/2.2.x/client-window-example/target/test-classes>
[INFO] [INFO] Surefire report directory: <https://builds.apache.org/job/myfaces-current22/ws/2.2.x/client-window-example/target/surefire-reports>

[INFO] 
-------------------------------------------------------
 T E S T S
-------------------------------------------------------
--- maven-surefire-plugin:2.9:test (default-test) @ client-window-example ---
Running org.apache.myfaces.example.clientWindow.CheckFaceletsFileTestCase
Mar 18, 2013 7:30:33 AM org.apache.myfaces.util.ExternalSpecifications isUnifiedELAvailable
INFO: MyFaces Unified EL support enabled
Tests run: 3, Failures: 0, Errors: 0, Skipped: 0, Time elapsed: 0.978 sec

Results :

Tests run: 3, Failures: 0, Errors: 0, Skipped: 0

[JENKINS] Recording test results
[INFO] 
[INFO] --- maven-war-plugin:2.1.1:war (default-war) @ client-window-example ---
[INFO] Packaging webapp
[INFO] Assembling webapp [client-window-example] in [<https://builds.apache.org/job/myfaces-current22/ws/2.2.x/client-window-example/target/client-window-example]>
[INFO] Processing war project
[INFO] Copying webapp resources [<https://builds.apache.org/job/myfaces-current22/ws/2.2.x/client-window-example/src/main/webapp]>
[INFO] Webapp assembled in [103 msecs]
[INFO] Building war: <https://builds.apache.org/job/myfaces-current22/ws/2.2.x/client-window-example/target/client-window-example.war>
[INFO] WEB-INF/web.xml already added, skipping
[INFO] 
[INFO] --- maven-site-plugin:3.0:attach-descriptor (attach-descriptor) @ client-window-example
---
[INFO] 
[INFO] --- maven-checkstyle-plugin:2.7:check (verify-style) @ client-window-example ---
[INFO] 
[INFO] [INFO] Installing <https://builds.apache.org/job/myfaces-current22/ws/2.2.x/client-window-example/target/client-window-example.war>
to /home/jenkins/jenkins-slave/maven-repositories/1/org/apache/myfaces/example/clientWindow/client-window-example/2.2.0-SNAPSHOT/client-window-example-2.2.0-SNAPSHOT.war

[INFO] --- maven-install-plugin:2.3.1:install (default-install) @ client-window-example ---
[INFO] Installing <https://builds.apache.org/job/myfaces-current22/ws/2.2.x/client-window-example/pom.xml>
to /home/jenkins/jenkins-slave/maven-repositories/1/org/apache/myfaces/example/clientWindow/client-window-example/2.2.0-SNAPSHOT/client-window-example-2.2.0-SNAPSHOT.pom
[INFO] ------------------------------------------------------------------------
[INFO] Reactor Summary:
[INFO] 
[INFO] Apache MyFaces JSF-2.2 Core Project ............... SUCCESS [7.707s]
[INFO] Apache MyFaces JSF-2.2 Core API ................... SUCCESS [37.846s]
[INFO] Apache MyFaces Shared Public API For JSF 2.1 - Core  SUCCESS [8.393s]
[INFO] Apache MyFaces Core For JSF 2.2 - Shared .......... SUCCESS [8.539s]
[INFO] Apache MyFaces JSF-2.2 Core Impl .................. SUCCESS [1:11.416s]
[INFO] Apache MyFaces JSF-2.1 Core OSGi Bundle ........... SUCCESS [3.598s]
[INFO] Apache MyFaces JSF-2.2 Core Module ................ SUCCESS [0.366s]
[INFO] client-window-example ............................. SUCCESS [5.686s]
[INFO] ------------------------------------------------------------------------
[INFO] BUILD SUCCESS
[INFO] ------------------------------------------------------------------------
[INFO] Total time: 2:28.425s
[INFO] Finished at: Mon Mar 18 07:30:38 UTC 2013
[INFO] Final Memory: 75M/457M
[INFO] ------------------------------------------------------------------------
[JENKINS] Archiving <https://builds.apache.org/job/myfaces-current22/ws/2.2.x/client-window-example/pom.xml>
to /home/hudson/hudson/jobs/myfaces-current22/modules/org.apache.myfaces.example.clientWindow$client-window-example/builds/2013-03-18_07-28-04/archive/org.apache.myfaces.example.clientWindow/client-window-example/2.2.0-SNAPSHOT/client-window-example-2.2.0-SNAPSHOT.pom
[JENKINS] Archiving <https://builds.apache.org/job/myfaces-current22/ws/2.2.x/client-window-example/target/client-window-example.war>
to /home/hudson/hudson/jobs/myfaces-current22/modules/org.apache.myfaces.example.clientWindow$client-window-example/builds/2013-03-18_07-28-04/archive/org.apache.myfaces.example.clientWindow/client-window-example/2.2.0-SNAPSHOT/client-window-example-2.2.0-SNAPSHOT.war
[JENKINS] Archiving <https://builds.apache.org/job/myfaces-current22/ws/2.2.x/bundle/pom.xml>
to /home/hudson/hudson/jobs/myfaces-current22/modules/org.apache.myfaces.core$myfaces-bundle/builds/2013-03-18_07-28-04/archive/org.apache.myfaces.core/myfaces-bundle/2.2.0-SNAPSHOT/myfaces-bundle-2.2.0-SNAPSHOT.pom
[JENKINS] Archiving <https://builds.apache.org/job/myfaces-current22/ws/2.2.x/bundle/target/myfaces-bundle-2.2.0-SNAPSHOT.jar>
to /home/hudson/hudson/jobs/myfaces-current22/modules/org.apache.myfaces.core$myfaces-bundle/builds/2013-03-18_07-28-04/archive/org.apache.myfaces.core/myfaces-bundle/2.2.0-SNAPSHOT/myfaces-bundle-2.2.0-SNAPSHOT.jar
[JENKINS] Archiving <https://builds.apache.org/job/myfaces-current22/ws/2.2.x/bundle/target/myfaces-bundle-2.2.0-SNAPSHOT-sources.jar>
to /home/hudson/hudson/jobs/myfaces-current22/modules/org.apache.myfaces.core$myfaces-bundle/builds/2013-03-18_07-28-04/archive/org.apache.myfaces.core/myfaces-bundle/2.2.0-SNAPSHOT/myfaces-bundle-2.2.0-SNAPSHOT-sources.jar
[JENKINS] Archiving <https://builds.apache.org/job/myfaces-current22/ws/2.2.x/shared/pom.xml>
to /home/hudson/hudson/jobs/myfaces-current22/modules/org.apache.myfaces.core.internal$myfaces-impl-shared/builds/2013-03-18_07-28-04/archive/org.apache.myfaces.core.internal/myfaces-impl-shared/2.2.0-SNAPSHOT/myfaces-impl-shared-2.2.0-SNAPSHOT.pom
[JENKINS] Archiving <https://builds.apache.org/job/myfaces-current22/ws/2.2.x/shared/target/myfaces-impl-shared-2.2.0-SNAPSHOT.jar>
to /home/hudson/hudson/jobs/myfaces-current22/modules/org.apache.myfaces.core.internal$myfaces-impl-shared/builds/2013-03-18_07-28-04/archive/org.apache.myfaces.core.internal/myfaces-impl-shared/2.2.0-SNAPSHOT/myfaces-impl-shared-2.2.0-SNAPSHOT.jar
[JENKINS] Archiving <https://builds.apache.org/job/myfaces-current22/ws/2.2.x/shared/target/myfaces-impl-shared-2.2.0-SNAPSHOT-sources.jar>
to /home/hudson/hudson/jobs/myfaces-current22/modules/org.apache.myfaces.core.internal$myfaces-impl-shared/builds/2013-03-18_07-28-04/archive/org.apache.myfaces.core.internal/myfaces-impl-shared/2.2.0-SNAPSHOT/myfaces-impl-shared-2.2.0-SNAPSHOT-sources.jar
[JENKINS] Archiving <https://builds.apache.org/job/myfaces-current22/ws/2.2.x/shared-public/pom.xml>
to /home/hudson/hudson/jobs/myfaces-current22/modules/org.apache.myfaces.core.internal$myfaces-impl-shared-public/builds/2013-03-18_07-28-04/archive/org.apache.myfaces.core.internal/myfaces-impl-shared-public/2.2.0-SNAPSHOT/myfaces-impl-shared-public-2.2.0-SNAPSHOT.pom
[JENKINS] Archiving <https://builds.apache.org/job/myfaces-current22/ws/2.2.x/shared-public/target/myfaces-impl-shared-public-2.2.0-SNAPSHOT.jar>
to /home/hudson/hudson/jobs/myfaces-current22/modules/org.apache.myfaces.core.internal$myfaces-impl-shared-public/builds/2013-03-18_07-28-04/archive/org.apache.myfaces.core.internal/myfaces-impl-shared-public/2.2.0-SNAPSHOT/myfaces-impl-shared-public-2.2.0-SNAPSHOT.jar
[JENKINS] Archiving <https://builds.apache.org/job/myfaces-current22/ws/2.2.x/shared-public/target/myfaces-impl-shared-public-2.2.0-SNAPSHOT-sources.jar>
to /home/hudson/hudson/jobs/myfaces-current22/modules/org.apache.myfaces.core.internal$myfaces-impl-shared-public/builds/2013-03-18_07-28-04/archive/org.apache.myfaces.core.internal/myfaces-impl-shared-public/2.2.0-SNAPSHOT/myfaces-impl-shared-public-2.2.0-SNAPSHOT-sources.jar
[JENKINS] Archiving <https://builds.apache.org/job/myfaces-current22/ws/2.2.x/api/pom.xml>
to /home/hudson/hudson/jobs/myfaces-current22/modules/org.apache.myfaces.core$myfaces-api/builds/2013-03-18_07-28-04/archive/org.apache.myfaces.core/myfaces-api/2.2.0-SNAPSHOT/myfaces-api-2.2.0-SNAPSHOT.pom
[JENKINS] Archiving <https://builds.apache.org/job/myfaces-current22/ws/2.2.x/api/target/myfaces-api-2.2.0-SNAPSHOT.jar>
to /home/hudson/hudson/jobs/myfaces-current22/modules/org.apache.myfaces.core$myfaces-api/builds/2013-03-18_07-28-04/archive/org.apache.myfaces.core/myfaces-api/2.2.0-SNAPSHOT/myfaces-api-2.2.0-SNAPSHOT.jar
[JENKINS] Archiving <https://builds.apache.org/job/myfaces-current22/ws/2.2.x/api/target/myfaces-api-2.2.0-SNAPSHOT-sources.jar>
to /home/hudson/hudson/jobs/myfaces-current22/modules/org.apache.myfaces.core$myfaces-api/builds/2013-03-18_07-28-04/archive/org.apache.myfaces.core/myfaces-api/2.2.0-SNAPSHOT/myfaces-api-2.2.0-SNAPSHOT-sources.jar
[JENKINS] Archiving <https://builds.apache.org/job/myfaces-current22/ws/2.2.x/api/target/myfaces-api-2.2.0-SNAPSHOT-tests.jar>
to /home/hudson/hudson/jobs/myfaces-current22/modules/org.apache.myfaces.core$myfaces-api/builds/2013-03-18_07-28-04/archive/org.apache.myfaces.core/myfaces-api/2.2.0-SNAPSHOT/myfaces-api-2.2.0-SNAPSHOT-tests.jar
[JENKINS] Archiving <https://builds.apache.org/job/myfaces-current22/ws/2.2.x/impl/pom.xml>
to /home/hudson/hudson/jobs/myfaces-current22/modules/org.apache.myfaces.core$myfaces-impl/builds/2013-03-18_07-28-04/archive/org.apache.myfaces.core/myfaces-impl/2.2.0-SNAPSHOT/myfaces-impl-2.2.0-SNAPSHOT.pom
[JENKINS] Archiving <https://builds.apache.org/job/myfaces-current22/ws/2.2.x/impl/target/myfaces-impl-2.2.0-SNAPSHOT.jar>
to /home/hudson/hudson/jobs/myfaces-current22/modules/org.apache.myfaces.core$myfaces-impl/builds/2013-03-18_07-28-04/archive/org.apache.myfaces.core/myfaces-impl/2.2.0-SNAPSHOT/myfaces-impl-2.2.0-SNAPSHOT.jar
[JENKINS] Archiving <https://builds.apache.org/job/myfaces-current22/ws/2.2.x/impl/target/myfaces-impl-2.2.0-SNAPSHOT-sources.jar>
to /home/hudson/hudson/jobs/myfaces-current22/modules/org.apache.myfaces.core$myfaces-impl/builds/2013-03-18_07-28-04/archive/org.apache.myfaces.core/myfaces-impl/2.2.0-SNAPSHOT/myfaces-impl-2.2.0-SNAPSHOT-sources.jar
[JENKINS] Archiving <https://builds.apache.org/job/myfaces-current22/ws/2.2.x/impl/target/myfaces-impl-2.2.0-SNAPSHOT-tests.jar>
to /home/hudson/hudson/jobs/myfaces-current22/modules/org.apache.myfaces.core$myfaces-impl/builds/2013-03-18_07-28-04/archive/org.apache.myfaces.core/myfaces-impl/2.2.0-SNAPSHOT/myfaces-impl-2.2.0-SNAPSHOT-tests.jar
[JENKINS] Archiving <https://builds.apache.org/job/myfaces-current22/ws/2.2.x/pom.xml>
to /home/hudson/hudson/jobs/myfaces-current22/modules/org.apache.myfaces.core$myfaces-core-module/builds/2013-03-18_07-28-04/archive/org.apache.myfaces.core/myfaces-core-module/2.2.0-SNAPSHOT/myfaces-core-module-2.2.0-SNAPSHOT.pom
[JENKINS] Archiving <https://builds.apache.org/job/myfaces-current22/ws/2.2.x/parent/pom.xml>
to /home/hudson/hudson/jobs/myfaces-current22/modules/org.apache.myfaces.core$myfaces-core-project/builds/2013-03-18_07-28-04/archive/org.apache.myfaces.core/myfaces-core-project/2.2.0-SNAPSHOT/myfaces-core-project-2.2.0-SNAPSHOT.pom
[JENKINS] Archiving <https://builds.apache.org/job/myfaces-current22/ws/2.2.x/parent/target/myfaces-core-project-2.2.0-SNAPSHOT-site.xml>
to /home/hudson/hudson/jobs/myfaces-current22/modules/org.apache.myfaces.core$myfaces-core-project/builds/2013-03-18_07-28-04/archive/org.apache.myfaces.core/myfaces-core-project/2.2.0-SNAPSHOT/myfaces-core-project-2.2.0-SNAPSHOT-site.xml
Waiting for Jenkins to finish collecting data
channel stopped
Maven RedeployPublisher use remote ubuntu3 maven settings from : /home/jenkins/.m2/settings.xml
[ERROR] uniqueVersion == false is not anymore supported in maven 3
[INFO] Deployment in https://repository.apache.org/content/repositories/snapshots (id=apache.snapshots.https,uniqueVersion=false)
Deploying the main artifact myfaces-api-2.2.0-SNAPSHOT.jar
Downloading: https://repository.apache.org/content/repositories/snapshots/org/apache/myfaces/core/myfaces-api/2.2.0-SNAPSHOT/maven-metadata.xml
Downloaded: https://repository.apache.org/content/repositories/snapshots/org/apache/myfaces/core/myfaces-api/2.2.0-SNAPSHOT/maven-metadata.xml
(2 KB at 1.2 KB/sec)
Uploading: https://repository.apache.org/content/repositories/snapshots/org/apache/myfaces/core/myfaces-api/2.2.0-SNAPSHOT/myfaces-api-2.2.0-20130318.073048-745.jar
Uploaded: https://repository.apache.org/content/repositories/snapshots/org/apache/myfaces/core/myfaces-api/2.2.0-SNAPSHOT/myfaces-api-2.2.0-20130318.073048-745.jar
(1214 KB at 1728.6 KB/sec)
Uploading: https://repository.apache.org/content/repositories/snapshots/org/apache/myfaces/core/myfaces-api/2.2.0-SNAPSHOT/myfaces-api-2.2.0-20130318.073048-745.pom
Uploaded: https://repository.apache.org/content/repositories/snapshots/org/apache/myfaces/core/myfaces-api/2.2.0-SNAPSHOT/myfaces-api-2.2.0-20130318.073048-745.pom
(35 KB at 146.2 KB/sec)
Downloading: https://repository.apache.org/content/repositories/snapshots/org/apache/myfaces/core/myfaces-api/maven-metadata.xml
Downloaded: https://repository.apache.org/content/repositories/snapshots/org/apache/myfaces/core/myfaces-api/maven-metadata.xml
(572 B at 0.6 KB/sec)
Uploading: https://repository.apache.org/content/repositories/snapshots/org/apache/myfaces/core/myfaces-api/2.2.0-SNAPSHOT/maven-metadata.xml
Uploading: https://repository.apache.org/content/repositories/snapshots/org/apache/myfaces/core/myfaces-api/maven-metadata.xml
Uploaded: https://repository.apache.org/content/repositories/snapshots/org/apache/myfaces/core/myfaces-api/maven-metadata.xml
(572 B at 5.3 KB/sec)
ERROR: Failed to deploy metadata: Could not transfer metadata org.apache.myfaces.core:myfaces-api:2.2.0-SNAPSHOT/maven-metadata.xml
from/to apache.snapshots.https (https://repository.apache.org/content/repositories/snapshots):
The target server failed to respond
org.apache.maven.artifact.deployer.ArtifactDeploymentException: Failed to deploy metadata:
Could not transfer metadata org.apache.myfaces.core:myfaces-api:2.2.0-SNAPSHOT/maven-metadata.xml
from/to apache.snapshots.https (https://repository.apache.org/content/repositories/snapshots):
The target server failed to respond
	at org.apache.maven.artifact.deployer.DefaultArtifactDeployer.deploy(DefaultArtifactDeployer.java:141)
	at hudson.maven.reporters.MavenArtifactRecord.deploy(MavenArtifactRecord.java:190)
	at hudson.maven.RedeployPublisher.perform(RedeployPublisher.java:176)
	at hudson.tasks.BuildStepMonitor$1.perform(BuildStepMonitor.java:19)
	at hudson.model.AbstractBuild$AbstractBuildExecution.perform(AbstractBuild.java:810)
	at hudson.model.AbstractBuild$AbstractBuildExecution.performAllBuildSteps(AbstractBuild.java:785)
	at hudson.maven.MavenModuleSetBuild$MavenModuleSetBuildExecution.post2(MavenModuleSetBuild.java:946)
	at hudson.model.AbstractBuild$AbstractBuildExecution.post(AbstractBuild.java:732)
	at hudson.model.Run.execute(Run.java:1593)
	at hudson.maven.MavenModuleSetBuild.run(MavenModuleSetBuild.java:477)
	at hudson.model.ResourceController.execute(ResourceController.java:88)
	at hudson.model.Executor.run(Executor.java:236)
Caused by: org.sonatype.aether.deployment.DeploymentException: Failed to deploy metadata:
Could not transfer metadata org.apache.myfaces.core:myfaces-api:2.2.0-SNAPSHOT/maven-metadata.xml
from/to apache.snapshots.https (https://repository.apache.org/content/repositories/snapshots):
The target server failed to respond
	at org.sonatype.aether.impl.internal.DefaultDeployer.deploy(DefaultDeployer.java:311)
	at org.sonatype.aether.impl.internal.DefaultDeployer.deploy(DefaultDeployer.java:211)
	at org.sonatype.aether.impl.internal.DefaultRepositorySystem.deploy(DefaultRepositorySystem.java:443)
	at org.apache.maven.artifact.deployer.DefaultArtifactDeployer.deploy(DefaultArtifactDeployer.java:137)
	... 11 more
Caused by: org.sonatype.aether.transfer.MetadataTransferException: Could not transfer metadata
org.apache.myfaces.core:myfaces-api:2.2.0-SNAPSHOT/maven-metadata.xml from/to apache.snapshots.https
(https://repository.apache.org/content/repositories/snapshots): The target server failed to
respond
	at org.sonatype.aether.connector.wagon.WagonRepositoryConnector$3.wrap(WagonRepositoryConnector.java:930)
	at org.sonatype.aether.connector.wagon.WagonRepositoryConnector$3.wrap(WagonRepositoryConnector.java:920)
	at org.sonatype.aether.connector.wagon.WagonRepositoryConnector$PutTask.run(WagonRepositoryConnector.java:837)
	at org.sonatype.aether.connector.wagon.WagonRepositoryConnector.put(WagonRepositoryConnector.java:475)
	at org.sonatype.aether.impl.internal.DefaultDeployer.deploy(DefaultDeployer.java:305)
	... 14 more
Caused by: org.apache.maven.wagon.TransferFailedException: The target server failed to respond
	at org.apache.maven.wagon.shared.http4.AbstractHttpClientWagon.put(AbstractHttpClientWagon.java:567)
	at org.apache.maven.wagon.shared.http4.AbstractHttpClientWagon.put(AbstractHttpClientWagon.java:509)
	at org.apache.maven.wagon.shared.http4.AbstractHttpClientWagon.put(AbstractHttpClientWagon.java:490)
	at org.apache.maven.wagon.shared.http4.AbstractHttpClientWagon.put(AbstractHttpClientWagon.java:470)
	at org.sonatype.aether.connector.wagon.WagonRepositoryConnector$PutTask.run(WagonRepositoryConnector.java:811)
	... 16 more
Caused by: org.apache.maven.wagon.providers.http.httpclient.NoHttpResponseException: The target
server failed to respond
	at org.apache.maven.wagon.providers.http.httpclient.impl.conn.DefaultHttpResponseParser.parseHead(DefaultHttpResponseParser.java:95)
	at org.apache.maven.wagon.providers.http.httpclient.impl.conn.DefaultHttpResponseParser.parseHead(DefaultHttpResponseParser.java:62)
	at org.apache.maven.wagon.providers.http.httpclient.impl.io.AbstractMessageParser.parse(AbstractMessageParser.java:254)
	at org.apache.maven.wagon.providers.http.httpclient.impl.AbstractHttpClientConnection.receiveResponseHeader(AbstractHttpClientConnection.java:289)
	at org.apache.maven.wagon.providers.http.httpclient.impl.conn.DefaultClientConnection.receiveResponseHeader(DefaultClientConnection.java:252)
	at org.apache.maven.wagon.providers.http.httpclient.impl.conn.AbstractClientConnAdapter.receiveResponseHeader(AbstractClientConnAdapter.java:219)
	at org.apache.maven.wagon.providers.http.httpclient.protocol.HttpRequestExecutor.doReceiveResponse(HttpRequestExecutor.java:300)
	at org.apache.maven.wagon.providers.http.httpclient.protocol.HttpRequestExecutor.execute(HttpRequestExecutor.java:127)
	at org.apache.maven.wagon.providers.http.httpclient.impl.client.DefaultRequestDirector.tryExecute(DefaultRequestDirector.java:712)
	at org.apache.maven.wagon.providers.http.httpclient.impl.client.DefaultRequestDirector.execute(DefaultRequestDirector.java:517)
	at org.apache.maven.wagon.providers.http.httpclient.impl.client.AbstractHttpClient.execute(AbstractHttpClient.java:906)
	at org.apache.maven.wagon.providers.http.httpclient.impl.client.AbstractHttpClient.execute(AbstractHttpClient.java:805)
	at org.apache.maven.wagon.shared.http4.AbstractHttpClientWagon.execute(AbstractHttpClientWagon.java:733)
	at org.apache.maven.wagon.shared.http4.AbstractHttpClientWagon.put(AbstractHttpClientWagon.java:561)
	... 20 more
[INFO] Deployment failed after 8.3 sec
Build step 'Deploy artifacts to Maven repository' changed build result to FAILURE

Mime
View raw message