myfaces-commits mailing list archives

Site index · List index
Message view « Date » · « Thread »
Top « Date » · « Thread »
From Apache Jenkins Server <jenk...@builds.apache.org>
Subject Build failed in Jenkins: tobago-1.5.x » Tobago Example Addressbook #132
Date Wed, 06 Feb 2013 13:08:24 GMT
See <https://builds.apache.org/job/tobago-1.5.x/org.apache.myfaces.tobago$tobago-example-addressbook/132/>

------------------------------------------
[INFO] ------------------------------------------------------------------------
[INFO] Building Tobago Example Addressbook
[INFO]    task-segment: [clean, animal-sniffer:check, checkstyle:check, install]
[INFO] ------------------------------------------------------------------------
[INFO] [clean:clean {execution: default-clean}]
[INFO] Deleting <https://builds.apache.org/job/tobago-1.5.x/org.apache.myfaces.tobago$tobago-example-addressbook/ws/target>
[INFO] [animal-sniffer:check {execution: default-cli}]
[INFO] Checking unresolved references to org.codehaus.mojo.signature:java15:1.0
[INFO] [checkstyle:check {execution: default-cli}]
[INFO] 
[INFO] [enforcer:enforce {execution: enforce}]
[INFO] [remote-resources:process {execution: default}]
[debug] execute contextualize
[INFO] [resources:resources {execution: default-resources}]
[INFO] Using 'UTF-8' encoding to copy filtered resources.
[INFO] Copying 2 resources
[INFO] Copying 3 resources
[INFO] [build-helper:add-source {execution: default}]
[INFO] Source directory: <https://builds.apache.org/job/tobago-1.5.x/org.apache.myfaces.tobago$tobago-example-addressbook/ws/src/main/java-jsf-1.2>
added.
[INFO] [compiler:compile {execution: default-compile}]
[INFO] Compiling 25 source files to <https://builds.apache.org/job/tobago-1.5.x/org.apache.myfaces.tobago$tobago-example-addressbook/ws/target/classes>
[INFO] -------------------------------------------------------------
[ERROR] COMPILATION ERROR : 
[INFO] -------------------------------------------------------------
[ERROR] <https://builds.apache.org/job/tobago-1.5.x/org.apache.myfaces.tobago$tobago-example-addressbook/ws/src/main/java/org/apache/myfaces/tobago/example/addressbook/web/AdminController.java>:[25,32]
package javax.annotation.security does not exist
[ERROR] <https://builds.apache.org/job/tobago-1.5.x/org.apache.myfaces.tobago$tobago-example-addressbook/ws/src/main/java/org/apache/myfaces/tobago/example/addressbook/web/AdminController.java>:[45,3]
cannot find symbol
symbol  : class RolesAllowed
location: class org.apache.myfaces.tobago.example.addressbook.web.AdminController
[INFO] 2 errors 
[INFO] -------------------------------------------------------------
[JENKINS] Archiving <https://builds.apache.org/job/tobago-1.5.x/org.apache.myfaces.tobago$tobago-example-addressbook/ws/pom.xml>
to /home/hudson/hudson/jobs/tobago-1.5.x/modules/org.apache.myfaces.tobago$tobago-example-addressbook/builds/2013-02-06_13-06-42/archive/org.apache.myfaces.tobago/tobago-example-addressbook/1.5.9-SNAPSHOT/tobago-example-addressbook-1.5.9-SNAPSHOT.pom
[INFO] ------------------------------------------------------------------------
[ERROR] BUILD FAILURE
[INFO] ------------------------------------------------------------------------
[INFO] Compilation failure

<https://builds.apache.org/job/tobago-1.5.x/org.apache.myfaces.tobago$tobago-example-addressbook/ws/src/main/java/org/apache/myfaces/tobago/example/addressbook/web/AdminController.java>:[25,32]
package javax.annotation.security does not exist
<https://builds.apache.org/job/tobago-1.5.x/org.apache.myfaces.tobago$tobago-example-addressbook/ws/src/main/java/org/apache/myfaces/tobago/example/addressbook/web/AdminController.java>:[45,3]
cannot find symbol
symbol  : class RolesAllowed
location: class org.apache.myfaces.tobago.example.addressbook.web.AdminController

[INFO] ------------------------------------------------------------------------
[INFO] For more information, run Maven with the -e switch
[INFO] ------------------------------------------------------------------------
[INFO] Total time: 1 minute 35 seconds
[INFO] Finished at: Wed Feb 06 13:08:23 UTC 2013
[INFO] Final Memory: 132M/472M
[INFO] ------------------------------------------------------------------------
Waiting for Jenkins to finish collecting data

Mime
View raw message