myfaces-commits mailing list archives

Site index · List index
Message view « Date » · « Thread »
Top « Date » · « Thread »
From Apache Jenkins Server <jenk...@builds.apache.org>
Subject Build failed in Jenkins: tobago-1.0.x-deploy #515
Date Wed, 23 Jan 2013 04:37:19 GMT
See <https://builds.apache.org/job/tobago-1.0.x-deploy/515/>

------------------------------------------
[...truncated 2364 lines...]
A         sandbox/src/main/resources/org/apache/myfaces/tobago/renderkit/html/sandbox/standard/image
AU        sandbox/src/main/resources/org/apache/myfaces/tobago/renderkit/html/sandbox/standard/image/sliderTriangle.gif
AU        sandbox/src/main/resources/org/apache/myfaces/tobago/renderkit/html/sandbox/standard/image/sliderEnd.gif
A         sandbox/src/main/resources/org/apache/myfaces/tobago/renderkit/html/sandbox/standard/property
AU        sandbox/src/main/resources/org/apache/myfaces/tobago/renderkit/html/sandbox/standard/property/tobago-theme-config.properties
A         sandbox/src/main/resources/org/apache/myfaces/tobago/renderkit/html/sandbox/mozilla
A         sandbox/src/main/resources/org/apache/myfaces/tobago/renderkit/html/sandbox/mozilla/style
AU        sandbox/src/main/resources/org/apache/myfaces/tobago/renderkit/html/sandbox/mozilla/style/style.css
A         sandbox/src/main/resources/org/apache/myfaces/tobago/renderkit/html/scarborough
A         sandbox/src/main/resources/org/apache/myfaces/tobago/renderkit/html/scarborough/standard
A         sandbox/src/main/resources/org/apache/myfaces/tobago/renderkit/html/scarborough/standard/script
AU        sandbox/src/main/resources/org/apache/myfaces/tobago/renderkit/html/scarborough/standard/script/tobago-tree.js
AU        sandbox/pom.xml
AU        sandbox/readme.txt
 U        .
At revision 1437268
no change for http://svn.apache.org/repos/asf/myfaces/tobago/branches/tobago-1.0.x since the
previous build
Parsing POMs
[tobago-1.0.x-deploy] $ /home/hudson/tools/java/latest1.5/bin/java -cp /home/jenkins/jenkins-slave/maven-agent.jar:/home/jenkins/jenkins-slave/classworlds.jar
hudson.maven.agent.Main /home/hudson/tools/maven/apache-maven-2.2.1 /home/jenkins/jenkins-slave/slave.jar
/home/jenkins/jenkins-slave/maven-interceptor.jar 37806 /home/jenkins/jenkins-slave/maven2.1-interceptor.jar
<===[JENKINS REMOTING CAPACITY]===channel started
>   log4j:WARN No appenders could be found for logger (org.apache.commons.beanutils.converters.BooleanConverter).
log4j:WARN Please initialize the log4j system properly.
Executing Maven:  -B -f <https://builds.apache.org/job/tobago-1.0.x-deploy/ws/tobago-1.0.x-deploy/pom.xml>
-Dmaven.repo.local=/home/jenkins/jenkins-slave/maven-repositories/0 clean source:jar deploy
-Pgenerate-assembly
[INFO] Scanning for projects...
[INFO] Reactor build order: 
[INFO]   Apache Tobago
[INFO]   Tobago Tool
[INFO]   Maven Apt Plugin
[INFO]   Maven Tobago Theme Plugin
[INFO]   Tobago Annotation
[INFO]   Tobago Apt
[INFO]   Tobago Core
[INFO]   Tobago Themes
[INFO]   Theme Standard
[INFO]   Theme Scarborough
[INFO]   Theme Speyside
[INFO]   Theme Richmond
[INFO]   Theme Charlotteville
[INFO]   Tobago Extensions
[INFO]   Tobago Facelets
[INFO]   Tobago Fileupload
[INFO]   Tobago Security
[INFO]   Tobago FacesMessage Ordering Fix
[INFO]   Tobago Examples
[INFO]   Example Addressbook
[INFO]   Example Addressbook Library
[INFO]   Example Addressbook Webapp
[INFO]   Example Blank
[INFO]   Data for Examples
[INFO]   Example Demo
[INFO]   Example Non-Faces-Request
[INFO]   Tobago Example Experimental
[INFO]   Tobago Example Test
[INFO]   Example Assembly
[INFO]   Tobago Sandbox
[INFO]   Tobago Assembly
[INFO] Searching repository for plugin with prefix: 'source'.
[INFO] ------------------------------------------------------------------------
[INFO] Building Apache Tobago
[INFO]    task-segment: [clean, source:jar, deploy]
[INFO] ------------------------------------------------------------------------
[INFO] [clean:clean {execution: default-clean}]
[INFO] Preparing source:jar
[JENKINS] Archiving <https://builds.apache.org/job/tobago-1.0.x-deploy/ws/tobago-1.0.x-deploy/pom.xml>
to /home/hudson/hudson/jobs/tobago-1.0.x-deploy/modules/org.apache.myfaces.tobago$tobago/builds/2013-01-23_04-35-13/archive/org.apache.myfaces.tobago/tobago/1.0.40-SNAPSHOT/tobago-1.0.40-SNAPSHOT.pom
[INFO] [buildnumber:create {execution: default}]
[INFO] Checking for local modifications: skipped.
[INFO] Updating project files from SCM: skipped.
[INFO] Executing: /bin/sh -c cd <https://builds.apache.org/job/tobago-1.0.x-deploy/ws/tobago-1.0.x-deploy>
&& svn --non-interactive info
[INFO] Working directory: <https://builds.apache.org/job/tobago-1.0.x-deploy/ws/tobago-1.0.x-deploy>
[INFO] Storing buildNumber: 1437268 at timestamp: 1358915763600
[INFO] Executing: /bin/sh -c cd <https://builds.apache.org/job/tobago-1.0.x-deploy/ws/tobago-1.0.x-deploy>
&& svn --non-interactive info
[INFO] Working directory: <https://builds.apache.org/job/tobago-1.0.x-deploy/ws/tobago-1.0.x-deploy>
[INFO] Storing buildScmBranch: branches/tobago-1.0.x
[INFO] [source:jar {execution: default-cli}]
[INFO] [buildnumber:create {execution: default}]
[INFO] Setting property: classpath.resource.loader.class => 'org.codehaus.plexus.velocity.ContextClassLoaderResourceLoader'.
[INFO] Setting property: velocimacro.messages.on => 'false'.
[INFO] Setting property: resource.loader => 'classpath'.
[INFO] Setting property: resource.manager.logwhenfound => 'false'.
[INFO] [remote-resources:process {execution: default}]
[INFO] [site:attach-descriptor {execution: default-attach-descriptor}]
[INFO] Parent project loaded from repository.
[INFO] [assembly:single {execution: source-release-assembly}]
[INFO] tobago-1.0.40-SNAPSHOT/ already added, skipping
[INFO] Building zip: <https://builds.apache.org/job/tobago-1.0.x-deploy/ws/tobago-1.0.x-deploy/target/tobago-1.0.40-SNAPSHOT-source-release.zip>
[INFO] tobago-1.0.40-SNAPSHOT/ already added, skipping
[INFO] [install:install {execution: default-install}]
[INFO] Installing <https://builds.apache.org/job/tobago-1.0.x-deploy/ws/tobago-1.0.x-deploy/pom.xml>
to /home/jenkins/jenkins-slave/maven-repositories/0/org/apache/myfaces/tobago/tobago/1.0.40-SNAPSHOT/tobago-1.0.40-SNAPSHOT.pom
[INFO] Installing <https://builds.apache.org/job/tobago-1.0.x-deploy/ws/tobago-1.0.x-deploy/target/tobago-1.0.40-SNAPSHOT-site.xml>
to /home/jenkins/jenkins-slave/maven-repositories/0/org/apache/myfaces/tobago/tobago/1.0.40-SNAPSHOT/tobago-1.0.40-SNAPSHOT-site.xml
[INFO] Installing <https://builds.apache.org/job/tobago-1.0.x-deploy/ws/tobago-1.0.x-deploy/target/tobago-1.0.40-SNAPSHOT-source-release.zip>
to /home/jenkins/jenkins-slave/maven-repositories/0/org/apache/myfaces/tobago/tobago/1.0.40-SNAPSHOT/tobago-1.0.40-SNAPSHOT-source-release.zip
[INFO] [deploy:deploy {execution: default-deploy}]
[INFO] Retrieving previous build number from apache.snapshots.https
[WARNING] *** CHECKSUM FAILED - Checksum failed on download: local = '76c1416d9111f04552af0f7b2e1ddabaa4076ea9';
remote = '44d0351027dc93d43a57467e0f3c005b00f24124' - RETRYING
[WARNING] *** CHECKSUM FAILED - Checksum failed on download: local = '76c1416d9111f04552af0f7b2e1ddabaa4076ea9';
remote = '44d0351027dc93d43a57467e0f3c005b00f24124' - IGNORING
Uploading: https://repository.apache.org/content/repositories/snapshots/org/apache/myfaces/tobago/tobago/1.0.40-SNAPSHOT/tobago-1.0.40-SNAPSHOT.pom
42K uploaded  (tobago-1.0.40-SNAPSHOT.pom)
[INFO] Retrieving previous metadata from apache.snapshots.https
[WARNING] *** CHECKSUM FAILED - Checksum failed on download: local = '76c1416d9111f04552af0f7b2e1ddabaa4076ea9';
remote = '44d0351027dc93d43a57467e0f3c005b00f24124' - RETRYING
[WARNING] *** CHECKSUM FAILED - Checksum failed on download: local = '76c1416d9111f04552af0f7b2e1ddabaa4076ea9';
remote = '44d0351027dc93d43a57467e0f3c005b00f24124' - IGNORING
[INFO] Uploading repository metadata for: 'snapshot org.apache.myfaces.tobago:tobago:1.0.40-SNAPSHOT'
[INFO] Retrieving previous metadata from apache.snapshots.https
[INFO] Uploading repository metadata for: 'artifact org.apache.myfaces.tobago:tobago'
[INFO] Retrieving previous build number from apache.snapshots.https
Uploading: https://repository.apache.org/content/repositories/snapshots/org/apache/myfaces/tobago/tobago/1.0.40-SNAPSHOT/tobago-1.0.40-SNAPSHOT-site.xml
3K uploaded  (tobago-1.0.40-SNAPSHOT-site.xml)
[INFO] Retrieving previous build number from apache.snapshots.https
Uploading: https://repository.apache.org/content/repositories/snapshots/org/apache/myfaces/tobago/tobago/1.0.40-SNAPSHOT/tobago-1.0.40-SNAPSHOT-source-release.zip
2944K uploaded  (tobago-1.0.40-SNAPSHOT-source-release.zip)
[JENKINS] Archiving <https://builds.apache.org/job/tobago-1.0.x-deploy/ws/tobago-1.0.x-deploy/target/tobago-1.0.40-SNAPSHOT-site.xml>
to /home/hudson/hudson/jobs/tobago-1.0.x-deploy/modules/org.apache.myfaces.tobago$tobago/builds/2013-01-23_04-35-13/archive/org.apache.myfaces.tobago/tobago/1.0.40-SNAPSHOT/tobago-1.0.40-SNAPSHOT-site.xml
[JENKINS] Archiving <https://builds.apache.org/job/tobago-1.0.x-deploy/ws/tobago-1.0.x-deploy/target/tobago-1.0.40-SNAPSHOT-source-release.zip>
to /home/hudson/hudson/jobs/tobago-1.0.x-deploy/modules/org.apache.myfaces.tobago$tobago/builds/2013-01-23_04-35-13/archive/org.apache.myfaces.tobago/tobago/1.0.40-SNAPSHOT/tobago-1.0.40-SNAPSHOT-source-release.zip
[INFO] ------------------------------------------------------------------------
[INFO] Building Tobago Tool
[INFO]    task-segment: [clean, source:jar, deploy]
[INFO] ------------------------------------------------------------------------
[INFO] [clean:clean {execution: default-clean}]
[INFO] Preparing source:jar
[JENKINS] Archiving <https://builds.apache.org/job/tobago-1.0.x-deploy/ws/tobago-1.0.x-deploy/tobago-tool/pom.xml>
to /home/hudson/hudson/jobs/tobago-1.0.x-deploy/modules/org.apache.myfaces.tobago$tobago-tool/builds/2013-01-23_04-35-13/archive/org.apache.myfaces.tobago/tobago-tool/1.0.40-SNAPSHOT/tobago-tool-1.0.40-SNAPSHOT.pom
[INFO] [buildnumber:create {execution: default}]
[INFO] [source:jar {execution: default-cli}]
[INFO] [buildnumber:create {execution: default}]
[INFO] [remote-resources:process {execution: default}]
[INFO] [site:attach-descriptor {execution: default-attach-descriptor}]
[INFO] [assembly:single {execution: source-release-assembly}]
[INFO] Skipping the assembly in this project because it's not the Execution Root
[INFO] [install:install {execution: default-install}]
[INFO] Installing <https://builds.apache.org/job/tobago-1.0.x-deploy/ws/tobago-1.0.x-deploy/tobago-tool/pom.xml>
to /home/jenkins/jenkins-slave/maven-repositories/0/org/apache/myfaces/tobago/tobago-tool/1.0.40-SNAPSHOT/tobago-tool-1.0.40-SNAPSHOT.pom
[INFO] [deploy:deploy {execution: default-deploy}]
[INFO] Retrieving previous build number from apache.snapshots.https
[WARNING] *** CHECKSUM FAILED - Checksum failed on download: local = 'ff47858d940a131e5d655cceb2886f413a983f3a';
remote = 'c5e521fb6ba267a85461741ca61ed03c036fe3bf' - RETRYING
[WARNING] *** CHECKSUM FAILED - Checksum failed on download: local = 'ff47858d940a131e5d655cceb2886f413a983f3a';
remote = 'c5e521fb6ba267a85461741ca61ed03c036fe3bf' - IGNORING
Uploading: https://repository.apache.org/content/repositories/snapshots/org/apache/myfaces/tobago/tobago-tool/1.0.40-SNAPSHOT/tobago-tool-1.0.40-SNAPSHOT.pom
1K uploaded  (tobago-tool-1.0.40-SNAPSHOT.pom)
[INFO] Retrieving previous metadata from apache.snapshots.https
[INFO] Uploading repository metadata for: 'artifact org.apache.myfaces.tobago:tobago-tool'
[INFO] Retrieving previous metadata from apache.snapshots.https
[WARNING] *** CHECKSUM FAILED - Checksum failed on download: local = 'ff47858d940a131e5d655cceb2886f413a983f3a';
remote = 'c5e521fb6ba267a85461741ca61ed03c036fe3bf' - RETRYING
[WARNING] *** CHECKSUM FAILED - Checksum failed on download: local = 'ff47858d940a131e5d655cceb2886f413a983f3a';
remote = 'c5e521fb6ba267a85461741ca61ed03c036fe3bf' - IGNORING
[INFO] Uploading repository metadata for: 'snapshot org.apache.myfaces.tobago:tobago-tool:1.0.40-SNAPSHOT'
[INFO] ------------------------------------------------------------------------
[INFO] Building Maven Apt Plugin
[INFO]    task-segment: [clean, source:jar, deploy]
[INFO] ------------------------------------------------------------------------
[INFO] [clean:clean {execution: default-clean}]
[INFO] Preparing source:jar
[JENKINS] Archiving <https://builds.apache.org/job/tobago-1.0.x-deploy/ws/tobago-1.0.x-deploy/tobago-tool/maven-apt-plugin/pom.xml>
to /home/hudson/hudson/jobs/tobago-1.0.x-deploy/modules/org.apache.myfaces.tobago$maven-apt-plugin/builds/2013-01-23_04-35-13/archive/org.apache.myfaces.tobago/maven-apt-plugin/1.0.40-SNAPSHOT/maven-apt-plugin-1.0.40-SNAPSHOT.pom
[INFO] [buildnumber:create {execution: default}]
[INFO] [source:jar {execution: default-cli}]
[INFO] Building jar: <https://builds.apache.org/job/tobago-1.0.x-deploy/ws/tobago-1.0.x-deploy/tobago-tool/maven-apt-plugin/target/maven-apt-plugin-1.0.40-SNAPSHOT-sources.jar>
[INFO] [buildnumber:create {execution: default}]
[INFO] [plugin:descriptor {execution: default-descriptor}]
[INFO] Using 'UTF-8' encoding to read mojo metadata.
[INFO] Applying mojo extractor for language: java
[INFO] Mojo extractor for language: java found 2 mojo descriptors.
[INFO] Applying mojo extractor for language: bsh
[INFO] Mojo extractor for language: bsh found 0 mojo descriptors.
[INFO] [remote-resources:process {execution: default}]
[INFO] [resources:resources {execution: default-resources}]
[INFO] Using 'UTF-8' encoding to copy filtered resources.
[INFO] Copying 2 resources
[INFO] Copying 3 resources
[INFO] [compiler:compile {execution: default-compile}]
[INFO] Compiling 4 source files to <https://builds.apache.org/job/tobago-1.0.x-deploy/ws/tobago-1.0.x-deploy/tobago-tool/maven-apt-plugin/target/classes>
[INFO] [resources:testResources {execution: default-testResources}]
[INFO] Using 'UTF-8' encoding to copy filtered resources.
[INFO] skip non existing resourceDirectory <https://builds.apache.org/job/tobago-1.0.x-deploy/ws/tobago-1.0.x-deploy/tobago-tool/maven-apt-plugin/src/test/resources>
[INFO] Copying 3 resources
[INFO] [compiler:testCompile {execution: default-testCompile}]
[INFO] No sources to compile
[INFO] [surefire:test {execution: default-test}]
[INFO] Surefire report directory: <https://builds.apache.org/job/tobago-1.0.x-deploy/ws/tobago-1.0.x-deploy/tobago-tool/maven-apt-plugin/target/surefire-reports>

-------------------------------------------------------
 T E S T S
-------------------------------------------------------
There are no tests to run.

Results :

Tests run: 0, Failures: 0, Errors: 0, Skipped: 0

[JENKINS] Recording test results
[INFO] [jar:jar {execution: default-jar}]
[INFO] Building jar: <https://builds.apache.org/job/tobago-1.0.x-deploy/ws/tobago-1.0.x-deploy/tobago-tool/maven-apt-plugin/target/maven-apt-plugin-1.0.40-SNAPSHOT.jar>
[INFO] [plugin:addPluginArtifactMetadata {execution: default-addPluginArtifactMetadata}]
[INFO] [assembly:single {execution: source-release-assembly}]
[INFO] Skipping the assembly in this project because it's not the Execution Root
[INFO] [install:install {execution: default-install}]
[INFO] Installing <https://builds.apache.org/job/tobago-1.0.x-deploy/ws/tobago-1.0.x-deploy/tobago-tool/maven-apt-plugin/target/maven-apt-plugin-1.0.40-SNAPSHOT.jar>
to /home/jenkins/jenkins-slave/maven-repositories/0/org/apache/myfaces/tobago/maven-apt-plugin/1.0.40-SNAPSHOT/maven-apt-plugin-1.0.40-SNAPSHOT.jar
[INFO] Installing <https://builds.apache.org/job/tobago-1.0.x-deploy/ws/tobago-1.0.x-deploy/tobago-tool/maven-apt-plugin/target/maven-apt-plugin-1.0.40-SNAPSHOT-sources.jar>
to /home/jenkins/jenkins-slave/maven-repositories/0/org/apache/myfaces/tobago/maven-apt-plugin/1.0.40-SNAPSHOT/maven-apt-plugin-1.0.40-SNAPSHOT-sources.jar
[INFO] [deploy:deploy {execution: default-deploy}]
[INFO] Retrieving previous build number from apache.snapshots.https
[WARNING] *** CHECKSUM FAILED - Checksum failed on download: local = '84ef5dbac832db0786c64622e5aab1043f91bfa2';
remote = '29dd6b77ea9cf11c5a005b136dd7b224a7f85710' - RETRYING
[WARNING] *** CHECKSUM FAILED - Checksum failed on download: local = '84ef5dbac832db0786c64622e5aab1043f91bfa2';
remote = '29dd6b77ea9cf11c5a005b136dd7b224a7f85710' - IGNORING
Uploading: https://repository.apache.org/content/repositories/snapshots/org/apache/myfaces/tobago/maven-apt-plugin/1.0.40-SNAPSHOT/maven-apt-plugin-1.0.40-SNAPSHOT.jar
25K uploaded  (maven-apt-plugin-1.0.40-SNAPSHOT.jar)
[INFO] Retrieving previous metadata from apache.snapshots.https
[WARNING] *** CHECKSUM FAILED - Checksum failed on download: local = '84ef5dbac832db0786c64622e5aab1043f91bfa2';
remote = '29dd6b77ea9cf11c5a005b136dd7b224a7f85710' - RETRYING
[WARNING] *** CHECKSUM FAILED - Checksum failed on download: local = '84ef5dbac832db0786c64622e5aab1043f91bfa2';
remote = '29dd6b77ea9cf11c5a005b136dd7b224a7f85710' - IGNORING
[INFO] Uploading repository metadata for: 'snapshot org.apache.myfaces.tobago:maven-apt-plugin:1.0.40-SNAPSHOT'
[INFO] Retrieving previous metadata from apache.snapshots.https
[INFO] Uploading repository metadata for: 'artifact org.apache.myfaces.tobago:maven-apt-plugin'
[INFO] Uploading project information for maven-apt-plugin 1.0.40-SNAPSHOT
[INFO] Retrieving previous metadata from apache.snapshots.https
[INFO] Uploading repository metadata for: 'org.apache.myfaces.tobago'
[INFO] Retrieving previous build number from apache.snapshots.https
Uploading: https://repository.apache.org/content/repositories/snapshots/org/apache/myfaces/tobago/maven-apt-plugin/1.0.40-SNAPSHOT/maven-apt-plugin-1.0.40-SNAPSHOT-sources.jar
15K uploaded  (maven-apt-plugin-1.0.40-SNAPSHOT-sources.jar)
[JENKINS] Archiving <https://builds.apache.org/job/tobago-1.0.x-deploy/ws/tobago-1.0.x-deploy/tobago-tool/maven-apt-plugin/target/maven-apt-plugin-1.0.40-SNAPSHOT.jar>
to /home/hudson/hudson/jobs/tobago-1.0.x-deploy/modules/org.apache.myfaces.tobago$maven-apt-plugin/builds/2013-01-23_04-35-13/archive/org.apache.myfaces.tobago/maven-apt-plugin/1.0.40-SNAPSHOT/maven-apt-plugin-1.0.40-SNAPSHOT.jar
[JENKINS] Archiving <https://builds.apache.org/job/tobago-1.0.x-deploy/ws/tobago-1.0.x-deploy/tobago-tool/maven-apt-plugin/target/maven-apt-plugin-1.0.40-SNAPSHOT-sources.jar>
to /home/hudson/hudson/jobs/tobago-1.0.x-deploy/modules/org.apache.myfaces.tobago$maven-apt-plugin/builds/2013-01-23_04-35-13/archive/org.apache.myfaces.tobago/maven-apt-plugin/1.0.40-SNAPSHOT/maven-apt-plugin-1.0.40-SNAPSHOT-sources.jar
[INFO] ------------------------------------------------------------------------
[INFO] Building Maven Tobago Theme Plugin
[INFO]    task-segment: [clean, source:jar, deploy]
[INFO] ------------------------------------------------------------------------
[INFO] [clean:clean {execution: default-clean}]
[INFO] Preparing source:jar
[JENKINS] Archiving <https://builds.apache.org/job/tobago-1.0.x-deploy/ws/tobago-1.0.x-deploy/tobago-tool/maven-theme-plugin/pom.xml>
to /home/hudson/hudson/jobs/tobago-1.0.x-deploy/modules/org.apache.myfaces.tobago$maven-theme-plugin/builds/2013-01-23_04-35-14/archive/org.apache.myfaces.tobago/maven-theme-plugin/1.0.40-SNAPSHOT/maven-theme-plugin-1.0.40-SNAPSHOT.pom
[INFO] [buildnumber:create {execution: default}]
[INFO] [source:jar {execution: default-cli}]
[INFO] Building jar: <https://builds.apache.org/job/tobago-1.0.x-deploy/ws/tobago-1.0.x-deploy/tobago-tool/maven-theme-plugin/target/maven-theme-plugin-1.0.40-SNAPSHOT-sources.jar>
[INFO] [buildnumber:create {execution: default}]
[INFO] [plugin:descriptor {execution: default-descriptor}]
[INFO] Using 'UTF-8' encoding to read mojo metadata.
[INFO] Applying mojo extractor for language: java
[WARNING] org.apache.myfaces.tobago.maven.plugin.PackThemeMojo#archiver:
[WARNING]   The syntax
[WARNING]     @parameter expression="${component.<role>#<roleHint>}"
[WARNING]   is deprecated, please use
[WARNING]     @component role="<role>" roleHint="<roleHint>"
[WARNING]   instead.
[WARNING] org.apache.myfaces.tobago.maven.plugin.UnPackThemeMojo#archiverManager:
[WARNING]   The syntax
[WARNING]     @parameter expression="${component.<role>#<roleHint>}"
[WARNING]   is deprecated, please use
[WARNING]     @component role="<role>" roleHint="<roleHint>"
[WARNING]   instead.
Jan 23, 2013 4:37:16 AM hudson.remoting.SynchronousCommandTransport$ReaderThread run
SEVERE: I/O error in channel channel
java.io.StreamCorruptedException
	at java.io.ObjectInputStream.readObject0(ObjectInputStream.java:1332)
	at java.io.ObjectInputStream.readObject(ObjectInputStream.java:348)
	at hudson.remoting.Command.readFrom(Command.java:92)
	at hudson.remoting.ClassicCommandTransport.read(ClassicCommandTransport.java:59)
	at hudson.remoting.SynchronousCommandTransport$ReaderThread.run(SynchronousCommandTransport.java:48)
channel stopped
[INFO] Mojo extractor for language: java found 2 mojo descriptors.
[INFO] Applying mojo extractor for language: bsh
[INFO] Mojo extractor for language: bsh found 0 mojo descriptors.
ERROR: Maven JVM terminated unexpectedly with exit code 0


Mime
View raw message