myfaces-commits mailing list archives

Site index · List index
Message view « Date » · « Thread »
Top « Date » · « Thread »
From Apache Jenkins Server <jenk...@builds.apache.org>
Subject Build failed in Jenkins: myfaces-current22 #280
Date Sat, 26 Jan 2013 01:00:29 GMT
See <https://builds.apache.org/job/myfaces-current22/280/changes>

Changes:

[lu4242] MYFACES-3689 Implement ComponentModificationManager

[lu4242] MYFACES-3682 Implement Client Side Request Forgery protection

[lu4242] MYFACES-3688 Implement ExternalContext.getSessionId()

[lu4242] MYFACES-3686 Implement f:passThroughAttribute and f:passThroughAttributes

[lu4242] MYFACES-3685 Implement f:attributes facelet tag

[lu4242] MYFACES-3686 Implement f:passThroughAttribute and f:passThroughAttributes

[lu4242] MYFACES-3686 Implement f:passThroughAttribute and f:passThroughAttributes

------------------------------------------
[...truncated 1761 lines...]
mojoStarted org.apache.maven.plugins:maven-remote-resources-plugin:1.2.1(default)
[INFO] 
[INFO] --- maven-remote-resources-plugin:1.2.1:process (default) @ myfaces-impl-shared ---
mojoSucceeded org.apache.maven.plugins:maven-remote-resources-plugin:1.2.1(default)
mojoStarted org.codehaus.mojo:build-helper-maven-plugin:1.5(add-resource)
[INFO] 
[INFO] --- build-helper-maven-plugin:1.5:add-resource (add-resource) @ myfaces-impl-shared
---
mojoSucceeded org.codehaus.mojo:build-helper-maven-plugin:1.5(add-resource)
mojoStarted org.apache.myfaces.buildtools:myfaces-javascript-plugin:1.0.1(compile-myfacesscripts)[INFO]
Reading assembler descriptor <https://builds.apache.org/job/myfaces-current22/ws/2.2.x/shared/src/assembler/myfacesscripts-compiler.xml>

[INFO] 
[INFO] --- myfaces-javascript-plugin:1.0.1:compile (compile-myfacesscripts) @ myfaces-impl-shared
---
mojoSucceeded org.apache.myfaces.buildtools:myfaces-javascript-plugin:1.0.1(compile-myfacesscripts)
mojoStarted org.apache.myfaces.buildtools:myfaces-javascript-plugin:1.0.1(compile-myfacesscripts-uncompressed)[INFO]
Reading assembler descriptor <https://builds.apache.org/job/myfaces-current22/ws/2.2.x/shared/src/assembler/myfacesscripts-uncompressed-compiler.xml>

[INFO] 
[INFO] --- myfaces-javascript-plugin:1.0.1:compile (compile-myfacesscripts-uncompressed) @
myfaces-impl-shared ---
mojoSucceeded org.apache.myfaces.buildtools:myfaces-javascript-plugin:1.0.1(compile-myfacesscripts-uncompressed)
mojoStarted org.apache.myfaces.buildtools:myfaces-javascript-plugin:1.0.1(compress-myfacesscripts)[INFO]
Compressing javascript using YahooUI
[INFO] ------------------------------------------------------------------------------


[WARNING] [WARNING] The variable i has already been declared in the same scope...
&&params!=null){for(var i ---> = <--- 0,param;(param=params[

[WARNING] [WARNING] The variable param has already been declared in the same scope...
){for(var i=0,param ---> ; <--- (param=params[i]);
[INFO] [INFO] oamSubmit.js (5,741 bytes) ................................. compressed at 67%

[INFO] --- myfaces-javascript-plugin:1.0.1:compress (compress-myfacesscripts) @ myfaces-impl-shared
---
mojoSucceeded org.apache.myfaces.buildtools:myfaces-javascript-plugin:1.0.1(compress-myfacesscripts)[INFO]
------------------------------------------------------------------------------
[INFO] compression saved 3,867 bytes

mojoStarted org.apache.maven.plugins:maven-resources-plugin:2.5(default-resources)[debug]
execute contextualize
[INFO] Using 'UTF-8' encoding to copy filtered resources.

[INFO] 
[INFO] [INFO] Copying 2 resources
--- maven-resources-plugin:2.5:resources (default-resources) @ myfaces-impl-shared ---
[INFO] Copying 1 resource
[INFO] Copying 3 resources
[INFO] Copying 2 resources
mojoSucceeded org.apache.maven.plugins:maven-resources-plugin:2.5(default-resources)
mojoStarted org.apache.maven.plugins:maven-compiler-plugin:2.0.2(default-compile)
[INFO] 
[INFO] --- maven-compiler-plugin:2.0.2:compile (default-compile) @ myfaces-impl-shared ---
[INFO] Compiling 121 source files to <https://builds.apache.org/job/myfaces-current22/ws/2.2.x/shared/target/classes>
mojoSucceeded org.apache.maven.plugins:maven-compiler-plugin:2.0.2(default-compile)
[debug] execute contextualize
mojoStarted org.apache.maven.plugins:maven-resources-plugin:2.5(default-testResources)[INFO]
Using 'UTF-8' encoding to copy filtered resources.

[INFO] 
[INFO] --- maven-resources-plugin:2.5:testResources (default-testResources) @ myfaces-impl-shared
---
[INFO] Copying 15 resources
[INFO] Copying 3 resources
mojoSucceeded org.apache.maven.plugins:maven-resources-plugin:2.5(default-testResources)
mojoStarted org.apache.maven.plugins:maven-compiler-plugin:2.0.2(default-testCompile)
[INFO] 
[INFO] --- maven-compiler-plugin:2.0.2:testCompile (default-testCompile) @ myfaces-impl-shared
---
[INFO] Compiling 25 source files to <https://builds.apache.org/job/myfaces-current22/ws/2.2.x/shared/target/test-classes>
mojoSucceeded org.apache.maven.plugins:maven-compiler-plugin:2.0.2(default-testCompile)
mojoStarted org.apache.maven.plugins:maven-surefire-plugin:2.9(default-test)[INFO] Surefire
report directory: <https://builds.apache.org/job/myfaces-current22/ws/2.2.x/shared/target/surefire-reports>

[INFO] 
[INFO] --- maven-surefire-plugin:2.9:test (default-test) @ myfaces-impl-shared ---
-------------------------------------------------------
 T E S T S
-------------------------------------------------------

Running org.apache.myfaces.shared.webapp.webxml.ServletMappingTest
Tests run: 2, Failures: 0, Errors: 0, Skipped: 0, Time elapsed: 0.017 sec
Running org.apache.myfaces.shared.application.DefaultViewHandlerSupportTest
Tests run: 8, Failures: 0, Errors: 0, Skipped: 0, Time elapsed: 0.122 sec
Running org.apache.myfaces.shared.renderkit.ContentTypeUtilsTest
Tests run: 2, Failures: 0, Errors: 0, Skipped: 0, Time elapsed: 0.004 sec
Running org.apache.myfaces.shared.renderkit.RendererUtilsTest
No Renderer found for component {Component-Path : [Class: javax.faces.component.html.HtmlGraphicImage,Id:
graphicImageId]} (component-family=javax.faces.Graphic, renderer-type=javax.faces.Image)
Jan 26, 2013 12:58:51 AM javax.faces.component.UIComponentBase getRenderer
WARNING: No Renderer found for component {Component-Path : [Class: javax.faces.component.html.HtmlGraphicImage,Id:
graphicImageId]} (component-family=javax.faces.Graphic, renderer-type=javax.faces.Image)
Tests run: 7, Failures: 0, Errors: 0, Skipped: 0, Time elapsed: 0.211 sec
Running org.apache.myfaces.shared.renderkit.html.HtmlRendererUtilsTest
No Renderer found for component {Component-Path : [Class: javax.faces.component.html.HtmlInputText,Id:
j_id__v_0]} (component-family=javax.faces.Input, renderer-type=javax.faces.Text)
Jan 26, 2013 12:58:51 AM javax.faces.component.UIComponentBase getRenderer
WARNING: No Renderer found for component {Component-Path : [Class: javax.faces.component.html.HtmlInputText,Id:
j_id__v_0]} (component-family=javax.faces.Input, renderer-type=javax.faces.Text)
Tests run: 2, Failures: 0, Errors: 0, Skipped: 0, Time elapsed: 0.024 sec
Running org.apache.myfaces.shared.renderkit.html.HtmlResponseWriterImplTest
Tests run: 13, Failures: 0, Errors: 0, Skipped: 0, Time elapsed: 0.017 sec
Running org.apache.myfaces.shared.renderkit.html.util.HTMLEncoderTest
Tests run: 26, Failures: 0, Errors: 0, Skipped: 0, Time elapsed: 0.012 sec
Running org.apache.myfaces.shared.renderkit.html.util.UnicodeEncoderTest
Tests run: 4, Failures: 0, Errors: 0, Skipped: 0, Time elapsed: 0.002 sec
Running org.apache.myfaces.shared.renderkit.html.util.HTMLEncoderWriterTest
Tests run: 26, Failures: 0, Errors: 0, Skipped: 0, Time elapsed: 0.011 sec
Running org.apache.myfaces.shared.context.flash.FlashImplTest
Tests run: 13, Failures: 0, Errors: 0, Skipped: 0, Time elapsed: 0.954 sec
Running org.apache.myfaces.shared.util.CachedStateUtilsAES_CBCTest
Tests run: 11, Failures: 0, Errors: 0, Skipped: 0, Time elapsed: 0.215 sec
Running org.apache.myfaces.shared.util.SecretKeyCacheTest
Tests run: 3, Failures: 0, Errors: 0, Skipped: 0, Time elapsed: 0.001 sec
Running org.apache.myfaces.shared.util.CachedStateUtilsTripleDES_ECBTest
Tests run: 11, Failures: 0, Errors: 0, Skipped: 0, Time elapsed: 0.014 sec
Running org.apache.myfaces.shared.util.StateUtilsDefaultTest
Tests run: 11, Failures: 0, Errors: 0, Skipped: 0, Time elapsed: 0.008 sec
Running org.apache.myfaces.shared.util.CachedStateUtilsDefaultTest
Tests run: 11, Failures: 0, Errors: 0, Skipped: 0, Time elapsed: 0.007 sec
Running org.apache.myfaces.shared.util.InitVector_CBCTestCase
Tests run: 2, Failures: 0, Errors: 0, Skipped: 0, Time elapsed: 0 sec
Running org.apache.myfaces.shared.util.StateUtilsTripleDES_ECBTest
Tests run: 11, Failures: 0, Errors: 0, Skipped: 0, Time elapsed: 0.008 sec
Running org.apache.myfaces.shared.util.MessageUtilsTest
currency ?100.00
Tests run: 11, Failures: 0, Errors: 0, Skipped: 0, Time elapsed: 0.027 sec
Running org.apache.myfaces.shared.util.StateUtilsAES_CBCTest
Tests run: 11, Failures: 0, Errors: 0, Skipped: 0, Time elapsed: 0.006 sec
Running org.apache.myfaces.shared.util.CachedStateUtilsBlowfish_ECBTest
Tests run: 11, Failures: 0, Errors: 0, Skipped: 0, Time elapsed: 0.022 sec
Running org.apache.myfaces.shared.util.CommentUtilsTest
Tests run: 5, Failures: 0, Errors: 0, Skipped: 0, Time elapsed: 0.002 sec
Running org.apache.myfaces.shared.util.SecretKeyConfigurationTest
Tests run: 4, Failures: 0, Errors: 0, Skipped: 0, Time elapsed: 0.001 sec
Running org.apache.myfaces.shared.util.StateUtilsBlowfish_ECBTest
Tests run: 11, Failures: 0, Errors: 0, Skipped: 0, Time elapsed: 0.014 sec
Running org.apache.myfaces.shared.resource.ResourceValidationUtilsTest
Tests run: 3, Failures: 0, Errors: 0, Skipped: 0, Time elapsed: 0.002 sec

Results :

Tests run: 219, Failures: 0, Errors: 0, Skipped: 0

mojoSucceeded org.apache.maven.plugins:maven-surefire-plugin:2.9(default-test)
[JENKINS] Recording test results
mojoStarted org.apache.maven.plugins:maven-jar-plugin:2.3.2(default-jar)
[INFO] 
[INFO] --- maven-jar-plugin:2.3.2:jar (default-jar) @ myfaces-impl-shared ---
[INFO] Building jar: <https://builds.apache.org/job/myfaces-current22/ws/2.2.x/shared/target/myfaces-impl-shared-2.2.0-SNAPSHOT.jar>
mojoSucceeded org.apache.maven.plugins:maven-jar-plugin:2.3.2(default-jar)
mojoStarted org.apache.maven.plugins:maven-site-plugin:3.0(attach-descriptor)
[INFO] 
[INFO] --- maven-site-plugin:3.0:attach-descriptor (attach-descriptor) @ myfaces-impl-shared
---
mojoSucceeded org.apache.maven.plugins:maven-site-plugin:3.0(attach-descriptor)
forkedProjectStarted org.apache.myfaces.core.internal:myfaces-impl-shared:2.2.0-SNAPSHOT
mojoStarted org.apache.myfaces.buildtools:myfaces-builder-plugin:1.0.10(makemyfacesmetadata)
[INFO] 
[INFO] [INFO] model is up to date
--- myfaces-builder-plugin:1.0.10:build-metadata (makemyfacesmetadata) @ myfaces-impl-shared
---
mojoSucceeded org.apache.myfaces.buildtools:myfaces-builder-plugin:1.0.10(makemyfacesmetadata)
forkedProjectSucceeded org.apache.myfaces.core.internal:myfaces-impl-shared:2.2.0-SNAPSHOTJan
26, 2013 12:58:54 AM hudson.maven.ExecutedMojo <init>
WARNING: Failed to getClass for org.apache.maven.plugin.source.SourceJarMojo

mojoStarted org.apache.maven.plugins:maven-source-plugin:2.0.4(attach-source)
[INFO] 
[INFO] --- maven-source-plugin:2.0.4:jar (attach-source) @ myfaces-impl-shared ---
[INFO] Building jar: <https://builds.apache.org/job/myfaces-current22/ws/2.2.x/shared/target/myfaces-impl-shared-2.2.0-SNAPSHOT-sources.jar>
mojoSucceeded org.apache.maven.plugins:maven-source-plugin:2.0.4(attach-source)
mojoStarted org.apache.maven.plugins:maven-shade-plugin:1.3.3(default)
[INFO] 
[INFO] --- maven-shade-plugin:1.3.3:shade (default) @ myfaces-impl-shared ---
[INFO] Excluding org.apache.myfaces.core:myfaces-api:jar:2.2.0-SNAPSHOT from the shaded jar.
[INFO] Including org.apache.myfaces.core.internal:myfaces-impl-shared-public:jar:2.2.0-SNAPSHOT
in the shaded jar.
[INFO] Excluding commons-codec:commons-codec:jar:1.3 from the shaded jar.
[WARNING] We have a duplicate org/apache/myfaces/shared/util/ClassUtils.class in <https://builds.apache.org/job/myfaces-current22/ws/2.2.x/shared-public/target/myfaces-impl-shared-public-2.2.0-SNAPSHOT.jar>
[INFO] Replacing original artifact with shaded artifact.
[INFO] Replacing <https://builds.apache.org/job/myfaces-current22/ws/2.2.x/shared/target/myfaces-impl-shared-2.2.0-SNAPSHOT.jar>
with <https://builds.apache.org/job/myfaces-current22/ws/2.2.x/shared/target/myfaces-impl-shared-2.2.0-SNAPSHOT-shaded.jar>
[INFO] Replacing <https://builds.apache.org/job/myfaces-current22/ws/2.2.x/shared/target/myfaces-impl-shared-2.2.0-SNAPSHOT-sources.jar>
with <https://builds.apache.org/job/myfaces-current22/ws/2.2.x/shared/target/myfaces-impl-shared-2.2.0-SNAPSHOT-shaded-sources.jar>
mojoSucceeded org.apache.maven.plugins:maven-shade-plugin:1.3.3(default)
mojoStarted org.apache.maven.plugins:maven-checkstyle-plugin:2.7(verify-style)
[INFO] 
[INFO] --- maven-checkstyle-plugin:2.7:check (verify-style) @ myfaces-impl-shared ---
[INFO] 
[INFO] There are 1 checkstyle errors.
mojoFailed org.apache.maven.plugins:maven-checkstyle-plugin:2.7(verify-style)
projectFailed org.apache.myfaces.core.internal:myfaces-impl-shared:2.2.0-SNAPSHOT
sessionEnded
[INFO] ------------------------------------------------------------------------
[INFO] Reactor Summary:
[INFO] 
[INFO] Apache MyFaces JSF-2.2 Core Project ............... SUCCESS [5.896s]
[INFO] Apache MyFaces JSF-2.2 Core API ................... SUCCESS [31.279s]
[INFO] Apache MyFaces Shared Public API For JSF 2.1 - Core  SUCCESS [5.372s]
[INFO] Apache MyFaces Core For JSF 2.2 - Shared .......... FAILURE [9.907s]
[INFO] Apache MyFaces JSF-2.2 Core Impl .................. SKIPPED
[INFO] Apache MyFaces JSF-2.1 Core OSGi Bundle ........... SKIPPED
[INFO] Apache MyFaces JSF-2.2 Core Module ................ SKIPPED
[INFO] client-window-example ............................. SKIPPED
[INFO] ------------------------------------------------------------------------
[INFO] BUILD FAILURE
[INFO] ------------------------------------------------------------------------
[INFO] Total time: 54.279s
[INFO] Finished at: Sat Jan 26 00:58:55 UTC 2013
[INFO] Final Memory: 68M/423M
[INFO] ------------------------------------------------------------------------
Projects to build: [MavenProject: org.apache.myfaces.core:myfaces-core-project:2.2.0-SNAPSHOT
@ <https://builds.apache.org/job/myfaces-current22/ws/2.2.x/parent/pom.xml,> MavenProject:
org.apache.myfaces.core:myfaces-api:2.2.0-SNAPSHOT @ <https://builds.apache.org/job/myfaces-current22/ws/2.2.x/api/pom.xml,>
MavenProject: org.apache.myfaces.core.internal:myfaces-impl-shared-public:2.2.0-SNAPSHOT @
<https://builds.apache.org/job/myfaces-current22/ws/2.2.x/shared-public/pom.xml,> MavenProject:
org.apache.myfaces.core.internal:myfaces-impl-shared:2.2.0-SNAPSHOT @ <https://builds.apache.org/job/myfaces-current22/ws/2.2.x/shared/pom.xml,>
MavenProject: org.apache.myfaces.core:myfaces-impl:2.2.0-SNAPSHOT @ <https://builds.apache.org/job/myfaces-current22/ws/2.2.x/impl/pom.xml,>
MavenProject: org.apache.myfaces.core:myfaces-bundle:2.2.0-SNAPSHOT @ <https://builds.apache.org/job/myfaces-current22/ws/2.2.x/bundle/pom.xml,>
MavenProject: org.apache.myfaces.core:myfaces-core-module:2.2.0-SNAPSHOT @ <https://builds.apache.org/job/myfaces-current22/ws/2.2.x/pom.xml,>
MavenProject: org.apache.myfaces.example.clientWindow:client-window-example:2.2.0-SNAPSHOT
@ <https://builds.apache.org/job/myfaces-current22/ws/2.2.x/client-window-example/pom.xml]>
[JENKINS] Archiving <https://builds.apache.org/job/myfaces-current22/ws/2.2.x/client-window-example/pom.xml>
to /home/hudson/hudson/jobs/myfaces-current22/modules/org.apache.myfaces.example.clientWindow$client-window-example/builds/2013-01-26_00-57-56/archive/org.apache.myfaces.example.clientWindow/client-window-example/2.2.0-SNAPSHOT/client-window-example-2.2.0-SNAPSHOT.pom
[JENKINS] Archiving <https://builds.apache.org/job/myfaces-current22/ws/2.2.x/bundle/pom.xml>
to /home/hudson/hudson/jobs/myfaces-current22/modules/org.apache.myfaces.core$myfaces-bundle/builds/2013-01-26_00-57-56/archive/org.apache.myfaces.core/myfaces-bundle/2.2.0-SNAPSHOT/myfaces-bundle-2.2.0-SNAPSHOT.pom
[JENKINS] Archiving <https://builds.apache.org/job/myfaces-current22/ws/2.2.x/shared/pom.xml>
to /home/hudson/hudson/jobs/myfaces-current22/modules/org.apache.myfaces.core.internal$myfaces-impl-shared/builds/2013-01-26_00-57-56/archive/org.apache.myfaces.core.internal/myfaces-impl-shared/2.2.0-SNAPSHOT/myfaces-impl-shared-2.2.0-SNAPSHOT.pom
[JENKINS] Archiving <https://builds.apache.org/job/myfaces-current22/ws/2.2.x/shared/target/myfaces-impl-shared-2.2.0-SNAPSHOT.jar>
to /home/hudson/hudson/jobs/myfaces-current22/modules/org.apache.myfaces.core.internal$myfaces-impl-shared/builds/2013-01-26_00-57-56/archive/org.apache.myfaces.core.internal/myfaces-impl-shared/2.2.0-SNAPSHOT/myfaces-impl-shared-2.2.0-SNAPSHOT.jar
[JENKINS] Archiving <https://builds.apache.org/job/myfaces-current22/ws/2.2.x/shared/target/myfaces-impl-shared-2.2.0-SNAPSHOT-sources.jar>
to /home/hudson/hudson/jobs/myfaces-current22/modules/org.apache.myfaces.core.internal$myfaces-impl-shared/builds/2013-01-26_00-57-56/archive/org.apache.myfaces.core.internal/myfaces-impl-shared/2.2.0-SNAPSHOT/myfaces-impl-shared-2.2.0-SNAPSHOT-sources.jar
[JENKINS] Archiving <https://builds.apache.org/job/myfaces-current22/ws/2.2.x/shared-public/pom.xml>
to /home/hudson/hudson/jobs/myfaces-current22/modules/org.apache.myfaces.core.internal$myfaces-impl-shared-public/builds/2013-01-26_00-57-56/archive/org.apache.myfaces.core.internal/myfaces-impl-shared-public/2.2.0-SNAPSHOT/myfaces-impl-shared-public-2.2.0-SNAPSHOT.pom
[JENKINS] Archiving <https://builds.apache.org/job/myfaces-current22/ws/2.2.x/shared-public/target/myfaces-impl-shared-public-2.2.0-SNAPSHOT.jar>
to /home/hudson/hudson/jobs/myfaces-current22/modules/org.apache.myfaces.core.internal$myfaces-impl-shared-public/builds/2013-01-26_00-57-56/archive/org.apache.myfaces.core.internal/myfaces-impl-shared-public/2.2.0-SNAPSHOT/myfaces-impl-shared-public-2.2.0-SNAPSHOT.jar
[JENKINS] Archiving <https://builds.apache.org/job/myfaces-current22/ws/2.2.x/shared-public/target/myfaces-impl-shared-public-2.2.0-SNAPSHOT-sources.jar>
to /home/hudson/hudson/jobs/myfaces-current22/modules/org.apache.myfaces.core.internal$myfaces-impl-shared-public/builds/2013-01-26_00-57-56/archive/org.apache.myfaces.core.internal/myfaces-impl-shared-public/2.2.0-SNAPSHOT/myfaces-impl-shared-public-2.2.0-SNAPSHOT-sources.jar
[JENKINS] Archiving <https://builds.apache.org/job/myfaces-current22/ws/2.2.x/api/pom.xml>
to /home/hudson/hudson/jobs/myfaces-current22/modules/org.apache.myfaces.core$myfaces-api/builds/2013-01-26_00-57-56/archive/org.apache.myfaces.core/myfaces-api/2.2.0-SNAPSHOT/myfaces-api-2.2.0-SNAPSHOT.pom
[JENKINS] Archiving <https://builds.apache.org/job/myfaces-current22/ws/2.2.x/api/target/myfaces-api-2.2.0-SNAPSHOT.jar>
to /home/hudson/hudson/jobs/myfaces-current22/modules/org.apache.myfaces.core$myfaces-api/builds/2013-01-26_00-57-56/archive/org.apache.myfaces.core/myfaces-api/2.2.0-SNAPSHOT/myfaces-api-2.2.0-SNAPSHOT.jar
[JENKINS] Archiving <https://builds.apache.org/job/myfaces-current22/ws/2.2.x/api/target/myfaces-api-2.2.0-SNAPSHOT-sources.jar>
to /home/hudson/hudson/jobs/myfaces-current22/modules/org.apache.myfaces.core$myfaces-api/builds/2013-01-26_00-57-56/archive/org.apache.myfaces.core/myfaces-api/2.2.0-SNAPSHOT/myfaces-api-2.2.0-SNAPSHOT-sources.jar
[JENKINS] Archiving <https://builds.apache.org/job/myfaces-current22/ws/2.2.x/api/target/myfaces-api-2.2.0-SNAPSHOT-tests.jar>
to /home/hudson/hudson/jobs/myfaces-current22/modules/org.apache.myfaces.core$myfaces-api/builds/2013-01-26_00-57-56/archive/org.apache.myfaces.core/myfaces-api/2.2.0-SNAPSHOT/myfaces-api-2.2.0-SNAPSHOT-tests.jar
[JENKINS] Archiving <https://builds.apache.org/job/myfaces-current22/ws/2.2.x/impl/pom.xml>
to /home/hudson/hudson/jobs/myfaces-current22/modules/org.apache.myfaces.core$myfaces-impl/builds/2013-01-26_00-57-56/archive/org.apache.myfaces.core/myfaces-impl/2.2.0-SNAPSHOT/myfaces-impl-2.2.0-SNAPSHOT.pom
[JENKINS] Archiving <https://builds.apache.org/job/myfaces-current22/ws/2.2.x/pom.xml>
to /home/hudson/hudson/jobs/myfaces-current22/modules/org.apache.myfaces.core$myfaces-core-module/builds/2013-01-26_00-57-56/archive/org.apache.myfaces.core/myfaces-core-module/2.2.0-SNAPSHOT/myfaces-core-module-2.2.0-SNAPSHOT.pom
[JENKINS] Archiving <https://builds.apache.org/job/myfaces-current22/ws/2.2.x/parent/pom.xml>
to /home/hudson/hudson/jobs/myfaces-current22/modules/org.apache.myfaces.core$myfaces-core-project/builds/2013-01-26_00-57-56/archive/org.apache.myfaces.core/myfaces-core-project/2.2.0-SNAPSHOT/myfaces-core-project-2.2.0-SNAPSHOT.pom
[JENKINS] Archiving <https://builds.apache.org/job/myfaces-current22/ws/2.2.x/parent/target/myfaces-core-project-2.2.0-SNAPSHOT-site.xml>
to /home/hudson/hudson/jobs/myfaces-current22/modules/org.apache.myfaces.core$myfaces-core-project/builds/2013-01-26_00-57-56/archive/org.apache.myfaces.core/myfaces-core-project/2.2.0-SNAPSHOT/myfaces-core-project-2.2.0-SNAPSHOT-site.xml
Waiting for Jenkins to finish collecting data
mavenExecutionResult exceptions not empty
message : Failed to execute goal org.apache.maven.plugins:maven-checkstyle-plugin:2.7:check
(verify-style) on project myfaces-impl-shared: You have 1 Checkstyle violation.
cause : You have 1 Checkstyle violation.
Stack trace : 
org.apache.maven.lifecycle.LifecycleExecutionException: Failed to execute goal org.apache.maven.plugins:maven-checkstyle-plugin:2.7:check
(verify-style) on project myfaces-impl-shared: You have 1 Checkstyle violation.
	at org.apache.maven.lifecycle.internal.MojoExecutor.execute(MojoExecutor.java:213)
	at org.apache.maven.lifecycle.internal.MojoExecutor.execute(MojoExecutor.java:153)
	at org.apache.maven.lifecycle.internal.MojoExecutor.execute(MojoExecutor.java:145)
	at org.apache.maven.lifecycle.internal.LifecycleModuleBuilder.buildProject(LifecycleModuleBuilder.java:84)
	at org.apache.maven.lifecycle.internal.LifecycleModuleBuilder.buildProject(LifecycleModuleBuilder.java:59)
	at org.apache.maven.lifecycle.internal.LifecycleStarter.singleThreadedBuild(LifecycleStarter.java:183)
	at org.apache.maven.lifecycle.internal.LifecycleStarter.execute(LifecycleStarter.java:161)
	at org.apache.maven.DefaultMaven.doExecute(DefaultMaven.java:320)
	at org.apache.maven.DefaultMaven.execute(DefaultMaven.java:156)
	at org.jvnet.hudson.maven3.launcher.Maven3Launcher.main(Maven3Launcher.java:79)
	at sun.reflect.NativeMethodAccessorImpl.invoke0(Native Method)
	at sun.reflect.NativeMethodAccessorImpl.invoke(NativeMethodAccessorImpl.java:39)
	at sun.reflect.DelegatingMethodAccessorImpl.invoke(DelegatingMethodAccessorImpl.java:25)
	at java.lang.reflect.Method.invoke(Method.java:597)
	at org.codehaus.plexus.classworlds.launcher.Launcher.launchStandard(Launcher.java:329)
	at org.codehaus.plexus.classworlds.launcher.Launcher.launch(Launcher.java:239)
	at org.jvnet.hudson.maven3.agent.Maven3Main.launch(Maven3Main.java:158)
	at hudson.maven.Maven3Builder.call(Maven3Builder.java:100)
	at hudson.maven.Maven3Builder.call(Maven3Builder.java:66)
	at hudson.remoting.UserRequest.perform(UserRequest.java:118)
	at hudson.remoting.UserRequest.perform(UserRequest.java:48)
	at hudson.remoting.Request$2.run(Request.java:326)
	at hudson.remoting.InterceptingExecutorService$1.call(InterceptingExecutorService.java:72)
	at java.util.concurrent.FutureTask$Sync.innerRun(FutureTask.java:303)
	at java.util.concurrent.FutureTask.run(FutureTask.java:138)
	at java.util.concurrent.ThreadPoolExecutor$Worker.runTask(ThreadPoolExecutor.java:886)
	at java.util.concurrent.ThreadPoolExecutor$Worker.run(ThreadPoolExecutor.java:908)
	at java.lang.Thread.run(Thread.java:662)
Caused by: org.apache.maven.plugin.MojoFailureException: You have 1 Checkstyle violation.
	at org.apache.maven.plugin.checkstyle.CheckstyleViolationCheckMojo.execute(CheckstyleViolationCheckMojo.java:430)
	at org.apache.maven.plugin.DefaultBuildPluginManager.executeMojo(DefaultBuildPluginManager.java:101)
	at org.apache.maven.lifecycle.internal.MojoExecutor.execute(MojoExecutor.java:209)
	... 27 more
Sending e-mails to: commits@myfaces.apache.org lu4242@gmail.com
channel stopped

Mime
View raw message