myfaces-commits mailing list archives

Site index · List index
Message view « Date » · « Thread »
Top « Date » · « Thread »
From Apache Jenkins Server <jenk...@builds.apache.org>
Subject Build failed in Jenkins: myfaces-current-2.0-integration-tests #1187
Date Mon, 31 Dec 2012 23:25:15 GMT
See <https://builds.apache.org/job/myfaces-current-2.0-integration-tests/1187/>

------------------------------------------
[...truncated 334 lines...]
[WARNING] [talledLocalContainer] Dec 31, 2012 11:23:07 PM org.apache.myfaces.webapp.WebConfigParamsLogger
logWebContextParams
[WARNING] [talledLocalContainer] INFO: No context init parameter 'org.apache.myfaces.USE_ENCRYPTION'
found, using default value 'true'.
[WARNING] [talledLocalContainer] Dec 31, 2012 11:23:07 PM org.apache.myfaces.webapp.WebConfigParamsLogger
logWebContextParams
[WARNING] [talledLocalContainer] INFO: No context init parameter 'org.apache.myfaces.SECRET'
found.
[WARNING] [talledLocalContainer] Dec 31, 2012 11:23:07 PM org.apache.myfaces.webapp.WebConfigParamsLogger
logWebContextParams
[WARNING] [talledLocalContainer] INFO: No context init parameter 'org.apache.myfaces.ALGORITHM'
found, using default value 'DES'.
[WARNING] [talledLocalContainer] Dec 31, 2012 11:23:07 PM org.apache.myfaces.webapp.WebConfigParamsLogger
logWebContextParams
[WARNING] [talledLocalContainer] INFO: No context init parameter 'org.apache.myfaces.SECRET.CACHE'
found.
[WARNING] [talledLocalContainer] Dec 31, 2012 11:23:07 PM org.apache.myfaces.webapp.WebConfigParamsLogger
logWebContextParams
[WARNING] [talledLocalContainer] INFO: No context init parameter 'org.apache.myfaces.ALGORITHM.IV'
found.
[WARNING] [talledLocalContainer] Dec 31, 2012 11:23:07 PM org.apache.myfaces.webapp.WebConfigParamsLogger
logWebContextParams
[WARNING] [talledLocalContainer] INFO: No context init parameter 'org.apache.myfaces.ALGORITHM.PARAMETERS'
found, using default value 'ECB/PKCS5Padding'.
[WARNING] [talledLocalContainer] Dec 31, 2012 11:23:07 PM org.apache.myfaces.webapp.WebConfigParamsLogger
logWebContextParams
[WARNING] [talledLocalContainer] INFO: No context init parameter 'org.apache.myfaces.SERIAL_FACTORY'
found.
[WARNING] [talledLocalContainer] Dec 31, 2012 11:23:07 PM org.apache.myfaces.webapp.WebConfigParamsLogger
logWebContextParams
[WARNING] [talledLocalContainer] INFO: No context init parameter 'org.apache.myfaces.COMPRESS_STATE_IN_CLIENT'
found, using default value 'false'.
[WARNING] [talledLocalContainer] Dec 31, 2012 11:23:07 PM org.apache.myfaces.webapp.WebConfigParamsLogger
logWebContextParams
[WARNING] [talledLocalContainer] INFO: No context init parameter 'org.apache.myfaces.MAC_ALGORITHM'
found, using default value 'HmacSHA1'.
[WARNING] [talledLocalContainer] Dec 31, 2012 11:23:07 PM org.apache.myfaces.webapp.WebConfigParamsLogger
logWebContextParams
[WARNING] [talledLocalContainer] INFO: No context init parameter 'org.apache.myfaces.MAC_SECRET'
found.
[WARNING] [talledLocalContainer] Dec 31, 2012 11:23:07 PM org.apache.myfaces.webapp.WebConfigParamsLogger
logWebContextParams
[WARNING] [talledLocalContainer] INFO: No context init parameter 'org.apache.myfaces.MAC_SECRET.CACHE'
found.
[WARNING] [talledLocalContainer] Dec 31, 2012 11:23:07 PM org.apache.myfaces.webapp.WebConfigParamsLogger
logWebContextParams
[WARNING] [talledLocalContainer] INFO: No context init parameter 'javax.faces.DATETIMECONVERTER_DEFAULT_TIMEZONE_IS_SYSTEM_TIMEZONE'
found, using default value 'false'.
[WARNING] [talledLocalContainer] Dec 31, 2012 11:23:07 PM org.apache.myfaces.webapp.WebConfigParamsLogger
logWebContextParams
[WARNING] [talledLocalContainer] INFO: No context init parameter 'org.apache.myfaces.LAZY_LOAD_CONFIG_OBJECTS'
found, using default value 'true'.
[WARNING] [talledLocalContainer] Dec 31, 2012 11:23:07 PM org.apache.myfaces.webapp.WebConfigParamsLogger
logWebContextParams
[WARNING] [talledLocalContainer] INFO: No context init parameter 'org.apache.myfaces.STRICT_JSF_2_ALLOW_SLASH_LIBRARY_NAME'
found, using default value 'false'.
[WARNING] [talledLocalContainer] Dec 31, 2012 11:23:07 PM org.apache.myfaces.webapp.WebConfigParamsLogger
logWebContextParams
[WARNING] [talledLocalContainer] INFO: No context init parameter 'org.apache.myfaces.VALIDATE'
found, using default value 'false'.
[WARNING] [talledLocalContainer] Dec 31, 2012 11:23:07 PM org.apache.myfaces.webapp.WebConfigParamsLogger
logWebContextParams
[WARNING] [talledLocalContainer] INFO: No context init parameter 'org.apache.myfaces.annotation.SCAN_PACKAGES'
found.
[WARNING] [talledLocalContainer] Dec 31, 2012 11:23:07 PM org.apache.myfaces.webapp.WebConfigParamsLogger
logWebContextParams
[WARNING] [talledLocalContainer] INFO: No context init parameter 'org.apache.myfaces.config.annotation.LifecycleProvider'
found.
[WARNING] [talledLocalContainer] Dec 31, 2012 11:23:07 PM org.apache.myfaces.webapp.WebConfigParamsLogger
logWebContextParams
[WARNING] [talledLocalContainer] INFO: No context init parameter 'org.apache.myfaces.EL_RESOLVER_COMPARATOR'
found.
[WARNING] [talledLocalContainer] Dec 31, 2012 11:23:07 PM org.apache.myfaces.webapp.WebConfigParamsLogger
logWebContextParams
[WARNING] [talledLocalContainer] INFO: No context init parameter 'org.apache.myfaces.CHECKED_VIEWID_CACHE_SIZE'
found, using default value '500'.
[WARNING] [talledLocalContainer] Dec 31, 2012 11:23:07 PM org.apache.myfaces.webapp.WebConfigParamsLogger
logWebContextParams
[WARNING] [talledLocalContainer] INFO: No context init parameter 'org.apache.myfaces.CHECKED_VIEWID_CACHE_ENABLED'
found, using default value 'true'.
[WARNING] [talledLocalContainer] Dec 31, 2012 11:23:07 PM org.apache.myfaces.webapp.WebConfigParamsLogger
logWebContextParams
[WARNING] [talledLocalContainer] INFO: No context init parameter 'org.apache.myfaces.CLIENT_VIEW_STATE_TIMEOUT'
found, using default value '0'.
[WARNING] [talledLocalContainer] Dec 31, 2012 11:23:07 PM org.apache.myfaces.webapp.WebConfigParamsLogger
logWebContextParams
[WARNING] [talledLocalContainer] INFO: No context init parameter 'org.apache.myfaces.ERROR_TEMPLATE_RESOURCE'
found, using default value 'META-INF/rsc/myfaces-dev-error.xml'.
[WARNING] [talledLocalContainer] Dec 31, 2012 11:23:07 PM org.apache.myfaces.webapp.WebConfigParamsLogger
logWebContextParams
[WARNING] [talledLocalContainer] INFO: No context init parameter 'org.apache.myfaces.DEBUG_TEMPLATE_RESOURCE'
found, using default value 'META-INF/rsc/myfaces-dev-debug.xml'.
[WARNING] [talledLocalContainer] Dec 31, 2012 11:23:07 PM org.apache.myfaces.webapp.WebConfigParamsLogger
logWebContextParams
[WARNING] [talledLocalContainer] INFO: No context init parameter 'org.apache.myfaces.ERROR_HANDLING'
found, using default value 'false, on Development Project stage: true'.
[WARNING] [talledLocalContainer] Dec 31, 2012 11:23:07 PM org.apache.myfaces.webapp.WebConfigParamsLogger
logWebContextParams
[WARNING] [talledLocalContainer] INFO: No context init parameter 'org.apache.myfaces.NUMBER_OF_VIEWS_IN_SESSION'
found, using default value '20'.
[WARNING] [talledLocalContainer] Dec 31, 2012 11:23:07 PM org.apache.myfaces.webapp.WebConfigParamsLogger
logWebContextParams
[WARNING] [talledLocalContainer] INFO: No context init parameter 'org.apache.myfaces.NUMBER_OF_SEQUENTIAL_VIEWS_IN_SESSION'
found.
[WARNING] [talledLocalContainer] Dec 31, 2012 11:23:07 PM org.apache.myfaces.webapp.WebConfigParamsLogger
logWebContextParams
[WARNING] [talledLocalContainer] INFO: No context init parameter 'org.apache.myfaces.SERIALIZE_STATE_IN_SESSION'
found, using default value 'true'.
[WARNING] [talledLocalContainer] Dec 31, 2012 11:23:07 PM org.apache.myfaces.webapp.WebConfigParamsLogger
logWebContextParams
[WARNING] [talledLocalContainer] INFO: No context init parameter 'org.apache.myfaces.COMPRESS_STATE_IN_SESSION'
found, using default value 'true'.
[WARNING] [talledLocalContainer] Dec 31, 2012 11:23:07 PM org.apache.myfaces.webapp.WebConfigParamsLogger
logWebContextParams
[WARNING] [talledLocalContainer] INFO: No context init parameter 'org.apache.myfaces.CACHE_OLD_VIEWS_IN_SESSION_MODE'
found, using default value 'off'.
[WARNING] [talledLocalContainer] Dec 31, 2012 11:23:07 PM org.apache.myfaces.webapp.WebConfigParamsLogger
logWebContextParams
[WARNING] [talledLocalContainer] INFO: No context init parameter 'org.apache.myfaces.USE_FLASH_SCOPE_PURGE_VIEWS_IN_SESSION'
found, using default value 'false'.
[WARNING] [talledLocalContainer] Dec 31, 2012 11:23:07 PM org.apache.myfaces.webapp.WebConfigParamsLogger
logWebContextParams
[WARNING] [talledLocalContainer] INFO: No context init parameter 'org.apache.myfaces.RANDOM_KEY_IN_VIEW_STATE_SESSION_TOKEN'
found, using default value 'none'.
[WARNING] [talledLocalContainer] Dec 31, 2012 11:23:07 PM org.apache.myfaces.webapp.WebConfigParamsLogger
logWebContextParams
[WARNING] [talledLocalContainer] INFO: No context init parameter 'org.apache.myfaces.RANDOM_KEY_IN_VIEW_STATE_SESSION_TOKEN_LENGTH'
found, using default value '8'.
[WARNING] [talledLocalContainer] Dec 31, 2012 11:23:07 PM org.apache.myfaces.webapp.WebConfigParamsLogger
logWebContextParams
[WARNING] [talledLocalContainer] INFO: No context init parameter 'org.apache.myfaces.RANDOM_KEY_IN_VIEW_STATE_SESSION_TOKEN_SECURE_RANDOM_CLASS'
found.
[WARNING] [talledLocalContainer] Dec 31, 2012 11:23:07 PM org.apache.myfaces.webapp.WebConfigParamsLogger
logWebContextParams
[WARNING] [talledLocalContainer] INFO: No context init parameter 'org.apache.myfaces.RANDOM_KEY_IN_VIEW_STATE_SESSION_TOKEN_SECURE_RANDOM_PROVIDER'
found.
[WARNING] [talledLocalContainer] Dec 31, 2012 11:23:07 PM org.apache.myfaces.webapp.WebConfigParamsLogger
logWebContextParams
[WARNING] [talledLocalContainer] INFO: No context init parameter 'org.apache.myfaces.RANDOM_KEY_IN_VIEW_STATE_SESSION_TOKEN_SECURE_RANDOM_ALGORITM'
found, using default value 'SHA1PRNG'.
[WARNING] [talledLocalContainer] Dec 31, 2012 11:23:07 PM org.apache.myfaces.webapp.WebConfigParamsLogger
logWebContextParams
[WARNING] [talledLocalContainer] INFO: No context init parameter 'org.apache.myfaces.HANDLE_STATE_CACHING_MECHANICS'
found, using default value 'true'.
[WARNING] [talledLocalContainer] Dec 31, 2012 11:23:07 PM org.apache.myfaces.webapp.WebConfigParamsLogger
logWebContextParams
[WARNING] [talledLocalContainer] INFO: No context init parameter 'org.apache.myfaces.USE_MULTIPLE_JS_FILES_FOR_JSF_UNCOMPRESSED_JS'
found, using default value 'false'.
[WARNING] [talledLocalContainer] Dec 31, 2012 11:23:07 PM org.apache.myfaces.webapp.WebConfigParamsLogger
logWebContextParams
[WARNING] [talledLocalContainer] INFO: No context init parameter 'org.apache.myfaces.JSF_JS_MODE'
found, using default value 'normal'.
[WARNING] [talledLocalContainer] Dec 31, 2012 11:23:07 PM org.apache.myfaces.webapp.WebConfigParamsLogger
logWebContextParams
[WARNING] [talledLocalContainer] INFO: No context init parameter 'org.apache.myfaces.SERVICE_PROVIDER_FINDER'
found.
[WARNING] [talledLocalContainer] Dec 31, 2012 11:23:07 PM org.apache.myfaces.webapp.WebConfigParamsLogger
logWebContextParams
[WARNING] [talledLocalContainer] INFO: No context init parameter 'javax.faces.DISABLE_FACELET_JSF_VIEWHANDLER'
found, using default value 'false'.
[WARNING] [talledLocalContainer] Dec 31, 2012 11:23:07 PM org.apache.myfaces.webapp.WebConfigParamsLogger
logWebContextParams
[WARNING] [talledLocalContainer] INFO: No context init parameter 'org.apache.myfaces.SAVE_STATE_WITH_VISIT_TREE_ON_PSS'
found, using default value 'true'.
[WARNING] [talledLocalContainer] Dec 31, 2012 11:23:07 PM org.apache.myfaces.webapp.WebConfigParamsLogger
logWebContextParams
[WARNING] [talledLocalContainer] INFO: No context init parameter 'org.apache.myfaces.CHECK_ID_PRODUCTION_MODE'
found, using default value 'auto'.
[WARNING] [talledLocalContainer] Dec 31, 2012 11:23:07 PM org.apache.myfaces.webapp.WebConfigParamsLogger
logWebContextParams
[WARNING] [talledLocalContainer] INFO: No context init parameter 'javax.faces.FACELETS_BUFFER_SIZE'
found.
[WARNING] [talledLocalContainer] Dec 31, 2012 11:23:07 PM org.apache.myfaces.webapp.WebConfigParamsLogger
logWebContextParams
[WARNING] [talledLocalContainer] INFO: No context init parameter 'facelets.BUFFER_SIZE' found.
[WARNING] [talledLocalContainer] Dec 31, 2012 11:23:07 PM org.apache.myfaces.webapp.WebConfigParamsLogger
logWebContextParams
[WARNING] [talledLocalContainer] INFO: No context init parameter 'javax.faces.FACELETS_DECORATORS'
found.
[WARNING] [talledLocalContainer] Dec 31, 2012 11:23:07 PM org.apache.myfaces.webapp.WebConfigParamsLogger
logWebContextParams
[WARNING] [talledLocalContainer] INFO: No context init parameter 'facelets.DECORATORS' found.
[WARNING] [talledLocalContainer] Dec 31, 2012 11:23:07 PM org.apache.myfaces.webapp.WebConfigParamsLogger
logWebContextParams
[WARNING] [talledLocalContainer] INFO: No context init parameter 'javax.faces.FACELETS_LIBRARIES'
found.
[WARNING] [talledLocalContainer] Dec 31, 2012 11:23:07 PM org.apache.myfaces.webapp.WebConfigParamsLogger
logWebContextParams
[WARNING] [talledLocalContainer] INFO: No context init parameter 'facelets.LIBRARIES' found.
[WARNING] [talledLocalContainer] Dec 31, 2012 11:23:07 PM org.apache.myfaces.webapp.WebConfigParamsLogger
logWebContextParams
[WARNING] [talledLocalContainer] INFO: No context init parameter 'javax.faces.FACELETS_REFRESH_PERIOD'
found, using default value '-1'.
[WARNING] [talledLocalContainer] Dec 31, 2012 11:23:07 PM org.apache.myfaces.webapp.WebConfigParamsLogger
logWebContextParams
[WARNING] [talledLocalContainer] INFO: No context init parameter 'facelets.REFRESH_PERIOD'
found, using default value '-1'.
[WARNING] [talledLocalContainer] Dec 31, 2012 11:23:07 PM org.apache.myfaces.webapp.WebConfigParamsLogger
logWebContextParams
[WARNING] [talledLocalContainer] INFO: No context init parameter 'javax.faces.FACELETS_RESOURCE_RESOLVER'
found.
[WARNING] [talledLocalContainer] Dec 31, 2012 11:23:07 PM org.apache.myfaces.webapp.WebConfigParamsLogger
logWebContextParams
[WARNING] [talledLocalContainer] INFO: No context init parameter 'facelets.RESOURCE_RESOLVER'
found.
[WARNING] [talledLocalContainer] Dec 31, 2012 11:23:07 PM org.apache.myfaces.webapp.WebConfigParamsLogger
logWebContextParams
[WARNING] [talledLocalContainer] INFO: No context init parameter 'javax.faces.FACELETS_SKIP_COMMENTS'
found.
[WARNING] [talledLocalContainer] Dec 31, 2012 11:23:07 PM org.apache.myfaces.webapp.WebConfigParamsLogger
logWebContextParams
[WARNING] [talledLocalContainer] INFO: No context init parameter 'facelets.SKIP_COMMENTS'
found.
[WARNING] [talledLocalContainer] Dec 31, 2012 11:23:07 PM org.apache.myfaces.webapp.WebConfigParamsLogger
logWebContextParams
[WARNING] [talledLocalContainer] INFO: No context init parameter 'org.apache.myfaces.WRAP_TAG_EXCEPTIONS_AS_CONTEXT_AWARE'
found, using default value 'true'.
[WARNING] [talledLocalContainer] Dec 31, 2012 11:23:07 PM org.apache.myfaces.webapp.WebConfigParamsLogger
logWebContextParams
[WARNING] [talledLocalContainer] INFO: No context init parameter 'org.apache.myfaces.CACHE_EL_EXPRESSIONS'
found, using default value 'noCache'.
[WARNING] [talledLocalContainer] Dec 31, 2012 11:23:07 PM org.apache.myfaces.webapp.WebConfigParamsLogger
logWebContextParams
[WARNING] [talledLocalContainer] INFO: No context init parameter 'org.apache.myfaces.EXPRESSION_FACTORY'
found.
[WARNING] [talledLocalContainer] Dec 31, 2012 11:23:07 PM org.apache.myfaces.webapp.WebConfigParamsLogger
logWebContextParams
[WARNING] [talledLocalContainer] INFO: No context init parameter 'org.apache.myfaces.INITIALIZE_ALWAYS_STANDALONE'
found, using default value 'false'.
[WARNING] [talledLocalContainer] Dec 31, 2012 11:23:07 PM org.apache.myfaces.webapp.WebConfigParamsLogger
logWebContextParams
[WARNING] [talledLocalContainer] INFO: No context init parameter 'org.apache.myfaces.LOG_WEB_CONTEXT_PARAMS'
found, using default value 'auto'.
[WARNING] [talledLocalContainer] Dec 31, 2012 11:23:07 PM org.apache.myfaces.webapp.WebConfigParamsLogger
logWebContextParams
[WARNING] [talledLocalContainer] INFO: No context init parameter 'org.apache.myfaces.FACES_INITIALIZER'
found.
[WARNING] [talledLocalContainer] Dec 31, 2012 11:23:07 PM org.apache.myfaces.webapp.WebConfigParamsLogger
logWebContextParams
[WARNING] [talledLocalContainer] INFO: No context init parameter 'org.apache.myfaces.FACES_INIT_PLUGINS'
found.
[WARNING] [talledLocalContainer] Dec 31, 2012 11:23:07 PM org.apache.myfaces.util.ExternalSpecifications
isUnifiedELAvailable
[WARNING] [talledLocalContainer] INFO: MyFaces Unified EL support disabled
[WARNING] [talledLocalContainer] Dec 31, 2012 11:23:07 PM org.apache.catalina.startup.HostConfig
deployDirectory
[WARNING] [talledLocalContainer] INFO: Deploying web application directory host-manager
[WARNING] [talledLocalContainer] Dec 31, 2012 11:23:07 PM org.apache.catalina.startup.HostConfig
deployDirectory
[WARNING] [talledLocalContainer] INFO: Deploying web application directory manager
[WARNING] [talledLocalContainer] Dec 31, 2012 11:23:07 PM org.apache.coyote.http11.Http11Protocol
start
[WARNING] [talledLocalContainer] INFO: Starting Coyote HTTP/1.1 on http-9090
[WARNING] [talledLocalContainer] Dec 31, 2012 11:23:08 PM org.apache.jk.common.ChannelSocket
init
[WARNING] [talledLocalContainer] INFO: Port busy 8009 java.net.BindException: Address already
in use
[WARNING] [talledLocalContainer] Dec 31, 2012 11:23:08 PM org.apache.jk.common.ChannelSocket
init
[WARNING] [talledLocalContainer] SEVERE: Can't find free port 8009 8009
[WARNING] [talledLocalContainer] Dec 31, 2012 11:23:08 PM org.apache.jk.server.JkMain start
[WARNING] [talledLocalContainer] INFO: Jk running ID=0 time=0/11  config=null
[WARNING] [talledLocalContainer] Dec 31, 2012 11:23:08 PM org.apache.catalina.startup.Catalina
start
[WARNING] [talledLocalContainer] INFO: Server startup in 1223 ms
[INFO] [talledLocalContainer] Tomcat 6.x started on port [9090]
mojoSucceeded org.codehaus.cargo:cargo-maven2-plugin:1.1.1(start-container)
mojoStarted org.apache.maven.plugins:maven-failsafe-plugin:2.9(htmlunit-integration-tests)
[INFO] 
[INFO] --- maven-failsafe-plugin:2.9:integration-test (htmlunit-integration-tests) @ myfaces-servlet25-el10-basic-tests
---
[INFO] Failsafe report directory: <https://builds.apache.org/job/myfaces-current-2.0-integration-tests/ws/servlet25-el10-basic-tests/target/failsafe-reports>

-------------------------------------------------------
 T E S T S
-------------------------------------------------------
Running org.apache.myfaces.integrationtest.FormInputTest
[WARNING] [talledLocalContainer] Dec 31, 2012 11:23:09 PM org.apache.catalina.core.ApplicationContext
log
[WARNING] [talledLocalContainer] INFO: No state saving method defined, assuming default server
state saving
Tests run: 1, Failures: 0, Errors: 0, Skipped: 0, Time elapsed: 1.801 sec

Results :

Tests run: 1, Failures: 0, Errors: 0, Skipped: 0

[WARNING] File encoding has not been set, using platform encoding ANSI_X3.4-1968, i.e. build
is platform dependent!
mojoSucceeded org.apache.maven.plugins:maven-failsafe-plugin:2.9(htmlunit-integration-tests)
mojoStarted org.codehaus.cargo:cargo-maven2-plugin:1.1.1(stop-container)
[INFO] [INFO] [talledLocalContainer] Tomcat 6.x is stopping...

[INFO] --- cargo-maven2-plugin:1.1.1:stop (stop-container) @ myfaces-servlet25-el10-basic-tests
---
[WARNING] [talledLocalContainer] Dec 31, 2012 11:23:10 PM org.apache.coyote.http11.Http11Protocol
pause
[WARNING] [talledLocalContainer] INFO: Pausing Coyote HTTP/1.1 on http-9090
[WARNING] [talledLocalContainer] Dec 31, 2012 11:23:11 PM org.apache.catalina.core.StandardService
stop
[WARNING] [talledLocalContainer] INFO: Stopping service Catalina
[WARNING] [talledLocalContainer] Dec 31, 2012 11:23:12 PM org.apache.coyote.http11.Http11Protocol
destroy
[WARNING] [talledLocalContainer] INFO: Stopping Coyote HTTP/1.1 on http-9090
mojoFailed org.codehaus.cargo:cargo-maven2-plugin:1.1.1(stop-container)
projectFailed org.apache.myfaces.core.integrationtest:myfaces-servlet25-el10-basic-tests:2.0.15-SNAPSHOT
sessionEnded
[INFO] ------------------------------------------------------------------------
[INFO] Reactor Summary:
[INFO] 
[INFO] Apache MyFaces JSF-2.0 Core Integration Tests Parent  SUCCESS [6.681s]
[INFO] Apache MyFaces JSF-2.0 Core Integration Tests Support Module  SUCCESS [2.655s]
[INFO] Apache MyFaces JSF-2.0 Core Integration Tests - Basic tests for a Servlet 2.5 + EL
1.0 environment  FAILURE [2:08.965s]
[INFO] Apache MyFaces JSF-2.0 Core Integration Tests - Basic tests for a Servlet 2.5 + EL
2.2 environment  SKIPPED
[INFO] Apache MyFaces JSF-2.0 Core Integration Tests - Basic tests for a Servlet 3.0 + EL
2.2 environment  SKIPPED
[INFO] ------------------------------------------------------------------------
[INFO] BUILD FAILURE
[INFO] ------------------------------------------------------------------------
[INFO] Total time: 2:19.132s
[INFO] Finished at: Mon Dec 31 23:25:11 UTC 2012
[INFO] Final Memory: 27M/175M
[INFO] ------------------------------------------------------------------------
Projects to build: [MavenProject: org.apache.myfaces.core.integrationtest:myfaces-integration-tests:2.0.15-SNAPSHOT
@ <https://builds.apache.org/job/myfaces-current-2.0-integration-tests/ws/pom.xml,>
MavenProject: org.apache.myfaces.core.integrationtest:myfaces-integration-test-support:2.0.15-SNAPSHOT
@ <https://builds.apache.org/job/myfaces-current-2.0-integration-tests/ws/integration-test-support/pom.xml,>
MavenProject: org.apache.myfaces.core.integrationtest:myfaces-servlet25-el10-basic-tests:2.0.15-SNAPSHOT
@ <https://builds.apache.org/job/myfaces-current-2.0-integration-tests/ws/servlet25-el10-basic-tests/pom.xml,>
MavenProject: org.apache.myfaces.core.integrationtest:myfaces-servlet25-el22-basic-tests:2.0.15-SNAPSHOT
@ <https://builds.apache.org/job/myfaces-current-2.0-integration-tests/ws/servlet25-el22-basic-tests/pom.xml,>
MavenProject: org.apache.myfaces.core.integrationtest:myfaces-servlet30-el22-basic-tests:2.0.15-SNAPSHOT
@ <https://builds.apache.org/job/myfaces-current-2.0-integration-tests/ws/servlet30-el22-basic-tests/pom.xml]>
[JENKINS] Archiving <https://builds.apache.org/job/myfaces-current-2.0-integration-tests/ws/pom.xml>
to /home/hudson/hudson/jobs/myfaces-current-2.0-integration-tests/modules/org.apache.myfaces.core.integrationtest$myfaces-integration-tests/builds/2012-12-31_23-22-47/archive/org.apache.myfaces.core.integrationtest/myfaces-integration-tests/2.0.15-SNAPSHOT/myfaces-integration-tests-2.0.15-SNAPSHOT.pom
[JENKINS] Archiving <https://builds.apache.org/job/myfaces-current-2.0-integration-tests/ws/integration-test-support/pom.xml>
to /home/hudson/hudson/jobs/myfaces-current-2.0-integration-tests/modules/org.apache.myfaces.core.integrationtest$myfaces-integration-test-support/builds/2012-12-31_23-22-47/archive/org.apache.myfaces.core.integrationtest/myfaces-integration-test-support/2.0.15-SNAPSHOT/myfaces-integration-test-support-2.0.15-SNAPSHOT.pom
[JENKINS] Archiving <https://builds.apache.org/job/myfaces-current-2.0-integration-tests/ws/integration-test-support/target/myfaces-integration-test-support-2.0.15-SNAPSHOT.jar>
to /home/hudson/hudson/jobs/myfaces-current-2.0-integration-tests/modules/org.apache.myfaces.core.integrationtest$myfaces-integration-test-support/builds/2012-12-31_23-22-47/archive/org.apache.myfaces.core.integrationtest/myfaces-integration-test-support/2.0.15-SNAPSHOT/myfaces-integration-test-support-2.0.15-SNAPSHOT.jar
[JENKINS] Archiving <https://builds.apache.org/job/myfaces-current-2.0-integration-tests/ws/integration-test-support/target/myfaces-integration-test-support-2.0.15-SNAPSHOT-sources.jar>
to /home/hudson/hudson/jobs/myfaces-current-2.0-integration-tests/modules/org.apache.myfaces.core.integrationtest$myfaces-integration-test-support/builds/2012-12-31_23-22-47/archive/org.apache.myfaces.core.integrationtest/myfaces-integration-test-support/2.0.15-SNAPSHOT/myfaces-integration-test-support-2.0.15-SNAPSHOT-sources.jar
[JENKINS] Archiving <https://builds.apache.org/job/myfaces-current-2.0-integration-tests/ws/servlet25-el22-basic-tests/pom.xml>
to /home/hudson/hudson/jobs/myfaces-current-2.0-integration-tests/modules/org.apache.myfaces.core.integrationtest$myfaces-servlet25-el22-basic-tests/builds/2012-12-31_23-22-47/archive/org.apache.myfaces.core.integrationtest/myfaces-servlet25-el22-basic-tests/2.0.15-SNAPSHOT/myfaces-servlet25-el22-basic-tests-2.0.15-SNAPSHOT.pom
[JENKINS] Archiving <https://builds.apache.org/job/myfaces-current-2.0-integration-tests/ws/servlet25-el10-basic-tests/pom.xml>
to /home/hudson/hudson/jobs/myfaces-current-2.0-integration-tests/modules/org.apache.myfaces.core.integrationtest$myfaces-servlet25-el10-basic-tests/builds/2012-12-31_23-22-47/archive/org.apache.myfaces.core.integrationtest/myfaces-servlet25-el10-basic-tests/2.0.15-SNAPSHOT/myfaces-servlet25-el10-basic-tests-2.0.15-SNAPSHOT.pom
[JENKINS] Archiving <https://builds.apache.org/job/myfaces-current-2.0-integration-tests/ws/servlet25-el10-basic-tests/target/myfaces-servlet25-el10-basic-tests-2.0.15-SNAPSHOT.war>
to /home/hudson/hudson/jobs/myfaces-current-2.0-integration-tests/modules/org.apache.myfaces.core.integrationtest$myfaces-servlet25-el10-basic-tests/builds/2012-12-31_23-22-47/archive/org.apache.myfaces.core.integrationtest/myfaces-servlet25-el10-basic-tests/2.0.15-SNAPSHOT/myfaces-servlet25-el10-basic-tests-2.0.15-SNAPSHOT.war
[JENKINS] Archiving <https://builds.apache.org/job/myfaces-current-2.0-integration-tests/ws/servlet25-el10-basic-tests/target/myfaces-servlet25-el10-basic-tests-2.0.15-SNAPSHOT-sources.jar>
to /home/hudson/hudson/jobs/myfaces-current-2.0-integration-tests/modules/org.apache.myfaces.core.integrationtest$myfaces-servlet25-el10-basic-tests/builds/2012-12-31_23-22-47/archive/org.apache.myfaces.core.integrationtest/myfaces-servlet25-el10-basic-tests/2.0.15-SNAPSHOT/myfaces-servlet25-el10-basic-tests-2.0.15-SNAPSHOT-sources.jar
[JENKINS] Archiving <https://builds.apache.org/job/myfaces-current-2.0-integration-tests/ws/servlet30-el22-basic-tests/pom.xml>
to /home/hudson/hudson/jobs/myfaces-current-2.0-integration-tests/modules/org.apache.myfaces.core.integrationtest$myfaces-servlet30-el22-basic-tests/builds/2012-12-31_23-22-47/archive/org.apache.myfaces.core.integrationtest/myfaces-servlet30-el22-basic-tests/2.0.15-SNAPSHOT/myfaces-servlet30-el22-basic-tests-2.0.15-SNAPSHOT.pom
Waiting for Jenkins to finish collecting data
mavenExecutionResult exceptions not empty
message : Failed to execute goal org.codehaus.cargo:cargo-maven2-plugin:1.1.1:stop (stop-container)
on project myfaces-servlet25-el10-basic-tests: Execution stop-container of goal org.codehaus.cargo:cargo-maven2-plugin:1.1.1:stop
failed: Failed to stop the Tomcat 6.x container.
cause : Execution stop-container of goal org.codehaus.cargo:cargo-maven2-plugin:1.1.1:stop
failed: Failed to stop the Tomcat 6.x container.
Stack trace : 
org.apache.maven.lifecycle.LifecycleExecutionException: Failed to execute goal org.codehaus.cargo:cargo-maven2-plugin:1.1.1:stop
(stop-container) on project myfaces-servlet25-el10-basic-tests: Execution stop-container of
goal org.codehaus.cargo:cargo-maven2-plugin:1.1.1:stop failed: Failed to stop the Tomcat 6.x
container.
	at org.apache.maven.lifecycle.internal.MojoExecutor.execute(MojoExecutor.java:225)
	at org.apache.maven.lifecycle.internal.MojoExecutor.execute(MojoExecutor.java:153)
	at org.apache.maven.lifecycle.internal.MojoExecutor.execute(MojoExecutor.java:145)
	at org.apache.maven.lifecycle.internal.LifecycleModuleBuilder.buildProject(LifecycleModuleBuilder.java:84)
	at org.apache.maven.lifecycle.internal.LifecycleModuleBuilder.buildProject(LifecycleModuleBuilder.java:59)
	at org.apache.maven.lifecycle.internal.LifecycleStarter.singleThreadedBuild(LifecycleStarter.java:183)
	at org.apache.maven.lifecycle.internal.LifecycleStarter.execute(LifecycleStarter.java:161)
	at org.apache.maven.DefaultMaven.doExecute(DefaultMaven.java:320)
	at org.apache.maven.DefaultMaven.execute(DefaultMaven.java:156)
	at org.jvnet.hudson.maven3.launcher.Maven3Launcher.main(Maven3Launcher.java:79)
	at sun.reflect.NativeMethodAccessorImpl.invoke0(Native Method)
	at sun.reflect.NativeMethodAccessorImpl.invoke(NativeMethodAccessorImpl.java:39)
	at sun.reflect.DelegatingMethodAccessorImpl.invoke(DelegatingMethodAccessorImpl.java:25)
	at java.lang.reflect.Method.invoke(Method.java:597)
	at org.codehaus.plexus.classworlds.launcher.Launcher.launchStandard(Launcher.java:329)
	at org.codehaus.plexus.classworlds.launcher.Launcher.launch(Launcher.java:239)
	at org.jvnet.hudson.maven3.agent.Maven3Main.launch(Maven3Main.java:158)
	at hudson.maven.Maven3Builder.call(Maven3Builder.java:98)
	at hudson.maven.Maven3Builder.call(Maven3Builder.java:64)
	at hudson.remoting.UserRequest.perform(UserRequest.java:118)
	at hudson.remoting.UserRequest.perform(UserRequest.java:48)
	at hudson.remoting.Request$2.run(Request.java:326)
	at hudson.remoting.InterceptingExecutorService$1.call(InterceptingExecutorService.java:72)
	at java.util.concurrent.FutureTask$Sync.innerRun(FutureTask.java:303)
	at java.util.concurrent.FutureTask.run(FutureTask.java:138)
	at java.util.concurrent.ThreadPoolExecutor$Worker.runTask(ThreadPoolExecutor.java:886)
	at java.util.concurrent.ThreadPoolExecutor$Worker.run(ThreadPoolExecutor.java:908)
	at java.lang.Thread.run(Thread.java:662)
Caused by: org.apache.maven.plugin.PluginExecutionException: Execution stop-container of goal
org.codehaus.cargo:cargo-maven2-plugin:1.1.1:stop failed: Failed to stop the Tomcat 6.x container.
	at org.apache.maven.plugin.DefaultBuildPluginManager.executeMojo(DefaultBuildPluginManager.java:110)
	at org.apache.maven.lifecycle.internal.MojoExecutor.execute(MojoExecutor.java:209)
	... 27 more
Caused by: org.codehaus.cargo.container.ContainerException: Failed to stop the Tomcat 6.x
container.
	at org.codehaus.cargo.container.spi.AbstractLocalContainer.stop(AbstractLocalContainer.java:220)
	at org.codehaus.cargo.maven2.ContainerStopMojo.doExecute(ContainerStopMojo.java:49)
	at org.codehaus.cargo.maven2.AbstractCargoMojo.execute(AbstractCargoMojo.java:278)
	at org.apache.maven.plugin.DefaultBuildPluginManager.executeMojo(DefaultBuildPluginManager.java:101)
	... 28 more
Caused by: org.codehaus.cargo.container.ContainerException: Server port 8009 did not shutdown
within the timeout period [120000]
	at org.codehaus.cargo.container.spi.AbstractLocalContainer.waitForPortShutdown(AbstractLocalContainer.java:363)
	at org.codehaus.cargo.container.spi.AbstractLocalContainer.waitForPortShutdown(AbstractLocalContainer.java:297)
	at org.codehaus.cargo.container.tomcat.internal.AbstractCatalinaInstalledLocalContainer.waitForCompletion(AbstractCatalinaInstalledLocalContainer.java:190)
	at org.codehaus.cargo.container.spi.AbstractLocalContainer.stop(AbstractLocalContainer.java:214)
	... 31 more
Sending e-mails to: commits@myfaces.apache.org
channel stopped

Mime
View raw message