myfaces-commits mailing list archives

Site index · List index
Message view « Date » · « Thread »
Top « Date » · « Thread »
From Apache Jenkins Server <jenk...@builds.apache.org>
Subject Build failed in Jenkins: myfaces-trinidad-plugins-1 #16
Date Thu, 02 Feb 2012 00:41:43 GMT
See <https://builds.apache.org/job/myfaces-trinidad-plugins-1/16/>

------------------------------------------
[...truncated 852 lines...]
[INFO] Using 'UTF-8' encoding to read mojo metadata.
[INFO] [INFO] Applying mojo extractor for language: java

[INFO] --- maven-plugin-plugin:2.5.1:descriptor (default-descriptor) @ maven-javascript-plugin
---
[INFO] Mojo extractor for language: java found 2 mojo descriptors.
[INFO] Applying mojo extractor for language: bsh
[INFO] Mojo extractor for language: bsh found 0 mojo descriptors.
[INFO] 
[INFO] --- maven-remote-resources-plugin:1.1:process (default) @ maven-javascript-plugin ---
[INFO] [INFO] Using 'UTF-8' encoding to copy filtered resources.
[INFO] Copying 0 resource
[INFO] Copying 2 resources

[INFO] --- maven-resources-plugin:2.4.3:resources (default-resources) @ maven-javascript-plugin
---
[INFO] [INFO] Compiling 197 source files to <https://builds.apache.org/job/myfaces-trinidad-plugins-1/ws/maven-javascript-plugin/target/classes>

[INFO] --- maven-compiler-plugin:2.3.1:compile (default-compile) @ maven-javascript-plugin
---
[INFO] [INFO] Using 'UTF-8' encoding to copy filtered resources.
[INFO] skip non existing resourceDirectory <https://builds.apache.org/job/myfaces-trinidad-plugins-1/ws/maven-javascript-plugin/src/test/resources>
[INFO] Copying 2 resources

[INFO] --- maven-resources-plugin:2.4.3:testResources (default-testResources) @ maven-javascript-plugin
---
[INFO] [INFO] No sources to compile

[INFO] --- maven-compiler-plugin:2.3.1:testCompile (default-testCompile) @ maven-javascript-plugin
---
[INFO] [INFO] Surefire report directory: <https://builds.apache.org/job/myfaces-trinidad-plugins-1/ws/maven-javascript-plugin/target/surefire-reports>

[INFO] --- maven-surefire-plugin:2.5:test (default-test) @ maven-javascript-plugin ---

-------------------------------------------------------
 T E S T S
-------------------------------------------------------
There are no tests to run.

Results :

Tests run: 0, Failures: 0, Errors: 0, Skipped: 0

[JENKINS] Recording test results
[INFO] 
[INFO] --- maven-jar-plugin:2.3.1:jar (default-jar) @ maven-javascript-plugin ---
[INFO] Building jar: <https://builds.apache.org/job/myfaces-trinidad-plugins-1/ws/maven-javascript-plugin/target/maven-javascript-plugin-2.0.8-SNAPSHOT.jar>
[INFO] 
[INFO] --- maven-plugin-plugin:2.5.1:addPluginArtifactMetadata (default-addPluginArtifactMetadata)
@ maven-javascript-plugin ---
[INFO] [INFO] Installing <https://builds.apache.org/job/myfaces-trinidad-plugins-1/ws/maven-javascript-plugin/target/maven-javascript-plugin-2.0.8-SNAPSHOT.jar>
to /home/jenkins/.m2/repository/org/apache/myfaces/trinidadbuild/maven-javascript-plugin/2.0.8-SNAPSHOT/maven-javascript-plugin-2.0.8-SNAPSHOT.jar
[INFO] Installing <https://builds.apache.org/job/myfaces-trinidad-plugins-1/ws/maven-javascript-plugin/pom.xml>
to /home/jenkins/.m2/repository/org/apache/myfaces/trinidadbuild/maven-javascript-plugin/2.0.8-SNAPSHOT/maven-javascript-plugin-2.0.8-SNAPSHOT.pom

[INFO] --- maven-install-plugin:2.3:install (default-install) @ maven-javascript-plugin ---
[JENKINS] Archiving <https://builds.apache.org/job/myfaces-trinidad-plugins-1/ws/maven-javascript-plugin/pom.xml>
to /home/hudson/hudson/jobs/myfaces-trinidad-plugins-1/modules/org.apache.myfaces.trinidadbuild$maven-javascript-plugin/builds/2012-02-02_00-40-04/archive/org.apache.myfaces.trinidadbuild/maven-javascript-plugin/2.0.8-SNAPSHOT/maven-javascript-plugin-2.0.8-SNAPSHOT.pom
[JENKINS] Archiving <https://builds.apache.org/job/myfaces-trinidad-plugins-1/ws/maven-javascript-plugin/target/maven-javascript-plugin-2.0.8-SNAPSHOT.jar>
to /home/hudson/hudson/jobs/myfaces-trinidad-plugins-1/modules/org.apache.myfaces.trinidadbuild$maven-javascript-plugin/builds/2012-02-02_00-40-04/archive/org.apache.myfaces.trinidadbuild/maven-javascript-plugin/2.0.8-SNAPSHOT/maven-javascript-plugin-2.0.8-SNAPSHOT.jar
[INFO]                                                                         
[INFO] ------------------------------------------------------------------------
[INFO] Building Apache Trinidad Maven XRTS Plugin 2.0.8-SNAPSHOT
[INFO] ------------------------------------------------------------------------
[INFO] 
[INFO] --- maven-enforcer-plugin:1.0-beta-1:enforce (enforce-versions) @ maven-xrts-plugin
---
[INFO] [INFO] Using 2 extractors.
[INFO] Applying extractor for language: java
[INFO] Extractor for language: java found 2 mojo descriptors.
[INFO] Applying extractor for language: bsh
[INFO] Extractor for language: bsh found 0 mojo descriptors.

[INFO] --- maven-plugin-plugin:2.2:descriptor (default-descriptor) @ maven-xrts-plugin ---
[INFO] 
[INFO] --- maven-remote-resources-plugin:1.1:process (default) @ maven-xrts-plugin ---
[INFO] [INFO] Using 'UTF-8' encoding to copy filtered resources.
[INFO] Copying 0 resource
[INFO] Copying 2 resources

[INFO] --- maven-resources-plugin:2.4.3:resources (default-resources) @ maven-xrts-plugin
---
[INFO] [INFO] Compiling 8 source files to <https://builds.apache.org/job/myfaces-trinidad-plugins-1/ws/maven-xrts-plugin/target/classes>

[INFO] --- maven-compiler-plugin:2.3.1:compile (default-compile) @ maven-xrts-plugin ---
[WARNING]  no such file or directory
<https://builds.apache.org/job/myfaces-trinidad-plugins-1/ws/maven-xrts-plugin/src/main/java/org/apache/myfaces/trinidadbuild/plugin/xrts/XRTSParser.java>:[27,18]
[deprecation] org.xml.sax.AttributeList in org.xml.sax has been deprecated

[WARNING] <https://builds.apache.org/job/myfaces-trinidad-plugins-1/ws/maven-xrts-plugin/src/main/java/org/apache/myfaces/trinidadbuild/plugin/xrts/XRTSParser.java>:[28,18]
[deprecation] org.xml.sax.HandlerBase in org.xml.sax has been deprecated

[WARNING] <https://builds.apache.org/job/myfaces-trinidad-plugins-1/ws/maven-xrts-plugin/src/main/java/org/apache/myfaces/trinidadbuild/plugin/xrts/XRTSParser.java>:[36,31]
[deprecation] org.xml.sax.HandlerBase in org.xml.sax has been deprecated

[WARNING] <https://builds.apache.org/job/myfaces-trinidad-plugins-1/ws/maven-xrts-plugin/src/main/java/org/apache/myfaces/trinidadbuild/plugin/xrts/XRTSParser.java>:[100,40]
[deprecation] org.xml.sax.AttributeList in org.xml.sax has been deprecated

[WARNING] <https://builds.apache.org/job/myfaces-trinidad-plugins-1/ws/maven-xrts-plugin/src/main/java/org/apache/myfaces/trinidadbuild/plugin/xrts/XRTSGenerator.java>:[26,18]
[deprecation] org.xml.sax.Parser in org.xml.sax has been deprecated

[WARNING] <https://builds.apache.org/job/myfaces-trinidad-plugins-1/ws/maven-xrts-plugin/src/main/java/org/apache/myfaces/trinidadbuild/plugin/xrts/AbstractGenerateSourcesMojo.java>:[100,25]
[unchecked] unchecked call to LinkedList(java.util.Collection<? extends E>) as a member
of the raw type java.util.LinkedList

[WARNING] <https://builds.apache.org/job/myfaces-trinidad-plugins-1/ws/maven-xrts-plugin/src/main/java/org/apache/myfaces/trinidadbuild/plugin/xrts/AbstractGenerateSourcesMojo.java>:[133,22]
[unchecked] unchecked call to put(K,V) as a member of the raw type java.util.Map

[WARNING] <https://builds.apache.org/job/myfaces-trinidad-plugins-1/ws/maven-xrts-plugin/src/main/java/org/apache/myfaces/trinidadbuild/plugin/xrts/AbstractGenerateSourcesMojo.java>:[134,22]
[unchecked] unchecked call to put(K,V) as a member of the raw type java.util.Map

[WARNING] <https://builds.apache.org/job/myfaces-trinidad-plugins-1/ws/maven-xrts-plugin/src/main/java/org/apache/myfaces/trinidadbuild/plugin/xrts/AbstractGenerateSourcesMojo.java>:[135,22]
[unchecked] unchecked call to put(K,V) as a member of the raw type java.util.Map

[WARNING] <https://builds.apache.org/job/myfaces-trinidad-plugins-1/ws/maven-xrts-plugin/src/main/java/org/apache/myfaces/trinidadbuild/plugin/xrts/AbstractGenerateSourcesMojo.java>:[136,22]
[unchecked] unchecked call to put(K,V) as a member of the raw type java.util.Map

[WARNING] <https://builds.apache.org/job/myfaces-trinidad-plugins-1/ws/maven-xrts-plugin/src/main/java/org/apache/myfaces/trinidadbuild/plugin/xrts/AbstractGenerateSourcesMojo.java>:[137,22]
[unchecked] unchecked call to put(K,V) as a member of the raw type java.util.Map

[WARNING] <https://builds.apache.org/job/myfaces-trinidad-plugins-1/ws/maven-xrts-plugin/src/main/java/org/apache/myfaces/trinidadbuild/plugin/xrts/AbstractGenerateSourcesMojo.java>:[140,57]
[deprecation] toURL() in java.io.File has been deprecated

[INFO] [INFO] Using 'UTF-8' encoding to copy filtered resources.
[INFO] skip non existing resourceDirectory <https://builds.apache.org/job/myfaces-trinidad-plugins-1/ws/maven-xrts-plugin/src/test/resources>
[INFO] Copying 2 resources

[INFO] --- maven-resources-plugin:2.4.3:testResources (default-testResources) @ maven-xrts-plugin
---
[INFO] [INFO] No sources to compile

[INFO] --- maven-compiler-plugin:2.3.1:testCompile (default-testCompile) @ maven-xrts-plugin
---
[INFO] [INFO] Surefire report directory: <https://builds.apache.org/job/myfaces-trinidad-plugins-1/ws/maven-xrts-plugin/target/surefire-reports>

[INFO] --- maven-surefire-plugin:2.5:test (default-test) @ maven-xrts-plugin ---

-------------------------------------------------------
 T E S T S
-------------------------------------------------------
There are no tests to run.

Results :

Tests run: 0, Failures: 0, Errors: 0, Skipped: 0

[JENKINS] Recording test results
[INFO] 
[INFO] --- maven-jar-plugin:2.3.1:jar (default-jar) @ maven-xrts-plugin ---
[INFO] Building jar: <https://builds.apache.org/job/myfaces-trinidad-plugins-1/ws/maven-xrts-plugin/target/maven-xrts-plugin-2.0.8-SNAPSHOT.jar>
[INFO] 
[INFO] --- maven-plugin-plugin:2.2:addPluginArtifactMetadata (default-addPluginArtifactMetadata)
@ maven-xrts-plugin ---
[INFO] [INFO] Installing <https://builds.apache.org/job/myfaces-trinidad-plugins-1/ws/maven-xrts-plugin/target/maven-xrts-plugin-2.0.8-SNAPSHOT.jar>
to /home/jenkins/.m2/repository/org/apache/myfaces/trinidadbuild/maven-xrts-plugin/2.0.8-SNAPSHOT/maven-xrts-plugin-2.0.8-SNAPSHOT.jar
[INFO] Installing <https://builds.apache.org/job/myfaces-trinidad-plugins-1/ws/maven-xrts-plugin/pom.xml>
to /home/jenkins/.m2/repository/org/apache/myfaces/trinidadbuild/maven-xrts-plugin/2.0.8-SNAPSHOT/maven-xrts-plugin-2.0.8-SNAPSHOT.pom

[INFO] --- maven-install-plugin:2.3:install (default-install) @ maven-xrts-plugin ---
[JENKINS] Archiving <https://builds.apache.org/job/myfaces-trinidad-plugins-1/ws/maven-xrts-plugin/pom.xml>
to /home/hudson/hudson/jobs/myfaces-trinidad-plugins-1/modules/org.apache.myfaces.trinidadbuild$maven-xrts-plugin/builds/2012-02-02_00-40-04/archive/org.apache.myfaces.trinidadbuild/maven-xrts-plugin/2.0.8-SNAPSHOT/maven-xrts-plugin-2.0.8-SNAPSHOT.pom
[JENKINS] Archiving <https://builds.apache.org/job/myfaces-trinidad-plugins-1/ws/maven-xrts-plugin/target/maven-xrts-plugin-2.0.8-SNAPSHOT.jar>
to /home/hudson/hudson/jobs/myfaces-trinidad-plugins-1/modules/org.apache.myfaces.trinidadbuild$maven-xrts-plugin/builds/2012-02-02_00-40-04/archive/org.apache.myfaces.trinidadbuild/maven-xrts-plugin/2.0.8-SNAPSHOT/maven-xrts-plugin-2.0.8-SNAPSHOT.jar
[INFO]                                                                         
[INFO] ------------------------------------------------------------------------
[INFO] Building Apache Trinidad Maven Tag Documentation Report 2.0.8-SNAPSHOT
[INFO] ------------------------------------------------------------------------
[INFO] 
[INFO] --- maven-enforcer-plugin:1.0-beta-1:enforce (enforce-versions) @ maven-tagdoc-plugin
---
[INFO] [INFO] Using 'UTF-8' encoding to read mojo metadata.
[INFO] Applying mojo extractor for language: java
[INFO] Mojo extractor for language: java found 1 mojo descriptors.
[INFO] Applying mojo extractor for language: bsh
[INFO] Mojo extractor for language: bsh found 0 mojo descriptors.

[INFO] --- maven-plugin-plugin:2.5.1:descriptor (default-descriptor) @ maven-tagdoc-plugin
---
[INFO] 
[INFO] --- maven-remote-resources-plugin:1.1:process (default) @ maven-tagdoc-plugin ---
[INFO] Using 'UTF-8' encoding to copy filtered resources.
[INFO] [INFO] Copying 0 resource
[INFO] Copying 2 resources

[INFO] --- maven-resources-plugin:2.4.3:resources (default-resources) @ maven-tagdoc-plugin
---
[INFO] [INFO] Compiling 1 source file to <https://builds.apache.org/job/myfaces-trinidad-plugins-1/ws/maven-tagdoc-plugin/target/classes>

[INFO] --- maven-compiler-plugin:2.3.1:compile (default-compile) @ maven-tagdoc-plugin ---
[INFO] [INFO] Using 'UTF-8' encoding to copy filtered resources.
[INFO] skip non existing resourceDirectory <https://builds.apache.org/job/myfaces-trinidad-plugins-1/ws/maven-tagdoc-plugin/src/test/resources>
[INFO] Copying 2 resources

[INFO] --- maven-resources-plugin:2.4.3:testResources (default-testResources) @ maven-tagdoc-plugin
---
[INFO] [INFO] No sources to compile

[INFO] --- maven-compiler-plugin:2.3.1:testCompile (default-testCompile) @ maven-tagdoc-plugin
---
[INFO] Surefire report directory: <https://builds.apache.org/job/myfaces-trinidad-plugins-1/ws/maven-tagdoc-plugin/target/surefire-reports>
[INFO] 
[INFO] --- maven-surefire-plugin:2.5:test (default-test) @ maven-tagdoc-plugin ---

-------------------------------------------------------
 T E S T S
-------------------------------------------------------
There are no tests to run.

Results :

Tests run: 0, Failures: 0, Errors: 0, Skipped: 0

[JENKINS] Recording test results
[INFO] 
[INFO] --- maven-jar-plugin:2.3.1:jar (default-jar) @ maven-tagdoc-plugin ---
[INFO] Building jar: <https://builds.apache.org/job/myfaces-trinidad-plugins-1/ws/maven-tagdoc-plugin/target/maven-tagdoc-plugin-2.0.8-SNAPSHOT.jar>
[INFO] 
[INFO] --- maven-plugin-plugin:2.5.1:addPluginArtifactMetadata (default-addPluginArtifactMetadata)
@ maven-tagdoc-plugin ---
[INFO] [INFO] Installing <https://builds.apache.org/job/myfaces-trinidad-plugins-1/ws/maven-tagdoc-plugin/target/maven-tagdoc-plugin-2.0.8-SNAPSHOT.jar>
to /home/jenkins/.m2/repository/org/apache/myfaces/trinidadbuild/maven-tagdoc-plugin/2.0.8-SNAPSHOT/maven-tagdoc-plugin-2.0.8-SNAPSHOT.jar
[INFO] Installing <https://builds.apache.org/job/myfaces-trinidad-plugins-1/ws/maven-tagdoc-plugin/pom.xml>
to /home/jenkins/.m2/repository/org/apache/myfaces/trinidadbuild/maven-tagdoc-plugin/2.0.8-SNAPSHOT/maven-tagdoc-plugin-2.0.8-SNAPSHOT.pom

[INFO] --- maven-install-plugin:2.3:install (default-install) @ maven-tagdoc-plugin ---
[JENKINS] Archiving <https://builds.apache.org/job/myfaces-trinidad-plugins-1/ws/maven-tagdoc-plugin/pom.xml>
to /home/hudson/hudson/jobs/myfaces-trinidad-plugins-1/modules/org.apache.myfaces.trinidadbuild$maven-tagdoc-plugin/builds/2012-02-02_00-40-04/archive/org.apache.myfaces.trinidadbuild/maven-tagdoc-plugin/2.0.8-SNAPSHOT/maven-tagdoc-plugin-2.0.8-SNAPSHOT.pom
[JENKINS] Archiving <https://builds.apache.org/job/myfaces-trinidad-plugins-1/ws/maven-tagdoc-plugin/target/maven-tagdoc-plugin-2.0.8-SNAPSHOT.jar>
to /home/hudson/hudson/jobs/myfaces-trinidad-plugins-1/modules/org.apache.myfaces.trinidadbuild$maven-tagdoc-plugin/builds/2012-02-02_00-40-04/archive/org.apache.myfaces.trinidadbuild/maven-tagdoc-plugin/2.0.8-SNAPSHOT/maven-tagdoc-plugin-2.0.8-SNAPSHOT.jar
[INFO] ------------------------------------------------------------------------
[INFO] Reactor Summary:
[INFO] 
[INFO] Apache Trinidad Maven Plugin Parent ............... SUCCESS [32.966s]
[INFO] Apache Trinidad Maven JDev Plugin ................. SUCCESS [4.233s]
[INFO] Apache Trinidad Maven Faces Plugin ................ SUCCESS [18.832s]
[INFO] Apache Trinidad Maven Javacc Plugin ............... SUCCESS [3.267s]
[INFO] Apache Trinidad Maven i18n Plugin ................. SUCCESS [2.669s]
[INFO] Apache Trinidad Maven Javascript Plugin ........... SUCCESS [5.437s]
[INFO] Apache Trinidad Maven XRTS Plugin ................. SUCCESS [2.248s]
[INFO] Apache Trinidad Maven Tag Documentation Report .... SUCCESS [2.639s]
[INFO] ------------------------------------------------------------------------
[INFO] BUILD SUCCESS
[INFO] ------------------------------------------------------------------------
[INFO] Total time: 1:25.907s
[INFO] Finished at: Thu Feb 02 00:41:40 UTC 2012
[INFO] Final Memory: 41M/159M
[INFO] ------------------------------------------------------------------------
channel stopped
Maven RedeployPublished use remote ubuntu4 maven settings from : /home/jenkins/.m2/settings.xml
[ERROR] uniqueVersion == false is not anymore supported in maven 3
[INFO] Deployment in https://repository.apache.org/content/repositories/snapshots (id=,uniqueVersion=false)
Deploying the main artifact maven-faces-plugin-2.0.8-SNAPSHOT.jar
Downloading: https://repository.apache.org/content/repositories/snapshots/org/apache/myfaces/trinidadbuild/maven-faces-plugin/2.0.8-SNAPSHOT/maven-metadata.xml
Downloaded: https://repository.apache.org/content/repositories/snapshots/org/apache/myfaces/trinidadbuild/maven-faces-plugin/2.0.8-SNAPSHOT/maven-metadata.xml
(800 B at 0.5 KB/sec)
Uploading: https://repository.apache.org/content/repositories/snapshots/org/apache/myfaces/trinidadbuild/maven-faces-plugin/2.0.8-SNAPSHOT/maven-faces-plugin-2.0.8-20120202.004143-4.jar
Uploading: https://repository.apache.org/content/repositories/snapshots/org/apache/myfaces/trinidadbuild/maven-faces-plugin/2.0.8-SNAPSHOT/maven-faces-plugin-2.0.8-20120202.004143-4.pom
ERROR: Failed to deploy artifacts: Could not transfer artifact org.apache.myfaces.trinidadbuild:maven-faces-plugin:jar:2.0.8-20120202.004143-4
from/to  (https://repository.apache.org/content/repositories/snapshots): Failed to transfer
file: https://repository.apache.org/content/repositories/snapshots/org/apache/myfaces/trinidadbuild/maven-faces-plugin/2.0.8-SNAPSHOT/maven-faces-plugin-2.0.8-20120202.004143-4.jar.
Return code is: 401, ReasonPhrase:Unauthorized.
org.apache.maven.artifact.deployer.ArtifactDeploymentException: Failed to deploy artifacts:
Could not transfer artifact org.apache.myfaces.trinidadbuild:maven-faces-plugin:jar:2.0.8-20120202.004143-4
from/to  (https://repository.apache.org/content/repositories/snapshots): Failed to transfer
file: https://repository.apache.org/content/repositories/snapshots/org/apache/myfaces/trinidadbuild/maven-faces-plugin/2.0.8-SNAPSHOT/maven-faces-plugin-2.0.8-20120202.004143-4.jar.
Return code is: 401, ReasonPhrase:Unauthorized.
	at org.apache.maven.artifact.deployer.DefaultArtifactDeployer.deploy(DefaultArtifactDeployer.java:141)
	at hudson.maven.reporters.MavenArtifactRecord.deploy(MavenArtifactRecord.java:182)
	at hudson.maven.RedeployPublisher.perform(RedeployPublisher.java:158)
	at hudson.tasks.BuildStepMonitor$1.perform(BuildStepMonitor.java:19)
	at hudson.model.AbstractBuild$AbstractRunner.perform(AbstractBuild.java:697)
	at hudson.model.AbstractBuild$AbstractRunner.performAllBuildSteps(AbstractBuild.java:672)
	at hudson.maven.MavenModuleSetBuild$RunnerImpl.post2(MavenModuleSetBuild.java:997)
	at hudson.model.AbstractBuild$AbstractRunner.post(AbstractBuild.java:619)
	at hudson.model.Run.run(Run.java:1429)
	at hudson.maven.MavenModuleSetBuild.run(MavenModuleSetBuild.java:481)
	at hudson.model.ResourceController.execute(ResourceController.java:88)
	at hudson.model.Executor.run(Executor.java:238)
Caused by: org.sonatype.aether.deployment.DeploymentException: Failed to deploy artifacts:
Could not transfer artifact org.apache.myfaces.trinidadbuild:maven-faces-plugin:jar:2.0.8-20120202.004143-4
from/to  (https://repository.apache.org/content/repositories/snapshots): Failed to transfer
file: https://repository.apache.org/content/repositories/snapshots/org/apache/myfaces/trinidadbuild/maven-faces-plugin/2.0.8-SNAPSHOT/maven-faces-plugin-2.0.8-20120202.004143-4.jar.
Return code is: 401, ReasonPhrase:Unauthorized.
	at org.sonatype.aether.impl.internal.DefaultDeployer.deploy(DefaultDeployer.java:280)
	at org.sonatype.aether.impl.internal.DefaultDeployer.deploy(DefaultDeployer.java:211)
	at org.sonatype.aether.impl.internal.DefaultRepositorySystem.deploy(DefaultRepositorySystem.java:443)
	at org.apache.maven.artifact.deployer.DefaultArtifactDeployer.deploy(DefaultArtifactDeployer.java:137)
	... 11 more
Caused by: org.sonatype.aether.transfer.ArtifactTransferException: Could not transfer artifact
org.apache.myfaces.trinidadbuild:maven-faces-plugin:jar:2.0.8-20120202.004143-4 from/to  (https://repository.apache.org/content/repositories/snapshots):
Failed to transfer file: https://repository.apache.org/content/repositories/snapshots/org/apache/myfaces/trinidadbuild/maven-faces-plugin/2.0.8-SNAPSHOT/maven-faces-plugin-2.0.8-20120202.004143-4.jar.
Return code is: 401, ReasonPhrase:Unauthorized.
	at org.sonatype.aether.connector.wagon.WagonRepositoryConnector$4.wrap(WagonRepositoryConnector.java:950)
	at org.sonatype.aether.connector.wagon.WagonRepositoryConnector$4.wrap(WagonRepositoryConnector.java:940)
	at org.sonatype.aether.connector.wagon.WagonRepositoryConnector$PutTask.run(WagonRepositoryConnector.java:837)
	at org.sonatype.aether.connector.wagon.WagonRepositoryConnector.put(WagonRepositoryConnector.java:467)
	at org.sonatype.aether.impl.internal.DefaultDeployer.deploy(DefaultDeployer.java:274)
	... 14 more
Caused by: org.apache.maven.wagon.TransferFailedException: Failed to transfer file: https://repository.apache.org/content/repositories/snapshots/org/apache/myfaces/trinidadbuild/maven-faces-plugin/2.0.8-SNAPSHOT/maven-faces-plugin-2.0.8-20120202.004143-4.jar.
Return code is: 401, ReasonPhrase:Unauthorized.
	at org.apache.maven.wagon.shared.http4.AbstractHttpClientWagon.put(AbstractHttpClientWagon.java:562)
	at org.apache.maven.wagon.shared.http4.AbstractHttpClientWagon.put(AbstractHttpClientWagon.java:471)
	at org.apache.maven.wagon.shared.http4.AbstractHttpClientWagon.put(AbstractHttpClientWagon.java:451)
	at org.sonatype.aether.connector.wagon.WagonRepositoryConnector$PutTask.run(WagonRepositoryConnector.java:811)
	... 16 more
[INFO] Deployment failed after 1.9 sec
Build step 'Deploy artifacts to Maven repository' changed build result to FAILURE


Mime
View raw message