myfaces-commits mailing list archives

Site index · List index
Message view « Date » · « Thread »
Top « Date » · « Thread »
From Apache Jenkins Server <jenk...@builds.apache.org>
Subject Build failed in Jenkins: myfaces-trinidad-core-1.0 #639
Date Fri, 24 Feb 2012 01:51:46 GMT
See <https://builds.apache.org/job/myfaces-trinidad-core-1.0/639/>

------------------------------------------
[...truncated 6168 lines...]
[INFO] Dependency[Dependency {groupId=org.apache.myfaces.trinidad, artifactId=trinidad-impl,
version=1.0.14-SNAPSHOT, type=jar}] has changed (was Dependency {groupId=org.apache.myfaces.trinidad,
artifactId=trinidad-impl, version=1.0.14-SNAPSHOT, type=jar}).
[INFO] Dependency[Dependency {groupId=org.apache.myfaces.core, artifactId=myfaces-api, version=1.1.7,
type=jar}] has changed (was Dependency {groupId=org.apache.myfaces.core, artifactId=myfaces-api,
version=1.1.7, type=jar}).
[INFO] Dependency[Dependency {groupId=org.apache.myfaces.core, artifactId=myfaces-impl, version=1.1.7,
type=jar}] has changed (was Dependency {groupId=org.apache.myfaces.core, artifactId=myfaces-impl,
version=1.1.7, type=jar}).
[INFO] Processing war project
[INFO] Copying webapp resources[<https://builds.apache.org/job/myfaces-trinidad-core-1.0/ws/trinidad-examples/trinidad-blank/src/main/webapp]>
[INFO] Webapp assembled in[63 msecs]
[INFO] Building war: <https://builds.apache.org/job/myfaces-trinidad-core-1.0/ws/trinidad-examples/trinidad-blank/target/trinidad-blank-1.0.14-SNAPSHOT.war>
[INFO] Preparing source:jar
[WARNING] Removing: jar from forked lifecycle, to prevent recursive invocation.
[JENKINS] Re-archiving <https://builds.apache.org/job/myfaces-trinidad-core-1.0/ws/trinidad-examples/trinidad-blank/target/trinidad-blank-1.0.14-SNAPSHOT.war>
[JENKINS] Archiving <https://builds.apache.org/job/myfaces-trinidad-core-1.0/ws/trinidad-examples/trinidad-blank/target/trinidad-blank-1.0.14-SNAPSHOT-sources.jar>
to /home/hudson/hudson/jobs/myfaces-trinidad-core-1.0/modules/org.apache.myfaces.trinidad$trinidad-blank/builds/2012-02-24_00-34-41/archive/org.apache.myfaces.trinidad/trinidad-blank/1.0.14-SNAPSHOT/trinidad-blank-1.0.14-SNAPSHOT-sources.jar
[INFO] [xrts:generate-sources {execution: default}]
[INFO] [source:jar {execution: attach-source}]
[INFO] META-INF already added, skipping
[INFO] META-INF/NOTICE already added, skipping
[INFO] META-INF/LICENSE already added, skipping
[INFO] META-INF already added, skipping
[INFO] META-INF/NOTICE already added, skipping
[INFO] META-INF/LICENSE already added, skipping
[INFO] META-INF already added, skipping
[INFO] META-INF/NOTICE already added, skipping
[INFO] META-INF/LICENSE already added, skipping
[INFO] Building jar: <https://builds.apache.org/job/myfaces-trinidad-core-1.0/ws/trinidad-examples/trinidad-blank/target/trinidad-blank-1.0.14-SNAPSHOT-sources.jar>
[INFO] META-INF already added, skipping
[INFO] META-INF/NOTICE already added, skipping
[INFO] META-INF/LICENSE already added, skipping
[INFO] META-INF already added, skipping
[INFO] META-INF/NOTICE already added, skipping
[INFO] META-INF/LICENSE already added, skipping
[INFO] META-INF already added, skipping
[INFO] META-INF/NOTICE already added, skipping
[INFO] META-INF/LICENSE already added, skipping
[INFO] [install:install {execution: default-install}]
[INFO] Installing <https://builds.apache.org/job/myfaces-trinidad-core-1.0/ws/trinidad-examples/trinidad-blank/target/trinidad-blank-1.0.14-SNAPSHOT.war>
to /export/home/hudson/hudson-slave/maven-repositories/1/org/apache/myfaces/trinidad/trinidad-blank/1.0.14-SNAPSHOT/trinidad-blank-1.0.14-SNAPSHOT.war
[INFO] Installing <https://builds.apache.org/job/myfaces-trinidad-core-1.0/ws/trinidad-examples/trinidad-blank/target/trinidad-blank-1.0.14-SNAPSHOT-sources.jar>
to /export/home/hudson/hudson-slave/maven-repositories/1/org/apache/myfaces/trinidad/trinidad-blank/1.0.14-SNAPSHOT/trinidad-blank-1.0.14-SNAPSHOT-sources.jar
[INFO] Installing <https://builds.apache.org/job/myfaces-trinidad-core-1.0/ws/trinidad-examples/trinidad-blank/target/trinidad-blank-1.0.14-SNAPSHOT-sources.jar>
to /export/home/hudson/hudson-slave/maven-repositories/1/org/apache/myfaces/trinidad/trinidad-blank/1.0.14-SNAPSHOT/trinidad-blank-1.0.14-SNAPSHOT-sources.jar
[INFO] [deploy:deploy {execution: default-deploy}]
[INFO] Retrieving previous build number from apache.snapshots.https
[WARNING] *** CHECKSUM FAILED - Checksum failed on download: local = '00a8bd510ef03efcc15c29c4d6914bb2246a1fc9';
remote = 'd200b950e8f0a255600c4bc4b1ec23dd2129c13f' - RETRYING
[WARNING] *** CHECKSUM FAILED - Checksum failed on download: local = '00a8bd510ef03efcc15c29c4d6914bb2246a1fc9';
remote = 'd200b950e8f0a255600c4bc4b1ec23dd2129c13f' - IGNORING
Uploading: https://repository.apache.org/content/repositories/snapshots/org/apache/myfaces/trinidad/trinidad-blank/1.0.14-SNAPSHOT/trinidad-blank-1.0.14-20120224.004053-852.war
6653K uploaded  (trinidad-blank-1.0.14-20120224.004053-852.war)
[INFO] Retrieving previous metadata from apache.snapshots.https
[INFO] Uploading repository metadata for: 'artifact org.apache.myfaces.trinidad:trinidad-blank'
[INFO] Uploading project information for trinidad-blank 1.0.14-20120224.004053-852
[INFO] Retrieving previous metadata from apache.snapshots.https
[WARNING] *** CHECKSUM FAILED - Checksum failed on download: local = '00a8bd510ef03efcc15c29c4d6914bb2246a1fc9';
remote = 'd200b950e8f0a255600c4bc4b1ec23dd2129c13f' - RETRYING
[WARNING] *** CHECKSUM FAILED - Checksum failed on download: local = '00a8bd510ef03efcc15c29c4d6914bb2246a1fc9';
remote = 'd200b950e8f0a255600c4bc4b1ec23dd2129c13f' - IGNORING
[INFO] Uploading repository metadata for: 'snapshot org.apache.myfaces.trinidad:trinidad-blank:1.0.14-SNAPSHOT'
[INFO] Retrieving previous build number from apache.snapshots.https
Uploading: https://repository.apache.org/content/repositories/snapshots/org/apache/myfaces/trinidad/trinidad-blank/1.0.14-SNAPSHOT/trinidad-blank-1.0.14-20120224.004053-852-sources.jar
6K uploaded  (trinidad-blank-1.0.14-20120224.004053-852-sources.jar)
[INFO] Retrieving previous build number from apache.snapshots.https
Uploading: https://repository.apache.org/content/repositories/snapshots/org/apache/myfaces/trinidad/trinidad-blank/1.0.14-SNAPSHOT/trinidad-blank-1.0.14-20120224.004053-852-sources.jar
6K uploaded  (trinidad-blank-1.0.14-20120224.004053-852-sources.jar)
[JENKINS] Archiving <https://builds.apache.org/job/myfaces-trinidad-core-1.0/ws/trinidad-examples/trinidad-blank/target/trinidad-blank-1.0.14-SNAPSHOT.war>
to /home/hudson/hudson/jobs/myfaces-trinidad-core-1.0/modules/org.apache.myfaces.trinidad$trinidad-blank/builds/2012-02-24_00-34-41/archive/org.apache.myfaces.trinidad/trinidad-blank/1.0.14-20120224.004053-852/trinidad-blank-1.0.14-20120224.004053-852.war
[JENKINS] Archiving <https://builds.apache.org/job/myfaces-trinidad-core-1.0/ws/trinidad-examples/trinidad-blank/target/trinidad-blank-1.0.14-SNAPSHOT-sources.jar>
to /home/hudson/hudson/jobs/myfaces-trinidad-core-1.0/modules/org.apache.myfaces.trinidad$trinidad-blank/builds/2012-02-24_00-34-41/archive/org.apache.myfaces.trinidad/trinidad-blank/1.0.14-20120224.004053-852/trinidad-blank-1.0.14-20120224.004053-852-sources.jar
[INFO] ------------------------------------------------------------------------
[INFO] Building Apache MyFaces Trinidad Demo
[INFO]    task-segment: [clean, install, deploy]
[INFO] ------------------------------------------------------------------------
[INFO] [clean:clean {execution: default-clean}]
[INFO] Deleting file set: <https://builds.apache.org/job/myfaces-trinidad-core-1.0/ws/trinidad-examples/trinidad-demo/target>
(included: [**], excluded: [])
[INFO] [xrts:generate-sources {execution: default}]
[INFO] [remote-resources:process {execution: default}]
[INFO] [resources:resources {execution: default-resources}]
[INFO] Using 'UTF-8' encoding to copy filtered resources.
[INFO] Copying 0 resource
[INFO] Copying 2 resources
[INFO] [compiler:compile {execution: default-compile}]
[INFO] Compiling 85 source files to <https://builds.apache.org/job/myfaces-trinidad-core-1.0/ws/trinidad-examples/trinidad-demo/target/classes>
[INFO] [xrts:generate-test-sources {execution: default}]
[INFO] [resources:testResources {execution: default-testResources}]
[INFO] Using 'UTF-8' encoding to copy filtered resources.
[INFO] skip non existing resourceDirectory <https://builds.apache.org/job/myfaces-trinidad-core-1.0/ws/trinidad-examples/trinidad-demo/src/test/resources>
[INFO] Copying 2 resources
[INFO] [compiler:testCompile {execution: default-testCompile}]
[INFO] Compiling 5 source files to <https://builds.apache.org/job/myfaces-trinidad-core-1.0/ws/trinidad-examples/trinidad-demo/target/test-classes>
[INFO] [surefire:test {execution: default-test}]
[INFO] Surefire report directory: <https://builds.apache.org/job/myfaces-trinidad-core-1.0/ws/trinidad-examples/trinidad-demo/target/surefire-reports>

[JENKINS] Recording test results-------------------------------------------------------
 T E S T S
-------------------------------------------------------
There are no tests to run.

Results :

Tests run: 0, Failures: 0, Errors: 0, Skipped: 0


[INFO] [war:war {execution: default-war}]
[INFO] Packaging webapp
[INFO] Assembling webapp[trinidad-demo] in [<https://builds.apache.org/job/myfaces-trinidad-core-1.0/ws/trinidad-examples/trinidad-demo/target/trinidad-demo-1.0.14-SNAPSHOT]>
[INFO] Processing war project
[INFO] Copying webapp resources[<https://builds.apache.org/job/myfaces-trinidad-core-1.0/ws/trinidad-examples/trinidad-demo/src/main/webapp]>
[INFO] Webapp assembled in[1804 msecs]
[INFO] Building war: <https://builds.apache.org/job/myfaces-trinidad-core-1.0/ws/trinidad-examples/trinidad-demo/target/trinidad-demo-1.0.14-SNAPSHOT.war>
[INFO] Preparing source:jar
[WARNING] Removing: jar from forked lifecycle, to prevent recursive invocation.
[JENKINS] Archiving <https://builds.apache.org/job/myfaces-trinidad-core-1.0/ws/trinidad-examples/trinidad-demo/pom.xml>
to /home/hudson/hudson/jobs/myfaces-trinidad-core-1.0/modules/org.apache.myfaces.trinidad$trinidad-demo/builds/2012-02-24_00-34-41/archive/org.apache.myfaces.trinidad/trinidad-demo/1.0.14-SNAPSHOT/trinidad-demo-1.0.14-SNAPSHOT.pom
[JENKINS] Archiving <https://builds.apache.org/job/myfaces-trinidad-core-1.0/ws/trinidad-examples/trinidad-demo/target/trinidad-demo-1.0.14-SNAPSHOT.war>
to /home/hudson/hudson/jobs/myfaces-trinidad-core-1.0/modules/org.apache.myfaces.trinidad$trinidad-demo/builds/2012-02-24_00-34-41/archive/org.apache.myfaces.trinidad/trinidad-demo/1.0.14-SNAPSHOT/trinidad-demo-1.0.14-SNAPSHOT.war
[INFO] [xrts:generate-sources {execution: default}]
[INFO] [source:jar {execution: attach-source}]
[INFO] META-INF already added, skipping
[INFO] META-INF already added, skipping
[INFO] META-INF/LICENSE already added, skipping
[INFO] META-INF/NOTICE already added, skipping
[INFO] Building jar: <https://builds.apache.org/job/myfaces-trinidad-core-1.0/ws/trinidad-examples/trinidad-demo/target/trinidad-demo-1.0.14-SNAPSHOT-sources.jar>
[INFO] META-INF already added, skipping
[INFO] META-INF already added, skipping
[INFO] META-INF/LICENSE already added, skipping
[INFO] META-INF/NOTICE already added, skipping
[INFO] [install:install {execution: default-install}]
[INFO] Installing <https://builds.apache.org/job/myfaces-trinidad-core-1.0/ws/trinidad-examples/trinidad-demo/target/trinidad-demo-1.0.14-SNAPSHOT.war>
to /export/home/hudson/hudson-slave/maven-repositories/1/org/apache/myfaces/trinidad/trinidad-demo/1.0.14-SNAPSHOT/trinidad-demo-1.0.14-SNAPSHOT.war
[INFO] Installing <https://builds.apache.org/job/myfaces-trinidad-core-1.0/ws/trinidad-examples/trinidad-demo/target/trinidad-demo-1.0.14-SNAPSHOT-sources.jar>
to /export/home/hudson/hudson-slave/maven-repositories/1/org/apache/myfaces/trinidad/trinidad-demo/1.0.14-SNAPSHOT/trinidad-demo-1.0.14-SNAPSHOT-sources.jar
[INFO] [xrts:generate-sources {execution: default}]
[INFO] [remote-resources:process {execution: default}]
[INFO] [resources:resources {execution: default-resources}]
[INFO] Using 'UTF-8' encoding to copy filtered resources.
[INFO] Copying 0 resource
[INFO] Copying 2 resources
[INFO] Copying 2 resources
[INFO] [compiler:compile {execution: default-compile}]
[INFO] Nothing to compile - all classes are up to date
[INFO] [xrts:generate-test-sources {execution: default}]
[INFO] [resources:testResources {execution: default-testResources}]
[INFO] Using 'UTF-8' encoding to copy filtered resources.
[INFO] skip non existing resourceDirectory <https://builds.apache.org/job/myfaces-trinidad-core-1.0/ws/trinidad-examples/trinidad-demo/src/test/resources>
[INFO] Copying 2 resources
[INFO] Copying 2 resources
[INFO] [compiler:testCompile {execution: default-testCompile}]
[INFO] Nothing to compile - all classes are up to date
[INFO] [surefire:test {execution: default-test}]
[INFO] Surefire report directory: <https://builds.apache.org/job/myfaces-trinidad-core-1.0/ws/trinidad-examples/trinidad-demo/target/surefire-reports>

-------------------------------------------------------
 T E S T S
-------------------------------------------------------
There are no tests to run.

Results :

Tests run: 0, Failures: 0, Errors: 0, Skipped: 0

[JENKINS] Recording test results
[INFO] [war:war {execution: default-war}]
[INFO] Packaging webapp
[INFO] Assembling webapp[trinidad-demo] in [<https://builds.apache.org/job/myfaces-trinidad-core-1.0/ws/trinidad-examples/trinidad-demo/target/trinidad-demo-1.0.14-SNAPSHOT]>
[INFO] Dependency[Dependency {groupId=javax.mail, artifactId=mail, version=1.4, type=jar}]
has changed (was Dependency {groupId=javax.mail, artifactId=mail, version=1.4, type=jar}).
[INFO] Dependency[Dependency {groupId=javax.activation, artifactId=activation, version=1.1,
type=jar}] has changed (was Dependency {groupId=javax.activation, artifactId=activation, version=1.1,
type=jar}).
[INFO] Dependency[Dependency {groupId=commons-lang, artifactId=commons-lang, version=2.4,
type=jar}] has changed (was Dependency {groupId=commons-lang, artifactId=commons-lang, version=2.4,
type=jar}).
[INFO] Dependency[Dependency {groupId=org.apache.myfaces.trinidad, artifactId=trinidad-api,
version=1.0.14-SNAPSHOT, type=jar}] has changed (was Dependency {groupId=org.apache.myfaces.trinidad,
artifactId=trinidad-api, version=1.0.14-SNAPSHOT, type=jar}).
[INFO] Dependency[Dependency {groupId=org.apache.myfaces.trinidad, artifactId=trinidad-impl,
version=1.0.14-SNAPSHOT, type=jar}] has changed (was Dependency {groupId=org.apache.myfaces.trinidad,
artifactId=trinidad-impl, version=1.0.14-SNAPSHOT, type=jar}).
[INFO] Dependency[Dependency {groupId=org.apache.myfaces.core, artifactId=myfaces-api, version=1.1.7,
type=jar}] has changed (was Dependency {groupId=org.apache.myfaces.core, artifactId=myfaces-api,
version=1.1.7, type=jar}).
[INFO] Dependency[Dependency {groupId=org.apache.myfaces.core, artifactId=myfaces-impl, version=1.1.7,
type=jar}] has changed (was Dependency {groupId=org.apache.myfaces.core, artifactId=myfaces-impl,
version=1.1.7, type=jar}).
[INFO] Processing war project
[INFO] Copying webapp resources[<https://builds.apache.org/job/myfaces-trinidad-core-1.0/ws/trinidad-examples/trinidad-demo/src/main/webapp]>
[INFO] Webapp assembled in[323 msecs]
[INFO] Building war: <https://builds.apache.org/job/myfaces-trinidad-core-1.0/ws/trinidad-examples/trinidad-demo/target/trinidad-demo-1.0.14-SNAPSHOT.war>
[INFO] Preparing source:jar
[WARNING] Removing: jar from forked lifecycle, to prevent recursive invocation.
[JENKINS] Re-archiving <https://builds.apache.org/job/myfaces-trinidad-core-1.0/ws/trinidad-examples/trinidad-demo/target/trinidad-demo-1.0.14-SNAPSHOT.war>
[JENKINS] Archiving <https://builds.apache.org/job/myfaces-trinidad-core-1.0/ws/trinidad-examples/trinidad-demo/target/trinidad-demo-1.0.14-SNAPSHOT-sources.jar>
to /home/hudson/hudson/jobs/myfaces-trinidad-core-1.0/modules/org.apache.myfaces.trinidad$trinidad-demo/builds/2012-02-24_00-34-41/archive/org.apache.myfaces.trinidad/trinidad-demo/1.0.14-SNAPSHOT/trinidad-demo-1.0.14-SNAPSHOT-sources.jar
[INFO] [xrts:generate-sources {execution: default}]
[INFO] [source:jar {execution: attach-source}]
[INFO] META-INF already added, skipping
[INFO] META-INF/LICENSE already added, skipping
[INFO] META-INF/NOTICE already added, skipping
[INFO] META-INF already added, skipping
[INFO] META-INF already added, skipping
[INFO] META-INF/LICENSE already added, skipping
[INFO] META-INF/NOTICE already added, skipping
[INFO] META-INF already added, skipping
[INFO] META-INF/LICENSE already added, skipping
[INFO] META-INF/NOTICE already added, skipping
[INFO] [install:install {execution: default-install}]
[INFO] Installing <https://builds.apache.org/job/myfaces-trinidad-core-1.0/ws/trinidad-examples/trinidad-demo/target/trinidad-demo-1.0.14-SNAPSHOT.war>
to /export/home/hudson/hudson-slave/maven-repositories/1/org/apache/myfaces/trinidad/trinidad-demo/1.0.14-SNAPSHOT/trinidad-demo-1.0.14-SNAPSHOT.war
[INFO] Installing <https://builds.apache.org/job/myfaces-trinidad-core-1.0/ws/trinidad-examples/trinidad-demo/target/trinidad-demo-1.0.14-SNAPSHOT-sources.jar>
to /export/home/hudson/hudson-slave/maven-repositories/1/org/apache/myfaces/trinidad/trinidad-demo/1.0.14-SNAPSHOT/trinidad-demo-1.0.14-SNAPSHOT-sources.jar
[INFO] Installing <https://builds.apache.org/job/myfaces-trinidad-core-1.0/ws/trinidad-examples/trinidad-demo/target/trinidad-demo-1.0.14-SNAPSHOT-sources.jar>
to /export/home/hudson/hudson-slave/maven-repositories/1/org/apache/myfaces/trinidad/trinidad-demo/1.0.14-SNAPSHOT/trinidad-demo-1.0.14-SNAPSHOT-sources.jar
[INFO] [deploy:deploy {execution: default-deploy}]
[INFO] Retrieving previous build number from apache.snapshots.https
[WARNING] *** CHECKSUM FAILED - Checksum failed on download: local = 'bfa6b0c06dc71f840c1997bca9c7621cf8244c8e';
remote = 'c05229c07905a45433294ba84cf0220fbf7da4aa' - RETRYING
[WARNING] *** CHECKSUM FAILED - Checksum failed on download: local = 'bfa6b0c06dc71f840c1997bca9c7621cf8244c8e';
remote = 'c05229c07905a45433294ba84cf0220fbf7da4aa' - IGNORING
Uploading: https://repository.apache.org/content/repositories/snapshots/org/apache/myfaces/trinidad/trinidad-demo/1.0.14-SNAPSHOT/trinidad-demo-1.0.14-20120224.004053-841.war
7930K uploaded  (trinidad-demo-1.0.14-20120224.004053-841.war)
[INFO] Retrieving previous metadata from apache.snapshots.https
[WARNING] *** CHECKSUM FAILED - Checksum failed on download: local = 'bfa6b0c06dc71f840c1997bca9c7621cf8244c8e';
remote = 'c05229c07905a45433294ba84cf0220fbf7da4aa' - RETRYING
[WARNING] *** CHECKSUM FAILED - Checksum failed on download: local = 'bfa6b0c06dc71f840c1997bca9c7621cf8244c8e';
remote = 'c05229c07905a45433294ba84cf0220fbf7da4aa' - IGNORING
[INFO] Uploading repository metadata for: 'snapshot org.apache.myfaces.trinidad:trinidad-demo:1.0.14-SNAPSHOT'
[INFO] Uploading project information for trinidad-demo 1.0.14-20120224.004053-841
[INFO] Retrieving previous metadata from apache.snapshots.https
[INFO] Uploading repository metadata for: 'artifact org.apache.myfaces.trinidad:trinidad-demo'
[INFO] Retrieving previous build number from apache.snapshots.https
Uploading: https://repository.apache.org/content/repositories/snapshots/org/apache/myfaces/trinidad/trinidad-demo/1.0.14-SNAPSHOT/trinidad-demo-1.0.14-20120224.004053-841-sources.jar
132K uploaded  (trinidad-demo-1.0.14-20120224.004053-841-sources.jar)
[INFO] Retrieving previous build number from apache.snapshots.https
Uploading: https://repository.apache.org/content/repositories/snapshots/org/apache/myfaces/trinidad/trinidad-demo/1.0.14-SNAPSHOT/trinidad-demo-1.0.14-20120224.004053-841-sources.jar
132K uploaded  (trinidad-demo-1.0.14-20120224.004053-841-sources.jar)
[JENKINS] Archiving <https://builds.apache.org/job/myfaces-trinidad-core-1.0/ws/trinidad-examples/trinidad-demo/target/trinidad-demo-1.0.14-SNAPSHOT.war>
to /home/hudson/hudson/jobs/myfaces-trinidad-core-1.0/modules/org.apache.myfaces.trinidad$trinidad-demo/builds/2012-02-24_00-34-41/archive/org.apache.myfaces.trinidad/trinidad-demo/1.0.14-20120224.004053-841/trinidad-demo-1.0.14-20120224.004053-841.war
[JENKINS] Archiving <https://builds.apache.org/job/myfaces-trinidad-core-1.0/ws/trinidad-examples/trinidad-demo/target/trinidad-demo-1.0.14-SNAPSHOT-sources.jar>
to /home/hudson/hudson/jobs/myfaces-trinidad-core-1.0/modules/org.apache.myfaces.trinidad$trinidad-demo/builds/2012-02-24_00-34-41/archive/org.apache.myfaces.trinidad/trinidad-demo/1.0.14-20120224.004053-841/trinidad-demo-1.0.14-20120224.004053-841-sources.jar
[INFO] 
[INFO] 
[INFO] ------------------------------------------------------------------------
[INFO] Reactor Summary:
[INFO] ------------------------------------------------------------------------
[INFO] Apache MyFaces Trinidad ............................... SUCCESS [3:12.595s]
[INFO] Apache MyFaces Trinidad Build ......................... SUCCESS [4:39.984s]
[INFO] Apache MyFaces Trinidad API ........................... SUCCESS [6:40.416s]
[INFO] Apache MyFaces Trinidad Impl .......................... SUCCESS [14:52.570s]
[INFO] Apache MyFaces Trinidad Examples ...................... SUCCESS [26.454s]
[INFO] Apache MyFaces Trinidad Blank Demo .................... SUCCESS [10:13.842s]
[INFO] Apache MyFaces Trinidad Demo .......................... SUCCESS [12:12.365s]
[INFO] ------------------------------------------------------------------------
[INFO] ------------------------------------------------------------------------
[INFO] BUILD SUCCESSFUL
[INFO] ------------------------------------------------------------------------
[INFO] Total time: 73 minutes 38 seconds
[INFO] Finished at: Fri Feb 24 01:51:37 UTC 2012
[INFO] Final Memory: 55M/294M
[INFO] ------------------------------------------------------------------------
channel stopped
Maven RedeployPublished use remote solaris1 maven settings from : /export/home/hudson/.m2/settings.xml
[INFO] Deployment in https://repository.apache.org/content/repositories/snapshots (id=,uniqueVersion=false)
Deploying the main artifact trinidad-1.0.14-20120224.004053-906.pom
ERROR: Error deploying artifact: Failed to transfer file: https://repository.apache.org/content/repositories/snapshots/org/apache/myfaces/trinidad/trinidad/1.0.14-SNAPSHOT/trinidad-1.0.14-SNAPSHOT.pom.
Return code is: 401, ReasonPhrase:Unauthorized.
org.apache.maven.artifact.deployer.ArtifactDeploymentException: Error deploying artifact:
Failed to transfer file: https://repository.apache.org/content/repositories/snapshots/org/apache/myfaces/trinidad/trinidad/1.0.14-SNAPSHOT/trinidad-1.0.14-SNAPSHOT.pom.
Return code is: 401, ReasonPhrase:Unauthorized.
	at hudson.maven.artifact.deployer.DefaultArtifactDeployer.deploy(DefaultArtifactDeployer.java:175)
	at hudson.maven.reporters.MavenArtifactRecord.deploy(MavenArtifactRecord.java:182)
	at hudson.maven.RedeployPublisher.perform(RedeployPublisher.java:158)
	at hudson.tasks.BuildStepMonitor$1.perform(BuildStepMonitor.java:19)
	at hudson.model.AbstractBuild$AbstractRunner.perform(AbstractBuild.java:700)
	at hudson.model.AbstractBuild$AbstractRunner.performAllBuildSteps(AbstractBuild.java:675)
	at hudson.maven.MavenModuleSetBuild$RunnerImpl.post2(MavenModuleSetBuild.java:998)
	at hudson.model.AbstractBuild$AbstractRunner.post(AbstractBuild.java:622)
	at hudson.model.Run.run(Run.java:1434)
	at hudson.maven.MavenModuleSetBuild.run(MavenModuleSetBuild.java:481)
	at hudson.model.ResourceController.execute(ResourceController.java:88)
	at hudson.model.Executor.run(Executor.java:238)
Caused by: org.apache.maven.wagon.TransferFailedException: Failed to transfer file: https://repository.apache.org/content/repositories/snapshots/org/apache/myfaces/trinidad/trinidad/1.0.14-SNAPSHOT/trinidad-1.0.14-SNAPSHOT.pom.
Return code is: 401, ReasonPhrase:Unauthorized.
	at org.apache.maven.wagon.shared.http4.AbstractHttpClientWagon.put(AbstractHttpClientWagon.java:562)
	at org.apache.maven.wagon.shared.http4.AbstractHttpClientWagon.put(AbstractHttpClientWagon.java:471)
	at org.apache.maven.wagon.shared.http4.AbstractHttpClientWagon.put(AbstractHttpClientWagon.java:451)
	at org.apache.maven.repository.legacy.DefaultWagonManager.putRemoteFile(DefaultWagonManager.java:543)
	at org.apache.maven.repository.legacy.DefaultWagonManager.putArtifact(DefaultWagonManager.java:494)
	at hudson.maven.artifact.deployer.DefaultArtifactDeployer.deploy(DefaultArtifactDeployer.java:160)
	... 11 more
[INFO] Deployment failed after 1.7 sec
Build step 'Deploy artifacts to Maven repository' changed build result to FAILURE


Mime
View raw message