myfaces-commits mailing list archives

Site index · List index
Message view « Date » · « Thread »
Top « Date » · « Thread »
From Apache Jenkins Server <jenk...@builds.apache.org>
Subject Build failed in Jenkins: myfaces-trinidad-core-1.0 #608
Date Wed, 01 Feb 2012 23:55:34 GMT
See <https://builds.apache.org/job/myfaces-trinidad-core-1.0/608/>

------------------------------------------
[...truncated 6322 lines...]
[INFO] Installing <https://builds.apache.org/job/myfaces-trinidad-core-1.0/ws/trinidad-examples/trinidad-blank/target/trinidad-blank-1.0.14-SNAPSHOT-sources.jar>
to /home/jenkins/.m2/repository/org/apache/myfaces/trinidad/trinidad-blank/1.0.14-SNAPSHOT/trinidad-blank-1.0.14-SNAPSHOT-sources.jar

[INFO] --- maven-install-plugin:2.3:install (default-install) @ trinidad-blank ---
[INFO] Downloading: https://repository.apache.org/content/repositories/snapshots/org/apache/myfaces/trinidad/trinidad-blank/1.0.14-SNAPSHOT/maven-metadata.xml

[INFO] --- maven-deploy-plugin:2.5:deploy (default-deploy) @ trinidad-blank ---
Downloaded: https://repository.apache.org/content/repositories/snapshots/org/apache/myfaces/trinidad/trinidad-blank/1.0.14-SNAPSHOT/maven-metadata.xml
(1017 B at 0.8 KB/sec)
Uploading: https://repository.apache.org/content/repositories/snapshots/org/apache/myfaces/trinidad/trinidad-blank/1.0.14-SNAPSHOT/trinidad-blank-1.0.14-20120201.235223-825.war
Uploaded: https://repository.apache.org/content/repositories/snapshots/org/apache/myfaces/trinidad/trinidad-blank/1.0.14-SNAPSHOT/trinidad-blank-1.0.14-20120201.235223-825.war
(6657 KB at 1154.9 KB/sec)
Uploading: https://repository.apache.org/content/repositories/snapshots/org/apache/myfaces/trinidad/trinidad-blank/1.0.14-SNAPSHOT/trinidad-blank-1.0.14-20120201.235223-825.pom
Uploaded: https://repository.apache.org/content/repositories/snapshots/org/apache/myfaces/trinidad/trinidad-blank/1.0.14-SNAPSHOT/trinidad-blank-1.0.14-20120201.235223-825.pom
(3 KB at 3.7 KB/sec)
Downloading: https://repository.apache.org/content/repositories/snapshots/org/apache/myfaces/trinidad/trinidad-blank/maven-metadata.xml
Downloaded: https://repository.apache.org/content/repositories/snapshots/org/apache/myfaces/trinidad/trinidad-blank/maven-metadata.xml
(615 B at 0.8 KB/sec)
Uploading: https://repository.apache.org/content/repositories/snapshots/org/apache/myfaces/trinidad/trinidad-blank/1.0.14-SNAPSHOT/maven-metadata.xml
Uploaded: https://repository.apache.org/content/repositories/snapshots/org/apache/myfaces/trinidad/trinidad-blank/1.0.14-SNAPSHOT/maven-metadata.xml
(1017 B at 1.7 KB/sec)
Uploading: https://repository.apache.org/content/repositories/snapshots/org/apache/myfaces/trinidad/trinidad-blank/maven-metadata.xml
Uploaded: https://repository.apache.org/content/repositories/snapshots/org/apache/myfaces/trinidad/trinidad-blank/maven-metadata.xml
(615 B at 1.6 KB/sec)
Uploading: https://repository.apache.org/content/repositories/snapshots/org/apache/myfaces/trinidad/trinidad-blank/1.0.14-SNAPSHOT/trinidad-blank-1.0.14-20120201.235223-825-sources.jar
Uploaded: https://repository.apache.org/content/repositories/snapshots/org/apache/myfaces/trinidad/trinidad-blank/1.0.14-SNAPSHOT/trinidad-blank-1.0.14-20120201.235223-825-sources.jar
(7 KB at 21.3 KB/sec)
Uploading: https://repository.apache.org/content/repositories/snapshots/org/apache/myfaces/trinidad/trinidad-blank/1.0.14-SNAPSHOT/maven-metadata.xml
Uploaded: https://repository.apache.org/content/repositories/snapshots/org/apache/myfaces/trinidad/trinidad-blank/1.0.14-SNAPSHOT/maven-metadata.xml
(1017 B at 4.6 KB/sec)
[JENKINS] Archiving <https://builds.apache.org/job/myfaces-trinidad-core-1.0/ws/trinidad-examples/trinidad-blank/target/trinidad-blank-1.0.14-SNAPSHOT.war>
to /home/hudson/hudson/jobs/myfaces-trinidad-core-1.0/modules/org.apache.myfaces.trinidad$trinidad-blank/builds/2012-02-01_23-44-20/archive/org.apache.myfaces.trinidad/trinidad-blank/1.0.14-20120201.235223-825/trinidad-blank-1.0.14-20120201.235223-825.war
[JENKINS] Archiving <https://builds.apache.org/job/myfaces-trinidad-core-1.0/ws/trinidad-examples/trinidad-blank/target/trinidad-blank-1.0.14-SNAPSHOT-sources.jar>
to /home/hudson/hudson/jobs/myfaces-trinidad-core-1.0/modules/org.apache.myfaces.trinidad$trinidad-blank/builds/2012-02-01_23-44-20/archive/org.apache.myfaces.trinidad/trinidad-blank/1.0.14-20120201.235223-825/trinidad-blank-1.0.14-20120201.235223-825-sources.jar
[INFO] [INFO] Deleting file set: <https://builds.apache.org/job/myfaces-trinidad-core-1.0/ws/trinidad-examples/trinidad-demo/target>
(included: [**], excluded: [])
                                                                        
[INFO] ------------------------------------------------------------------------
[INFO] Building Apache MyFaces Trinidad Demo 1.0.14-SNAPSHOT
[INFO] ------------------------------------------------------------------------
[INFO] 
[INFO] --- maven-clean-plugin:2.3:clean (default-clean) @ trinidad-demo ---
[INFO] 
[INFO] --- maven-xrts-plugin:1.2.6:generate-sources (default) @ trinidad-demo ---
[INFO] 
[INFO] --- maven-remote-resources-plugin:1.0-alpha-6:process (default) @ trinidad-demo ---
[INFO] Using 'UTF-8' encoding to copy filtered resources.
[INFO] [INFO] Copying 0 resource
[INFO] Copying 2 resources

[INFO] --- maven-resources-plugin:2.4.3:resources (default-resources) @ trinidad-demo ---
[INFO] 
[INFO] --- maven-compiler-plugin:2.3.1:compile (default-compile) @ trinidad-demo ---
[INFO] Compiling 85 source files to <https://builds.apache.org/job/myfaces-trinidad-core-1.0/ws/trinidad-examples/trinidad-demo/target/classes>
[INFO] 
[INFO] --- maven-xrts-plugin:1.2.6:generate-test-sources (default) @ trinidad-demo ---
[INFO] [INFO] Using 'UTF-8' encoding to copy filtered resources.
[INFO] skip non existing resourceDirectory <https://builds.apache.org/job/myfaces-trinidad-core-1.0/ws/trinidad-examples/trinidad-demo/src/test/resources>
[INFO] Copying 2 resources

[INFO] --- maven-resources-plugin:2.4.3:testResources (default-testResources) @ trinidad-demo
---
[INFO] 
[INFO] --- maven-compiler-plugin:2.3.1:testCompile (default-testCompile) @ trinidad-demo ---
[INFO] Compiling 5 source files to <https://builds.apache.org/job/myfaces-trinidad-core-1.0/ws/trinidad-examples/trinidad-demo/target/test-classes>
[INFO] [INFO] Surefire report directory: <https://builds.apache.org/job/myfaces-trinidad-core-1.0/ws/trinidad-examples/trinidad-demo/target/surefire-reports>

-------------------------------------------------------
 T E S T S
-------------------------------------------------------
There are no tests to run.

Results :

Tests run: 0, Failures: 0, Errors: 0, Skipped: 0


[INFO] --- maven-surefire-plugin:2.5:test (default-test) @ trinidad-demo ---
[JENKINS] Recording test results
[INFO] Packaging webapp
[INFO] [INFO] Assembling webapp [trinidad-demo] in [<https://builds.apache.org/job/myfaces-trinidad-core-1.0/ws/trinidad-examples/trinidad-demo/target/trinidad-demo-1.0.14-SNAPSHOT]>
[INFO] Processing war project
[INFO] Copying webapp resources [<https://builds.apache.org/job/myfaces-trinidad-core-1.0/ws/trinidad-examples/trinidad-demo/src/main/webapp]>

[INFO] --- maven-war-plugin:2.1.1:war (default-war) @ trinidad-demo ---
[INFO] Webapp assembled in [807 msecs]
[INFO] Building war: <https://builds.apache.org/job/myfaces-trinidad-core-1.0/ws/trinidad-examples/trinidad-demo/target/trinidad-demo-1.0.14-SNAPSHOT.war>
[INFO] WEB-INF/web.xml already added, skipping
[INFO] 
[INFO] --- maven-xrts-plugin:1.2.6:generate-sources (default) @ trinidad-demo ---
[JENKINS] Archiving <https://builds.apache.org/job/myfaces-trinidad-core-1.0/ws/trinidad-examples/trinidad-demo/pom.xml>
to /home/hudson/hudson/jobs/myfaces-trinidad-core-1.0/modules/org.apache.myfaces.trinidad$trinidad-demo/builds/2012-02-01_23-44-20/archive/org.apache.myfaces.trinidad/trinidad-demo/1.0.14-SNAPSHOT/trinidad-demo-1.0.14-SNAPSHOT.pom
[JENKINS] Archiving <https://builds.apache.org/job/myfaces-trinidad-core-1.0/ws/trinidad-examples/trinidad-demo/target/trinidad-demo-1.0.14-SNAPSHOT.war>
to /home/hudson/hudson/jobs/myfaces-trinidad-core-1.0/modules/org.apache.myfaces.trinidad$trinidad-demo/builds/2012-02-01_23-44-20/archive/org.apache.myfaces.trinidad/trinidad-demo/1.0.14-SNAPSHOT/trinidad-demo-1.0.14-SNAPSHOT.war
Feb 1, 2012 11:53:52 PM hudson.maven.ExecutedMojo <init>
WARNING: Failed to getClass for org.apache.maven.plugin.source.SourceJarMojo
[INFO] 
[INFO] --- maven-source-plugin:2.1.2:jar (attach-source) @ trinidad-demo ---
[INFO] META-INF already added, skipping
[INFO] META-INF already added, skipping
[INFO] META-INF/NOTICE already added, skipping
[INFO] META-INF/LICENSE already added, skipping
[INFO] Building jar: <https://builds.apache.org/job/myfaces-trinidad-core-1.0/ws/trinidad-examples/trinidad-demo/target/trinidad-demo-1.0.14-SNAPSHOT-sources.jar>
[INFO] META-INF already added, skipping
[INFO] META-INF already added, skipping
[INFO] META-INF/NOTICE already added, skipping
[INFO] META-INF/LICENSE already added, skipping
[INFO] [INFO] Installing <https://builds.apache.org/job/myfaces-trinidad-core-1.0/ws/trinidad-examples/trinidad-demo/target/trinidad-demo-1.0.14-SNAPSHOT.war>
to /home/jenkins/.m2/repository/org/apache/myfaces/trinidad/trinidad-demo/1.0.14-SNAPSHOT/trinidad-demo-1.0.14-SNAPSHOT.war

[INFO] --- maven-install-plugin:2.3:install (default-install) @ trinidad-demo ---
[INFO] Installing <https://builds.apache.org/job/myfaces-trinidad-core-1.0/ws/trinidad-examples/trinidad-demo/pom.xml>
to /home/jenkins/.m2/repository/org/apache/myfaces/trinidad/trinidad-demo/1.0.14-SNAPSHOT/trinidad-demo-1.0.14-SNAPSHOT.pom
[INFO] Installing <https://builds.apache.org/job/myfaces-trinidad-core-1.0/ws/trinidad-examples/trinidad-demo/target/trinidad-demo-1.0.14-SNAPSHOT-sources.jar>
to /home/jenkins/.m2/repository/org/apache/myfaces/trinidad/trinidad-demo/1.0.14-SNAPSHOT/trinidad-demo-1.0.14-SNAPSHOT-sources.jar
[INFO] 
[INFO] --- maven-xrts-plugin:1.2.6:generate-sources (default) @ trinidad-demo ---
[INFO] 
[INFO] --- maven-remote-resources-plugin:1.0-alpha-6:process (default) @ trinidad-demo ---
[INFO] [INFO] Using 'UTF-8' encoding to copy filtered resources.
[INFO] Copying 0 resource
[INFO] Copying 2 resources
[INFO] Copying 2 resources

[INFO] --- maven-resources-plugin:2.4.3:resources (default-resources) @ trinidad-demo ---
[INFO] 
[INFO] --- maven-compiler-plugin:2.3.1:compile (default-compile) @ trinidad-demo ---
[INFO] Nothing to compile - all classes are up to date
[INFO] 
[INFO] --- maven-xrts-plugin:1.2.6:generate-test-sources (default) @ trinidad-demo ---
[INFO] [INFO] Using 'UTF-8' encoding to copy filtered resources.
[INFO] skip non existing resourceDirectory <https://builds.apache.org/job/myfaces-trinidad-core-1.0/ws/trinidad-examples/trinidad-demo/src/test/resources>
[INFO] Copying 2 resources
[INFO] Copying 2 resources

[INFO] --- maven-resources-plugin:2.4.3:testResources (default-testResources) @ trinidad-demo
---
[INFO] [INFO] Nothing to compile - all classes are up to date

[INFO] --- maven-compiler-plugin:2.3.1:testCompile (default-testCompile) @ trinidad-demo ---
[INFO] [INFO] Surefire report directory: <https://builds.apache.org/job/myfaces-trinidad-core-1.0/ws/trinidad-examples/trinidad-demo/target/surefire-reports>

-------------------------------------------------------
 T E S T S
-------------------------------------------------------
There are no tests to run.

Results :

Tests run: 0, Failures: 0, Errors: 0, Skipped: 0


[INFO] --- maven-surefire-plugin:2.5:test (default-test) @ trinidad-demo ---
[JENKINS] Recording test results
[INFO] [INFO] Packaging webapp
[INFO] Assembling webapp [trinidad-demo] in [<https://builds.apache.org/job/myfaces-trinidad-core-1.0/ws/trinidad-examples/trinidad-demo/target/trinidad-demo-1.0.14-SNAPSHOT]>
[INFO] Processing war project
[INFO] Copying webapp resources [<https://builds.apache.org/job/myfaces-trinidad-core-1.0/ws/trinidad-examples/trinidad-demo/src/main/webapp]>

[INFO] --- maven-war-plugin:2.1.1:war (default-war) @ trinidad-demo ---
[INFO] Webapp assembled in [257 msecs]
[INFO] Building war: <https://builds.apache.org/job/myfaces-trinidad-core-1.0/ws/trinidad-examples/trinidad-demo/target/trinidad-demo-1.0.14-SNAPSHOT.war>
[INFO] WEB-INF/web.xml already added, skipping
[INFO] 
[INFO] --- maven-xrts-plugin:1.2.6:generate-sources (default) @ trinidad-demo ---
[JENKINS] Re-archiving <https://builds.apache.org/job/myfaces-trinidad-core-1.0/ws/trinidad-examples/trinidad-demo/target/trinidad-demo-1.0.14-SNAPSHOT.war>
[JENKINS] Archiving <https://builds.apache.org/job/myfaces-trinidad-core-1.0/ws/trinidad-examples/trinidad-demo/target/trinidad-demo-1.0.14-SNAPSHOT-sources.jar>
to /home/hudson/hudson/jobs/myfaces-trinidad-core-1.0/modules/org.apache.myfaces.trinidad$trinidad-demo/builds/2012-02-01_23-44-20/archive/org.apache.myfaces.trinidad/trinidad-demo/1.0.14-SNAPSHOT/trinidad-demo-1.0.14-SNAPSHOT-sources.jar
Feb 1, 2012 11:54:38 PM hudson.maven.ExecutedMojo <init>
WARNING: Failed to getClass for org.apache.maven.plugin.source.SourceJarMojo
[INFO] 
[INFO] --- maven-source-plugin:2.1.2:jar (attach-source) @ trinidad-demo ---
[INFO] META-INF already added, skipping
[INFO] META-INF/NOTICE already added, skipping
[INFO] META-INF/LICENSE already added, skipping
[INFO] META-INF already added, skipping
[INFO] META-INF already added, skipping
[INFO] META-INF/NOTICE already added, skipping
[INFO] META-INF/LICENSE already added, skipping
[INFO] META-INF already added, skipping
[INFO] META-INF/NOTICE already added, skipping
[INFO] META-INF/LICENSE already added, skipping
[WARNING] Artifact org.apache.myfaces.trinidad:trinidad-demo:java-source:sources:1.0.14-SNAPSHOT
already attached to project, ignoring duplicate
[INFO] [INFO] Installing <https://builds.apache.org/job/myfaces-trinidad-core-1.0/ws/trinidad-examples/trinidad-demo/target/trinidad-demo-1.0.14-SNAPSHOT.war>
to /home/jenkins/.m2/repository/org/apache/myfaces/trinidad/trinidad-demo/1.0.14-SNAPSHOT/trinidad-demo-1.0.14-SNAPSHOT.war
[INFO] Installing <https://builds.apache.org/job/myfaces-trinidad-core-1.0/ws/trinidad-examples/trinidad-demo/pom.xml>
to /home/jenkins/.m2/repository/org/apache/myfaces/trinidad/trinidad-demo/1.0.14-SNAPSHOT/trinidad-demo-1.0.14-SNAPSHOT.pom
[INFO] Installing <https://builds.apache.org/job/myfaces-trinidad-core-1.0/ws/trinidad-examples/trinidad-demo/target/trinidad-demo-1.0.14-SNAPSHOT-sources.jar>
to /home/jenkins/.m2/repository/org/apache/myfaces/trinidad/trinidad-demo/1.0.14-SNAPSHOT/trinidad-demo-1.0.14-SNAPSHOT-sources.jar

[INFO] --- maven-install-plugin:2.3:install (default-install) @ trinidad-demo ---
[INFO] Downloading: https://repository.apache.org/content/repositories/snapshots/org/apache/myfaces/trinidad/trinidad-demo/1.0.14-SNAPSHOT/maven-metadata.xml

[INFO] --- maven-deploy-plugin:2.5:deploy (default-deploy) @ trinidad-demo ---
Downloaded: https://repository.apache.org/content/repositories/snapshots/org/apache/myfaces/trinidad/trinidad-demo/1.0.14-SNAPSHOT/maven-metadata.xml
(1016 B at 0.5 KB/sec)
Uploading: https://repository.apache.org/content/repositories/snapshots/org/apache/myfaces/trinidad/trinidad-demo/1.0.14-SNAPSHOT/trinidad-demo-1.0.14-20120201.235443-815.war
Uploaded: https://repository.apache.org/content/repositories/snapshots/org/apache/myfaces/trinidad/trinidad-demo/1.0.14-SNAPSHOT/trinidad-demo-1.0.14-20120201.235443-815.war
(7934 KB at 1197.9 KB/sec)
Uploading: https://repository.apache.org/content/repositories/snapshots/org/apache/myfaces/trinidad/trinidad-demo/1.0.14-SNAPSHOT/trinidad-demo-1.0.14-20120201.235443-815.pom
Uploaded: https://repository.apache.org/content/repositories/snapshots/org/apache/myfaces/trinidad/trinidad-demo/1.0.14-SNAPSHOT/trinidad-demo-1.0.14-20120201.235443-815.pom
(3 KB at 6.8 KB/sec)
Downloading: https://repository.apache.org/content/repositories/snapshots/org/apache/myfaces/trinidad/trinidad-demo/maven-metadata.xml
Downloaded: https://repository.apache.org/content/repositories/snapshots/org/apache/myfaces/trinidad/trinidad-demo/maven-metadata.xml
(7 KB at 42.4 KB/sec)
Uploading: https://repository.apache.org/content/repositories/snapshots/org/apache/myfaces/trinidad/trinidad-demo/1.0.14-SNAPSHOT/maven-metadata.xml
Uploaded: https://repository.apache.org/content/repositories/snapshots/org/apache/myfaces/trinidad/trinidad-demo/1.0.14-SNAPSHOT/maven-metadata.xml
(1016 B at 3.6 KB/sec)
Uploading: https://repository.apache.org/content/repositories/snapshots/org/apache/myfaces/trinidad/trinidad-demo/maven-metadata.xml
Uploaded: https://repository.apache.org/content/repositories/snapshots/org/apache/myfaces/trinidad/trinidad-demo/maven-metadata.xml
(7 KB at 33.8 KB/sec)
Uploading: https://repository.apache.org/content/repositories/snapshots/org/apache/myfaces/trinidad/trinidad-demo/1.0.14-SNAPSHOT/trinidad-demo-1.0.14-20120201.235443-815-sources.jar
Uploaded: https://repository.apache.org/content/repositories/snapshots/org/apache/myfaces/trinidad/trinidad-demo/1.0.14-SNAPSHOT/trinidad-demo-1.0.14-20120201.235443-815-sources.jar
(133 KB at 460.7 KB/sec)
Uploading: https://repository.apache.org/content/repositories/snapshots/org/apache/myfaces/trinidad/trinidad-demo/1.0.14-SNAPSHOT/maven-metadata.xml
Uploaded: https://repository.apache.org/content/repositories/snapshots/org/apache/myfaces/trinidad/trinidad-demo/1.0.14-SNAPSHOT/maven-metadata.xml
(1016 B at 2.2 KB/sec)
[JENKINS] Archiving <https://builds.apache.org/job/myfaces-trinidad-core-1.0/ws/trinidad-examples/trinidad-demo/target/trinidad-demo-1.0.14-SNAPSHOT.war>
to /home/hudson/hudson/jobs/myfaces-trinidad-core-1.0/modules/org.apache.myfaces.trinidad$trinidad-demo/builds/2012-02-01_23-44-20/archive/org.apache.myfaces.trinidad/trinidad-demo/1.0.14-20120201.235443-815/trinidad-demo-1.0.14-20120201.235443-815.war
[JENKINS] Archiving <https://builds.apache.org/job/myfaces-trinidad-core-1.0/ws/trinidad-examples/trinidad-demo/target/trinidad-demo-1.0.14-SNAPSHOT-sources.jar>
to /home/hudson/hudson/jobs/myfaces-trinidad-core-1.0/modules/org.apache.myfaces.trinidad$trinidad-demo/builds/2012-02-01_23-44-20/archive/org.apache.myfaces.trinidad/trinidad-demo/1.0.14-20120201.235443-815/trinidad-demo-1.0.14-20120201.235443-815-sources.jar
[INFO] ------------------------------------------------------------------------
[INFO] Reactor Summary:
[INFO] 
[INFO] Apache MyFaces Trinidad ........................... SUCCESS [43.145s]
[INFO] Apache MyFaces Trinidad Build ..................... SUCCESS [24.941s]
[INFO] Apache MyFaces Trinidad API ....................... SUCCESS [1:12.288s]
[INFO] Apache MyFaces Trinidad Impl ...................... SUCCESS [3:01.013s]
[INFO] Apache MyFaces Trinidad Examples .................. SUCCESS [5.680s]
[INFO] Apache MyFaces Trinidad Blank Demo ................ SUCCESS [1:27.408s]
[INFO] Apache MyFaces Trinidad Demo ...................... SUCCESS [1:45.760s]
[INFO] ------------------------------------------------------------------------
[INFO] BUILD SUCCESS
[INFO] ------------------------------------------------------------------------
[INFO] Total time: 11:01.262s
[INFO] Finished at: Wed Feb 01 23:55:32 UTC 2012
[INFO] Final Memory: 51M/387M
[INFO] ------------------------------------------------------------------------
channel stopped
Maven RedeployPublished use remote ubuntu5 maven settings from : /home/jenkins/.m2/settings.xml
[ERROR] uniqueVersion == false is not anymore supported in maven 3
[INFO] Deployment in https://repository.apache.org/content/repositories/snapshots (id=,uniqueVersion=false)
Deploying the main artifact trinidad-1.0.14-SNAPSHOT.pom
Downloading: https://repository.apache.org/content/repositories/snapshots/org/apache/myfaces/trinidad/trinidad/1.0.14-SNAPSHOT/maven-metadata.xml
Downloaded: https://repository.apache.org/content/repositories/snapshots/org/apache/myfaces/trinidad/trinidad/1.0.14-SNAPSHOT/maven-metadata.xml
(618 B at 0.7 KB/sec)
Uploading: https://repository.apache.org/content/repositories/snapshots/org/apache/myfaces/trinidad/trinidad/1.0.14-SNAPSHOT/trinidad-1.0.14-20120201.235534-878.pom
Uploading: https://repository.apache.org/content/repositories/snapshots/org/apache/myfaces/trinidad/trinidad/1.0.14-SNAPSHOT/trinidad-1.0.14-20120201.235534-878.pom
ERROR: Failed to deploy artifacts: Could not transfer artifact org.apache.myfaces.trinidad:trinidad:pom:1.0.14-20120201.235534-878
from/to  (https://repository.apache.org/content/repositories/snapshots): Failed to transfer
file: https://repository.apache.org/content/repositories/snapshots/org/apache/myfaces/trinidad/trinidad/1.0.14-SNAPSHOT/trinidad-1.0.14-20120201.235534-878.pom.
Return code is: 401, ReasonPhrase:Unauthorized.
org.apache.maven.artifact.deployer.ArtifactDeploymentException: Failed to deploy artifacts:
Could not transfer artifact org.apache.myfaces.trinidad:trinidad:pom:1.0.14-20120201.235534-878
from/to  (https://repository.apache.org/content/repositories/snapshots): Failed to transfer
file: https://repository.apache.org/content/repositories/snapshots/org/apache/myfaces/trinidad/trinidad/1.0.14-SNAPSHOT/trinidad-1.0.14-20120201.235534-878.pom.
Return code is: 401, ReasonPhrase:Unauthorized.
	at org.apache.maven.artifact.deployer.DefaultArtifactDeployer.deploy(DefaultArtifactDeployer.java:141)
	at hudson.maven.reporters.MavenArtifactRecord.deploy(MavenArtifactRecord.java:182)
	at hudson.maven.RedeployPublisher.perform(RedeployPublisher.java:158)
	at hudson.tasks.BuildStepMonitor$1.perform(BuildStepMonitor.java:19)
	at hudson.model.AbstractBuild$AbstractRunner.perform(AbstractBuild.java:697)
	at hudson.model.AbstractBuild$AbstractRunner.performAllBuildSteps(AbstractBuild.java:672)
	at hudson.maven.MavenModuleSetBuild$RunnerImpl.post2(MavenModuleSetBuild.java:997)
	at hudson.model.AbstractBuild$AbstractRunner.post(AbstractBuild.java:619)
	at hudson.model.Run.run(Run.java:1429)
	at hudson.maven.MavenModuleSetBuild.run(MavenModuleSetBuild.java:481)
	at hudson.model.ResourceController.execute(ResourceController.java:88)
	at hudson.model.Executor.run(Executor.java:238)
Caused by: org.sonatype.aether.deployment.DeploymentException: Failed to deploy artifacts:
Could not transfer artifact org.apache.myfaces.trinidad:trinidad:pom:1.0.14-20120201.235534-878
from/to  (https://repository.apache.org/content/repositories/snapshots): Failed to transfer
file: https://repository.apache.org/content/repositories/snapshots/org/apache/myfaces/trinidad/trinidad/1.0.14-SNAPSHOT/trinidad-1.0.14-20120201.235534-878.pom.
Return code is: 401, ReasonPhrase:Unauthorized.
	at org.sonatype.aether.impl.internal.DefaultDeployer.deploy(DefaultDeployer.java:280)
	at org.sonatype.aether.impl.internal.DefaultDeployer.deploy(DefaultDeployer.java:211)
	at org.sonatype.aether.impl.internal.DefaultRepositorySystem.deploy(DefaultRepositorySystem.java:443)
	at org.apache.maven.artifact.deployer.DefaultArtifactDeployer.deploy(DefaultArtifactDeployer.java:137)
	... 11 more
Caused by: org.sonatype.aether.transfer.ArtifactTransferException: Could not transfer artifact
org.apache.myfaces.trinidad:trinidad:pom:1.0.14-20120201.235534-878 from/to  (https://repository.apache.org/content/repositories/snapshots):
Failed to transfer file: https://repository.apache.org/content/repositories/snapshots/org/apache/myfaces/trinidad/trinidad/1.0.14-SNAPSHOT/trinidad-1.0.14-20120201.235534-878.pom.
Return code is: 401, ReasonPhrase:Unauthorized.
	at org.sonatype.aether.connector.wagon.WagonRepositoryConnector$4.wrap(WagonRepositoryConnector.java:950)
	at org.sonatype.aether.connector.wagon.WagonRepositoryConnector$4.wrap(WagonRepositoryConnector.java:940)
	at org.sonatype.aether.connector.wagon.WagonRepositoryConnector$PutTask.run(WagonRepositoryConnector.java:837)
	at org.sonatype.aether.connector.wagon.WagonRepositoryConnector.put(WagonRepositoryConnector.java:467)
	at org.sonatype.aether.impl.internal.DefaultDeployer.deploy(DefaultDeployer.java:274)
	... 14 more
Caused by: org.apache.maven.wagon.TransferFailedException: Failed to transfer file: https://repository.apache.org/content/repositories/snapshots/org/apache/myfaces/trinidad/trinidad/1.0.14-SNAPSHOT/trinidad-1.0.14-20120201.235534-878.pom.
Return code is: 401, ReasonPhrase:Unauthorized.
	at org.apache.maven.wagon.shared.http4.AbstractHttpClientWagon.put(AbstractHttpClientWagon.java:562)
	at org.apache.maven.wagon.shared.http4.AbstractHttpClientWagon.put(AbstractHttpClientWagon.java:471)
	at org.apache.maven.wagon.shared.http4.AbstractHttpClientWagon.put(AbstractHttpClientWagon.java:451)
	at org.sonatype.aether.connector.wagon.WagonRepositoryConnector$PutTask.run(WagonRepositoryConnector.java:811)
	... 16 more
[INFO] Deployment failed after 1.3 sec
Build step 'Deploy artifacts to Maven repository' changed build result to FAILURE


Mime
View raw message