myfaces-commits mailing list archives

Site index · List index
Message view « Date » · « Thread »
Top « Date » · « Thread »
From Apache Jenkins Server <jenk...@builds.apache.org>
Subject Build failed in Jenkins: tobago-trunk #573
Date Fri, 17 Feb 2012 21:47:16 GMT
See <https://builds.apache.org/job/tobago-trunk/573/changes>

Changes:

[lofwyr] update version information

------------------------------------------
[...truncated 14480 lines...]
[WARNING] Note: Some input files use or override a deprecated API.
[WARNING] Note: Recompile with -Xlint:deprecation for details.
[WARNING] 1 warning
[debug] execute contextualize
[INFO] [resources:resources {execution: copy-tld}]
[INFO] Using 'UTF-8' encoding to copy filtered resources.
[INFO] skip non existing resourceDirectory <https://builds.apache.org/job/tobago-trunk/ws/tobago-trunk/tobago-extension/tobago-taglib-extension/src/main/resources>
[INFO] Copying 3 resources
[INFO] Copying 1 resource to META-INF
[INFO] Copying 1 resource to META-INF
[debug] execute contextualize
[INFO] [resources:testResources {execution: default-testResources}]
[INFO] Using 'UTF-8' encoding to copy filtered resources.
[INFO] skip non existing resourceDirectory <https://builds.apache.org/job/tobago-trunk/ws/tobago-trunk/tobago-extension/tobago-taglib-extension/src/test/resources>
[INFO] Copying 3 resources
[INFO] [compiler:testCompile {execution: default-testCompile}]
[INFO] No sources to compile
[INFO] [surefire:test {execution: default-test}]
[INFO] Surefire report directory: <https://builds.apache.org/job/tobago-trunk/ws/tobago-trunk/tobago-extension/tobago-taglib-extension/target/surefire-reports>

-------------------------------------------------------
 T E S T S
-------------------------------------------------------

Results :

Tests run: 0, Failures: 0, Errors: 0, Skipped: 0

[INFO] [jar:jar {execution: default-jar}]
[INFO] Building jar: <https://builds.apache.org/job/tobago-trunk/ws/tobago-trunk/tobago-extension/tobago-taglib-extension/target/tobago-taglib-extension-1.5.4-SNAPSHOT.jar>
[INFO] [install:install {execution: default-install}]
[INFO] Installing <https://builds.apache.org/job/tobago-trunk/ws/tobago-trunk/tobago-extension/tobago-taglib-extension/target/tobago-taglib-extension-1.5.4-SNAPSHOT.jar>
to /export/home/hudson/.m2/repository/org/apache/myfaces/tobago/tobago-taglib-extension/1.5.4-SNAPSHOT/tobago-taglib-extension-1.5.4-SNAPSHOT.jar
[JENKINS] Archiving <https://builds.apache.org/job/tobago-trunk/ws/tobago-trunk/tobago-theme/pom.xml>
to /home/hudson/hudson/jobs/tobago-trunk/modules/org.apache.myfaces.tobago$tobago-theme/builds/2012-02-17_19-13-18/archive/org.apache.myfaces.tobago/tobago-theme/1.5.4-SNAPSHOT/tobago-theme-1.5.4-SNAPSHOT.pom
[INFO] ------------------------------------------------------------------------
[INFO] Building Tobago Themes
[INFO]    task-segment: [clean, animal-sniffer:check, checkstyle:check, install]
[INFO] ------------------------------------------------------------------------
[JENKINS] Recording test results[INFO] [clean:clean {execution: default-clean}]

[INFO] [animal-sniffer:check {execution: default-cli}]
[INFO] Checking unresolved references to org.codehaus.mojo.signature:java15:1.0
[INFO] [checkstyle:check {execution: default-cli}]
[INFO] 
[INFO] [enforcer:enforce {execution: enforce}]
[INFO] [remote-resources:process {execution: default}]
[INFO] [build-helper:add-source {execution: default}]
[INFO] Source directory: <https://builds.apache.org/job/tobago-trunk/ws/tobago-trunk/tobago-theme/src/main/java-jsf-1.2>
added.
[INFO] [site:attach-descriptor {execution: default-attach-descriptor}]
[INFO] [install:install {execution: default-install}]
[INFO] Installing <https://builds.apache.org/job/tobago-trunk/ws/tobago-trunk/tobago-theme/pom.xml>
to /export/home/hudson/.m2/repository/org/apache/myfaces/tobago/tobago-theme/1.5.4-SNAPSHOT/tobago-theme-1.5.4-SNAPSHOT.pom
[JENKINS] Archiving <https://builds.apache.org/job/tobago-trunk/ws/tobago-trunk/tobago-theme/tobago-theme-standard/pom.xml>
to /home/hudson/hudson/jobs/tobago-trunk/modules/org.apache.myfaces.tobago$tobago-theme-standard/builds/2012-02-17_19-13-18/archive/org.apache.myfaces.tobago/tobago-theme-standard/1.5.4-SNAPSHOT/tobago-theme-standard-1.5.4-SNAPSHOT.pom
[JENKINS] Archiving <https://builds.apache.org/job/tobago-trunk/ws/tobago-trunk/tobago-theme/tobago-theme-standard/target/tobago-theme-standard-1.5.4-SNAPSHOT.jar>
to /home/hudson/hudson/jobs/tobago-trunk/modules/org.apache.myfaces.tobago$tobago-theme-standard/builds/2012-02-17_19-13-18/archive/org.apache.myfaces.tobago/tobago-theme-standard/1.5.4-SNAPSHOT/tobago-theme-standard-1.5.4-SNAPSHOT.jar
[INFO] ------------------------------------------------------------------------
[INFO] Building Tobago Theme Standard
[INFO]    task-segment: [clean, animal-sniffer:check, checkstyle:check, install]
[INFO] ------------------------------------------------------------------------
[INFO] [clean:clean {execution: default-clean}]
[INFO] [animal-sniffer:check {execution: default-cli}]
[INFO] Checking unresolved references to org.codehaus.mojo.signature:java15:1.0
[INFO] [checkstyle:check {execution: default-cli}]
[INFO] 
[INFO] [enforcer:enforce {execution: enforce}]
[INFO] [remote-resources:process {execution: default}]
[debug] execute contextualize
[INFO] [resources:resources {execution: default-resources}]
[INFO] Using 'UTF-8' encoding to copy filtered resources.
[INFO] Copying 18 resources
[INFO] Copying 3 resources
[INFO] [build-helper:add-source {execution: default}]
[INFO] Source directory: <https://builds.apache.org/job/tobago-trunk/ws/tobago-trunk/tobago-theme/tobago-theme-standard/src/main/java-jsf-1.2>
added.
[INFO] [yuicompressor:compress {execution: default}]
[INFO] nb warnings: 0, nb errors: 0
[INFO] [compiler:compile {execution: default-compile}]
[INFO] Compiling 9 source files to <https://builds.apache.org/job/tobago-trunk/ws/tobago-trunk/tobago-theme/tobago-theme-standard/target/classes>
[INFO] [antrun:run {execution: strip-javascript}]
[INFO] Executing tasks

main:
[INFO] Executed tasks
[INFO] [exec:exec {execution: compress-standard}]
[INFO] <https://builds.apache.org/job/tobago-trunk/ws/tobago-trunk/tobago-theme/tobago-theme-standard/target/javascript-min/standard/script/tobago.min.js>:1026:
WARNING - Suspicious code. This code lacks side-effects. Is there a bug?
[INFO]     } else if (this.focusId.length > 0) {
[INFO]            ^
[INFO] 
[INFO] <https://builds.apache.org/job/tobago-trunk/ws/tobago-trunk/tobago-theme/tobago-theme-standard/target/javascript-min/standard/script/tobago.min.js>:1818:
WARNING - Suspicious code. This code lacks side-effects. Is there a bug?
[INFO]         new XMLHttpRequest();
[INFO]                           ^
[INFO] 
[INFO] 0 error(s), 2 warning(s)
[INFO] [exec:exec {execution: compress-msie_6_0}]
[debug] execute contextualize
[INFO] [resources:testResources {execution: default-testResources}]
[INFO] Using 'UTF-8' encoding to copy filtered resources.
[INFO] skip non existing resourceDirectory <https://builds.apache.org/job/tobago-trunk/ws/tobago-trunk/tobago-theme/tobago-theme-standard/src/test/resources>
[INFO] Copying 3 resources
[INFO] [compiler:testCompile {execution: default-testCompile}]
[INFO] Compiling 2 source files to <https://builds.apache.org/job/tobago-trunk/ws/tobago-trunk/tobago-theme/tobago-theme-standard/target/test-classes>
[INFO] [surefire:test {execution: default-test}]
[INFO] Surefire report directory: <https://builds.apache.org/job/tobago-trunk/ws/tobago-trunk/tobago-theme/tobago-theme-standard/target/surefire-reports>

-------------------------------------------------------
 T E S T S
-------------------------------------------------------
Running org.apache.myfaces.tobago.renderkit.util.JQueryUtilsUnitTest
Tests run: 4, Failures: 0, Errors: 0, Skipped: 0, Time elapsed: 0.05 sec
Running org.apache.myfaces.tobago.renderkit.html.util.HtmlRendererUtilsUnitTest
Tests run: 8, Failures: 0, Errors: 0, Skipped: 0, Time elapsed: 0.364 sec

Results :

Tests run: 12, Failures: 0, Errors: 0, Skipped: 0

[INFO] [jar:jar {execution: default-jar}]
[INFO] Building jar: <https://builds.apache.org/job/tobago-trunk/ws/tobago-trunk/tobago-theme/tobago-theme-standard/target/tobago-theme-standard-1.5.4-SNAPSHOT.jar>
[INFO] [install:install {execution: default-install}]
[INFO] Installing <https://builds.apache.org/job/tobago-trunk/ws/tobago-trunk/tobago-theme/tobago-theme-standard/target/tobago-theme-standard-1.5.4-SNAPSHOT.jar>
to /export/home/hudson/.m2/repository/org/apache/myfaces/tobago/tobago-theme-standard/1.5.4-SNAPSHOT/tobago-theme-standard-1.5.4-SNAPSHOT.jar
[JENKINS] Recording test results
[JENKINS] Archiving <https://builds.apache.org/job/tobago-trunk/ws/tobago-trunk/tobago-theme/tobago-theme-scarborough/pom.xml>
to /home/hudson/hudson/jobs/tobago-trunk/modules/org.apache.myfaces.tobago$tobago-theme-scarborough/builds/2012-02-17_19-13-18/archive/org.apache.myfaces.tobago/tobago-theme-scarborough/1.5.4-SNAPSHOT/tobago-theme-scarborough-1.5.4-SNAPSHOT.pom
[JENKINS] Archiving <https://builds.apache.org/job/tobago-trunk/ws/tobago-trunk/tobago-theme/tobago-theme-scarborough/target/tobago-theme-scarborough-1.5.4-SNAPSHOT.jar>
to /home/hudson/hudson/jobs/tobago-trunk/modules/org.apache.myfaces.tobago$tobago-theme-scarborough/builds/2012-02-17_19-13-18/archive/org.apache.myfaces.tobago/tobago-theme-scarborough/1.5.4-SNAPSHOT/tobago-theme-scarborough-1.5.4-SNAPSHOT.jar
Build timed out (after 150 minutes). Marking the build as failed.
[INFO] ------------------------------------------------------------------------
[INFO] Building Tobago Theme Scarborough
[INFO]    task-segment: [clean, animal-sniffer:check, checkstyle:check, install]
[INFO] ------------------------------------------------------------------------
[INFO] [clean:clean {execution: default-clean}]
[INFO] [animal-sniffer:check {execution: default-cli}]
[INFO] Checking unresolved references to org.codehaus.mojo.signature:java15:1.0
[INFO] [checkstyle:check {execution: default-cli}]
[INFO] 
[INFO] [enforcer:enforce {execution: enforce}]
[INFO] [remote-resources:process {execution: default}]
[debug] execute contextualize
[INFO] [resources:resources {execution: default-resources}]
[INFO] Using 'UTF-8' encoding to copy filtered resources.
[INFO] Copying 110 resources
[INFO] Copying 3 resources
[INFO] [build-helper:add-source {execution: default}]
[INFO] Source directory: <https://builds.apache.org/job/tobago-trunk/ws/tobago-trunk/tobago-theme/tobago-theme-scarborough/src/main/java-jsf-1.2>
added.
[INFO] [yuicompressor:compress {execution: default}]
[INFO] style.css (1813b) -> style.min.css (494b)[27%]
[INFO] style.css (1043b) -> style.min.css (95b)[9%]
[INFO] style.css (973b) -> style.min.css (95b)[9%]
[INFO] style.css (29573b) -> style.min.css (19951b)[67%]
[INFO] style.css (1050b) -> style.min.css (61b)[5%]
[INFO] style.css (1046b) -> style.min.css (30b)[2%]
[INFO] style.css (1340b) -> style.min.css (115b)[8%]
[INFO] style.css (1929b) -> style.min.css (589b)[30%]
[INFO] style.css (1529b) -> style.min.css (309b)[20%]
[INFO] total input (40296b) -> output (21739b)[53%]
[INFO] nb warnings: 0, nb errors: 0
[INFO] [compiler:compile {execution: default-compile}]
[INFO] Compiling 70 source files to <https://builds.apache.org/job/tobago-trunk/ws/tobago-trunk/tobago-theme/tobago-theme-scarborough/target/classes>
[INFO] [antrun:run {execution: strip-javascript}]
[INFO] Executing tasks

main:
[INFO] Executed tasks
[INFO] [exec:exec {execution: compress-standard}]
[debug] execute contextualize
[INFO] [resources:testResources {execution: default-testResources}]
[INFO] Using 'UTF-8' encoding to copy filtered resources.
[INFO] skip non existing resourceDirectory <https://builds.apache.org/job/tobago-trunk/ws/tobago-trunk/tobago-theme/tobago-theme-scarborough/src/test/resources>
[INFO] Copying 3 resources
[INFO] [compiler:testCompile {execution: default-testCompile}]
[INFO] Compiling 4 source files to <https://builds.apache.org/job/tobago-trunk/ws/tobago-trunk/tobago-theme/tobago-theme-scarborough/target/test-classes>
[INFO] [surefire:test {execution: default-test}]
[INFO] Surefire report directory: <https://builds.apache.org/job/tobago-trunk/ws/tobago-trunk/tobago-theme/tobago-theme-scarborough/target/surefire-reports>

-------------------------------------------------------
 T E S T S
-------------------------------------------------------
Running org.apache.myfaces.tobago.renderkit.html.scarborough.standard.tag.TreeNodeRendererUnitTest
Tests run: 1, Failures: 0, Errors: 0, Skipped: 0, Time elapsed: 0.225 sec

Results :

Tests run: 1, Failures: 0, Errors: 0, Skipped: 0

[INFO] [jar:jar {execution: default-jar}]
[INFO] Building jar: <https://builds.apache.org/job/tobago-trunk/ws/tobago-trunk/tobago-theme/tobago-theme-scarborough/target/tobago-theme-scarborough-1.5.4-SNAPSHOT.jar>
[INFO] [install:install {execution: default-install}]
[INFO] Installing <https://builds.apache.org/job/tobago-trunk/ws/tobago-trunk/tobago-theme/tobago-theme-scarborough/target/tobago-theme-scarborough-1.5.4-SNAPSHOT.jar>
to /export/home/hudson/.m2/repository/org/apache/myfaces/tobago/tobago-theme-scarborough/1.5.4-SNAPSHOT/tobago-theme-scarborough-1.5.4-SNAPSHOT.jar
[INFO] ------------------------------------------------------------------------
[ERROR] FATAL ERROR
[INFO] ------------------------------------------------------------------------
channel stopped
[INFO] hudson.remoting.RequestAbortedException: hudson.remoting.Channel$OrderlyShutdown
[INFO] ------------------------------------------------------------------------
[INFO] Trace
hudson.remoting.RequestAbortedException: hudson.remoting.RequestAbortedException: hudson.remoting.Channel$OrderlyShutdown
	at hudson.remoting.Request.call(Request.java:149)
	at hudson.remoting.Channel.call(Channel.java:681)
	at hudson.remoting.RemoteInvocationHandler.invoke(RemoteInvocationHandler.java:158)
	at $Proxy2.isArchivingDisabled(Unknown Source)
	at hudson.maven.MavenBuildProxy$Filter.isArchivingDisabled(MavenBuildProxy.java:227)
	at hudson.maven.reporters.MavenArtifact.archive(MavenArtifact.java:216)
	at hudson.maven.reporters.MavenArtifactArchiver.postBuild(MavenArtifactArchiver.java:106)
	at hudson.maven.Maven2Builder.postModule(Maven2Builder.java:127)
	at hudson.maven.MavenBuilder$Adapter.fireLeaveModule(MavenBuilder.java:327)
	at hudson.maven.MavenBuilder$Adapter.postBuild(MavenBuilder.java:285)
	at org.apache.maven.lifecycle.LifecycleExecutorInterceptor.execute(LifecycleExecutorInterceptor.java:68)
	at org.apache.maven.DefaultMaven.doExecute(DefaultMaven.java:328)
	at org.apache.maven.DefaultMaven.execute(DefaultMaven.java:138)
	at org.apache.maven.cli.MavenCli.main(MavenCli.java:362)
	at sun.reflect.NativeMethodAccessorImpl.invoke0(Native Method)
	at sun.reflect.NativeMethodAccessorImpl.invoke(NativeMethodAccessorImpl.java:39)
	at sun.reflect.DelegatingMethodAccessorImpl.invoke(DelegatingMethodAccessorImpl.java:25)
	at java.lang.reflect.Method.invoke(Method.java:597)
	at org.codehaus.classworlds.Launcher.launchEnhanced(Launcher.java:315)
	at org.codehaus.classworlds.Launcher.launch(Launcher.java:255)
	at hudson.maven.agent.Main.launch(Main.java:185)
	at hudson.maven.MavenBuilder.call(MavenBuilder.java:151)
	at hudson.maven.Maven2Builder.call(Maven2Builder.java:77)
	at hudson.maven.Maven2Builder.call(Maven2Builder.java:53)
	at hudson.remoting.UserRequest.perform(UserRequest.java:118)
	at hudson.remoting.UserRequest.perform(UserRequest.java:48)
	at hudson.remoting.Request$2.run(Request.java:287)
	at hudson.remoting.InterceptingExecutorService$1.call(InterceptingExecutorService.java:72)
	at java.util.concurrent.FutureTask$Sync.innerRun(FutureTask.java:303)
	at java.util.concurrent.FutureTask.run(FutureTask.java:138)
	at java.util.concurrent.ThreadPoolExecutor$Worker.runTask(ThreadPoolExecutor.java:886)
	at java.util.concurrent.ThreadPoolExecutor$Worker.run(ThreadPoolExecutor.java:908)
	at java.lang.Thread.run(Thread.java:662)
Caused by: hudson.remoting.RequestAbortedException: hudson.remoting.Channel$OrderlyShutdown
	at hudson.remoting.Request.abort(Request.java:273)
	at hudson.remoting.Channel.terminate(Channel.java:732)
	at hudson.remoting.Channel$CloseCommand.execute(Channel.java:848)
	at hudson.remoting.Channel$ReaderThread.run(Channel.java:1146)
Caused by: hudson.remoting.Channel$OrderlyShutdown
	... 2 more
Caused by: Command close created at
	at hudson.remoting.Command.<init>(Command.java:51)
	at hudson.remoting.Channel$CloseCommand.<init>(Channel.java:842)
	at hudson.remoting.Channel$CloseCommand.<init>(Channel.java:840)
	at hudson.remoting.Channel.close(Channel.java:907)
	at hudson.remoting.Channel.close(Channel.java:890)
	at hudson.slaves.Channels$1.close(Channels.java:91)
	at hudson.maven.ProcessCache$MavenProcess.discard(ProcessCache.java:145)
	at hudson.maven.MavenModuleSetBuild$RunnerImpl.doRun(MavenModuleSetBuild.java:800)
	at hudson.model.AbstractBuild$AbstractRunner.run(AbstractBuild.java:470)
	at hudson.model.Run.run(Run.java:1409)
	at hudson.maven.MavenModuleSetBuild.run(MavenModuleSetBuild.java:481)
	at hudson.model.ResourceController.execute(ResourceController.java:88)
	at hudson.model.Executor.run(Executor.java:238)
[INFO] ------------------------------------------------------------------------
[INFO] Total time: 114 minutes 24 seconds
[INFO] Finished at: Fri Feb 17 21:43:15 GMT+00:00 2012
[INFO] Final Memory: 119M/448M
[INFO] ------------------------------------------------------------------------


Mime
View raw message